{"text_format":"1","workbook":"xlsx","n_sheets":5,"sheets":["Poule","Finale's","GROEP-1","GROEP-2","GROEP-3"],"not_rendered":{"charts":0,"images":4,"macros":1,"external_links":0,"defined_names":0,"comments":0,"pivot_tables":0},"unopened":[],"bounds":{"document_bytes":16777216,"sheet_cells":100000,"rows_first":2000,"rows_last":500,"rows_between":2000,"halvings":0,"cell_chars":16384,"cell_head_chars":4096},"cells_cut":0,"cells_raw":0,"read":"whole","date_system":"1900"}

{"sheet":"Poule","index":0,"n_rows":35,"n_cols":75,"rows_kept":35,"cut":false,"hidden":false,"merged":[[11,48,11,50],[8,30,8,35],[12,27,12,28],[17,30,17,35],[17,37,17,42],[9,15,9,21],[18,27,18,28],[18,30,18,35],[18,37,18,42],[13,27,13,28],[24,23,24,25],[16,30,16,35],[15,30,15,35],[14,30,14,35],[14,37,14,42],[13,37,13,42],[12,37,12,42],[11,44,11,46],[19,27,19,28],[19,30,19,35],[19,37,19,42],[20,27,20,28],[20,30,20,35],[20,37,20,42],[21,27,21,28],[21,30,21,35],[21,37,21,42],[0,0,1,49],[5,1,5,6],[6,1,6,6],[7,1,7,6],[4,1,4,6],[2,0,4,0],[2,12,4,12],[2,11,4,11],[2,10,4,10],[2,27,4,27],[2,14,4,14],[2,29,4,29],[4,15,4,21],[4,30,4,35],[6,30,6,35],[2,13,4,13],[2,25,4,25],[7,15,7,21],[7,30,7,35],[17,27,17,28],[14,2,14,3],[14,12,14,17],[24,5,24,17],[24,19,24,21],[16,2,16,3],[17,12,17,17],[30,2,30,3],[25,5,25,10],[30,5,30,10],[30,12,30,17],[25,12,25,17],[25,2,25,3],[15,12,15,17],[15,2,15,3],[24,2,24,3],[17,2,17,3],[17,5,17,10],[16,5,16,10],[15,5,15,10],[9,30,9,35],[16,37,16,42],[11,23,11,25],[15,37,15,42],[11,27,11,28],[8,1,8,6],[11,2,11,3],[11,5,11,17],[12,2,12,3],[13,2,13,3],[14,5,14,10],[16,12,16,17],[14,27,14,28],[15,27,15,28],[16,27,16,28],[13,5,13,10],[12,5,12,10],[13,12,13,17],[12,12,12,17],[13,30,13,35],[12,30,12,35],[11,19,11,21],[8,15,8,21],[11,30,11,42],[2,26,4,26],[5,15,5,21],[5,30,5,35],[6,15,6,21],[2,42,4,42],[2,28,4,28],[2,39,4,39],[2,40,4,40],[2,41,4,41],[26,2,26,3],[26,5,26,10],[26,12,26,17],[27,2,27,3],[27,5,27,10],[27,12,27,17],[28,2,28,3],[28,5,28,10],[28,12,28,17],[33,2,33,3],[33,5,33,10],[33,12,33,17],[34,2,34,3],[34,5,34,10],[34,12,34,17],[29,2,29,3],[29,5,29,10],[29,12,29,17],[31,2,31,3],[31,5,31,10],[31,12,31,17],[32,2,32,3],[32,5,32,10],[32,12,32,17]]}
["MEGA Toernooi 2014",null,null,null,null,null,null,null,null,null,null,null,null,null,null,null,null,null,null,null,null,null,null,null,null,null,null,null,null,null,null,null,null,null,null,null,null,null,null,null,null,null,null,null,null,null,null,null,null,null,{"$f":"COUNTA(T13:V18)","v":18},{"$f":"COUNTA(AS13:AU18)","v":18},{"$f":"COUNTA(T26:V31)","v":18},{"$f":"COUNTA(#REF!)","v":1},null,null,null,null,null,null,null,{"$f":"VALUE(A6)","v":4},{"$f":"B6","v":"PA TEAM 1"},{"$f":"VALUE(O6)","v":3},{"$f":"P6","v":"PB TEAM 1"},{"$f":"VALUE(AD6)","v":2},{"$f":"AE6","v":"PC TEAM 1"}]
[null,null,null,null,null,null,null,null,null,null,null,null,null,null,null,null,null,null,null,null,null,null,null,null,null,null,null,null,null,null,null,null,null,null,null,null,null,null,null,null,null,null,null,null,null,null,null,null,null,null,null,null,null,null,null,null,null,null,null,null,null,{"$f":"VALUE(A7)","v":1},{"$f":"B7","v":"PA TEAM 2"},{"$f":"VALUE(O7)","v":4},{"$f":"P7","v":"PB TEAM 2"},{"$f":"VALUE(AD7)","v":4},{"$f":"AE7","v":"PC TEAM 2"}]
["Stand",null,null,null,null,null,null,null,null,null,"Gewonnen","Gelijk","Verloren","Saldo","Stand",null,null,null,null,null,null,null,null,null,null,"Gewonnen","Gelijk","Verloren","Saldo","Stand",null,null,null,null,null,null,null,null,null,"Gewonnen","Gelijk","Verloren","Saldo",null,null,null,null,null,null,null,null,null,null,null,null,null,null,null,null,null,null,{"$f":"VALUE(A8)","v":2},{"$f":"B8","v":"PA TEAM 3"},{"$f":"VALUE(O8)","v":1},{"$f":"P8","v":"PB TEAM 3"},{"$f":"VALUE(AD8)","v":3},{"$f":"AE8","v":"PC TEAM 3"}]
[null,null,null,null,null,null,null,null,null,null,null,null,null,null,null,null,null,null,null,null,null,null,null,null,null,null,null,null,null,null,null,null,null,null,null,null,null,null,null,null,null,null,null,null,null,null,null,null,null,null,null,null,null,null,null,null,null,null,null,null,null,{"$f":"VALUE(A9)","v":3},{"$f":"B9","v":"PA TEAM 4"},{"$f":"VALUE(O9)","v":2},{"$f":"P9","v":"PB TEAM 4"},{"$f":"VALUE(AD9)","v":5},{"$f":"AE9","v":"PC TEAM 4"}]
[null,"Groep 1",null,null,null,null,null,"V","T","P",null,null,null,null,null,"Groep 2",null,null,null,null,null,null,"V","T","P",null,null,null,null,null,"Groep 3",null,null,null,null,null,"V","T","P",null,null,null,null,null,null,null,null,null,null,null,null,null,null,null,null,null,null,null,null,null,null,null,null,null,null,{"$f":"VALUE(AD10)","v":1},{"$f":"AE10","v":"PC TEAM 5"}]
[{"$f":"RANK(J6,$J$6:$J$9,0)","v":4},"PA TEAM 1",null,null,null,null,null,{"$f":"SUMIF($F$13:$K$18,B6,$T$13:$T$18)+SUMIF($M$13:$R$18,B6,$V$13:$V$18)","v":5},{"$f":"SUMIF($F$13:$K$18,B6,$V$13:$V$18)+SUMIF($M$13:$R$18,B6,$T$13:$T$18)","v":7},{"$f":"(K6*3)+L6+(H6*0.001)-(I6*0.001)","v":0.99799999999999989},{"$f":"SUMPRODUCT(($F$13:$K$18=B6)*($X$13:$X$18=3))+SUMPRODUCT(($M$13:$R$18=B6)*($Z$13:$Z$18=3))","v":0},{"$f":"SUMPRODUCT(($F$13:$K$18=B6)*($X$13:$X$18=1))+SUMPRODUCT(($M$13:$R$18=B6)*($Z$13:$Z$18=1))","v":1},{"$f":"SUMPRODUCT(($F$13:$K$18=B6)*($X$13:$X$18=0))+SUMPRODUCT(($M$13:$R$18=B6)*($Z$13:$Z$18=0))","v":2},{"$f":"H6-I6","v":-2},{"$f":"RANK(Y6,$Y$6:$Y$10,0)","v":3},"PB TEAM 1",null,null,null,null,null,null,{"$f":"SUMIF($AE$13:$AJ$22,P6,$AS$13:$AS$22)+SUMIF($AL$13:$AQ$22,P6,$AU$13:$AU$22)","v":6},{"$f":"SUMIF($AE$13:$AJ$22,P6,$AU$13:$AU$22)+SUMIF($AL$13:$AQ$22,P6,$AS$13:$AS$22)","v":5},{"$f":"(Z6*3)+AA6+(W6*0.001)-(X6*0.001)","v":7.0010000000000003},{"$f":"SUMPRODUCT(($AE$13:$AJ$22=P6)*($AW$13:$AW$22=3))+SUMPRODUCT(($AL$13:$AQ$22=P6)*($AY$13:$AY$22=3))","v":2},{"$f":"SUMPRODUCT(($AE$13:$AJ$22=P6)*($AW$13:$AW$22=1))+SUMPRODUCT(($AL$13:$AQ$22=P6)*($AY$13:$AY$22=1))","v":1},{"$f":"SUMPRODUCT(($AE$13:$AJ$22=P6)*($AW$13:$AW$22=0))+SUMPRODUCT(($AL$13:$AQ$22=P6)*($AY$13:$AY$22=0))","v":1},{"$f":"W6-X6","v":1},{"$f":"RANK(AM6,$AM$6:$AM$10,0)","v":2},"PC TEAM 1",null,null,null,null,null,{"$f":"SUMIF($F$26:$K$35,AE6,$T$26:$T$35)+SUMIF($M$26:$R$35,AE6,$V$26:$V$35)","v":24},{"$f":"SUMIF($F$26:$K$35,AE6,$V$26:$V$35)+SUMIF($M$26:$R$35,AE6,$T$26:$T$35)","v":19},{"$f":"(AN6*3)+AO6+(AK6*0.001)-(AL6*0.001)","v":6.0049999999999999},{"$f":"SUMPRODUCT(($F$26:$K$35=AE6)*($X$26:$X$35=3))+SUMPRODUCT(($M$26:$R$35=AE6)*($Z$26:$Z$35=3))","v":2},{"$f":"SUMPRODUCT(($F$26:$K$35=AE6)*($X$26:$X$35=1))+SUMPRODUCT(($M$26:$R$35=AE6)*($Z$26:$Z$35=1))","v":0},{"$f":"SUMPRODUCT(($F$26:$K$35=AE6)*($X$26:$X$35=0))+SUMPRODUCT(($M$26:$R$35=AE6)*($Z$26:$Z$35=0))","v":2},{"$f":"AK6-AL6","v":5}]
[{"$f":"RANK(J7,$J$6:$J$9,0)","v":1},"PA TEAM 2",null,null,null,null,null,{"$f":"SUMIF($F$13:$K$18,B7,$T$13:$T$18)+SUMIF($M$13:$R$18,B7,$V$13:$V$18)","v":7},{"$f":"SUMIF($F$13:$K$18,B7,$V$13:$V$18)+SUMIF($M$13:$R$18,B7,$T$13:$T$18)","v":4},{"$f":"(K7*3)+L7+(H7*0.001)-(I7*0.001)","v":7.0030000000000001},{"$f":"SUMPRODUCT(($F$13:$K$18=B7)*($X$13:$X$18=3))+SUMPRODUCT(($M$13:$R$18=B7)*($Z$13:$Z$18=3))","v":2},{"$f":"SUMPRODUCT(($F$13:$K$18=B7)*($X$13:$X$18=1))+SUMPRODUCT(($M$13:$R$18=B7)*($Z$13:$Z$18=1))","v":1},{"$f":"SUMPRODUCT(($F$13:$K$18=B7)*($X$13:$X$18=0))+SUMPRODUCT(($M$13:$R$18=B7)*($Z$13:$Z$18=0))","v":0},{"$f":"H7-I7","v":3},{"$f":"RANK(Y7,$Y$6:$Y$10,0)","v":4},"PB TEAM 2",null,null,null,null,null,null,{"$f":"SUMIF($AE$13:$AJ$22,P7,$AS$13:$AS$22)+SUMIF($AL$13:$AQ$22,P7,$AU$13:$AU$22)","v":5},{"$f":"SUMIF($AE$13:$AJ$22,P7,$AU$13:$AU$22)+SUMIF($AL$13:$AQ$22,P7,$AS$13:$AS$22)","v":7},{"$f":"(Z7*3)+AA7+(W7*0.001)-(X7*0.001)","v":2.9979999999999998},{"$f":"SUMPRODUCT(($AE$13:$AJ$22=P7)*($AW$13:$AW$22=3))+SUMPRODUCT(($AL$13:$AQ$22=P7)*($AY$13:$AY$22=3))","v":1},{"$f":"SUMPRODUCT(($AE$13:$AJ$22=P7)*($AW$13:$AW$22=1))+SUMPRODUCT(($AL$13:$AQ$22=P7)*($AY$13:$AY$22=1))","v":0},{"$f":"SUMPRODUCT(($AE$13:$AJ$22=P7)*($AW$13:$AW$22=0))+SUMPRODUCT(($AL$13:$AQ$22=P7)*($AY$13:$AY$22=0))","v":3},{"$f":"W7-X7","v":-2},{"$f":"RANK(AM7,$AM$6:$AM$10,0)","v":4},"PC TEAM 2",null,null,null,null,null,{"$f":"SUMIF($F$26:$K$35,AE7,$T$26:$T$35)+SUMIF($M$26:$R$35,AE7,$V$26:$V$35)","v":9},{"$f":"SUMIF($F$26:$K$35,AE7,$V$26:$V$35)+SUMIF($M$26:$R$35,AE7,$T$26:$T$35)","v":16},{"$f":"(AN7*3)+AO7+(AK7*0.001)-(AL7*0.001)","v":5.9930000000000003},{"$f":"SUMPRODUCT(($F$26:$K$35=AE7)*($X$26:$X$35=3))+SUMPRODUCT(($M$26:$R$35=AE7)*($Z$26:$Z$35=3))","v":2},{"$f":"SUMPRODUCT(($F$26:$K$35=AE7)*($X$26:$X$35=1))+SUMPRODUCT(($M$26:$R$35=AE7)*($Z$26:$Z$35=1))","v":0},{"$f":"SUMPRODUCT(($F$26:$K$35=AE7)*($X$26:$X$35=0))+SUMPRODUCT(($M$26:$R$35=AE7)*($Z$26:$Z$35=0))","v":2},{"$f":"AK7-AL7","v":-7}]
[{"$f":"RANK(J8,$J$6:$J$9,0)","v":2},"PA TEAM 3",null,null,null,null,null,{"$f":"SUMIF($F$13:$K$18,B8,$T$13:$T$18)+SUMIF($M$13:$R$18,B8,$V$13:$V$18)","v":6},{"$f":"SUMIF($F$13:$K$18,B8,$V$13:$V$18)+SUMIF($M$13:$R$18,B8,$T$13:$T$18)","v":4},{"$f":"(K8*3)+L8+(H8*0.001)-(I8*0.001)","v":5.0020000000000007},{"$f":"SUMPRODUCT(($F$13:$K$18=B8)*($X$13:$X$18=3))+SUMPRODUCT(($M$13:$R$18=B8)*($Z$13:$Z$18=3))","v":1},{"$f":"SUMPRODUCT(($F$13:$K$18=B8)*($X$13:$X$18=1))+SUMPRODUCT(($M$13:$R$18=B8)*($Z$13:$Z$18=1))","v":2},{"$f":"SUMPRODUCT(($F$13:$K$18=B8)*($X$13:$X$18=0))+SUMPRODUCT(($M$13:$R$18=B8)*($Z$13:$Z$18=0))","v":0},{"$f":"H8-I8","v":2},{"$f":"RANK(Y8,$Y$6:$Y$10,0)","v":1},"PB TEAM 3",null,null,null,null,null,null,{"$f":"SUMIF($AE$13:$AJ$22,P8,$AS$13:$AS$22)+SUMIF($AL$13:$AQ$22,P8,$AU$13:$AU$22)","v":7},{"$f":"SUMIF($AE$13:$AJ$22,P8,$AU$13:$AU$22)+SUMIF($AL$13:$AQ$22,P8,$AS$13:$AS$22)","v":5},{"$f":"(Z8*3)+AA8+(W8*0.001)-(X8*0.001)","v":9.0019999999999989},{"$f":"SUMPRODUCT(($AE$13:$AJ$22=P8)*($AW$13:$AW$22=3))+SUMPRODUCT(($AL$13:$AQ$22=P8)*($AY$13:$AY$22=3))","v":3},{"$f":"SUMPRODUCT(($AE$13:$AJ$22=P8)*($AW$13:$AW$22=1))+SUMPRODUCT(($AL$13:$AQ$22=P8)*($AY$13:$AY$22=1))","v":0},{"$f":"SUMPRODUCT(($AE$13:$AJ$22=P8)*($AW$13:$AW$22=0))+SUMPRODUCT(($AL$13:$AQ$22=P8)*($AY$13:$AY$22=0))","v":1},{"$f":"W8-X8","v":2},{"$f":"RANK(AM8,$AM$6:$AM$10,0)","v":3},"PC TEAM 3",null,null,null,null,null,{"$f":"SUMIF($F$26:$K$35,AE8,$T$26:$T$35)+SUMIF($M$26:$R$35,AE8,$V$26:$V$35)","v":17},{"$f":"SUMIF($F$26:$K$35,AE8,$V$26:$V$35)+SUMIF($M$26:$R$35,AE8,$T$26:$T$35)","v":17},{"$f":"(AN8*3)+AO8+(AK8*0.001)-(AL8*0.001)","v":6},{"$f":"SUMPRODUCT(($F$26:$K$35=AE8)*($X$26:$X$35=3))+SUMPRODUCT(($M$26:$R$35=AE8)*($Z$26:$Z$35=3))","v":2},{"$f":"SUMPRODUCT(($F$26:$K$35=AE8)*($X$26:$X$35=1))+SUMPRODUCT(($M$26:$R$35=AE8)*($Z$26:$Z$35=1))","v":0},{"$f":"SUMPRODUCT(($F$26:$K$35=AE8)*($X$26:$X$35=0))+SUMPRODUCT(($M$26:$R$35=AE8)*($Z$26:$Z$35=0))","v":2},{"$f":"AK8-AL8","v":0},null,null,null,null,null,null,null,null,null,null,null,null,null,null,null,null,null,null,null,null,null,null,null,null,null,null,null,null,null,null,"Best nummers 2"]
[{"$f":"RANK(J9,$J$6:$J$9,0)","v":3},"PA TEAM 4",null,null,null,null,null,{"$f":"SUMIF($F$13:$K$18,B9,$T$13:$T$18)+SUMIF($M$13:$R$18,B9,$V$13:$V$18)","v":6},{"$f":"SUMIF($F$13:$K$18,B9,$V$13:$V$18)+SUMIF($M$13:$R$18,B9,$T$13:$T$18)","v":9},{"$f":"(K9*3)+L9+(H9*0.001)-(I9*0.001)","v":2.9969999999999999},{"$f":"SUMPRODUCT(($F$13:$K$18=B9)*($X$13:$X$18=3))+SUMPRODUCT(($M$13:$R$18=B9)*($Z$13:$Z$18=3))","v":1},{"$f":"SUMPRODUCT(($F$13:$K$18=B9)*($X$13:$X$18=1))+SUMPRODUCT(($M$13:$R$18=B9)*($Z$13:$Z$18=1))","v":0},{"$f":"SUMPRODUCT(($F$13:$K$18=B9)*($X$13:$X$18=0))+SUMPRODUCT(($M$13:$R$18=B9)*($Z$13:$Z$18=0))","v":2},{"$f":"H9-I9","v":-3},{"$f":"RANK(Y9,$Y$6:$Y$10,0)","v":2},"PB TEAM 4",null,null,null,null,null,null,{"$f":"SUMIF($AE$13:$AJ$22,P9,$AS$13:$AS$22)+SUMIF($AL$13:$AQ$22,P9,$AU$13:$AU$22)","v":9},{"$f":"SUMIF($AE$13:$AJ$22,P9,$AU$13:$AU$22)+SUMIF($AL$13:$AQ$22,P9,$AS$13:$AS$22)","v":2},{"$f":"(Z9*3)+AA9+(W9*0.001)-(X9*0.001)","v":7.0070000000000006},{"$f":"SUMPRODUCT(($AE$13:$AJ$22=P9)*($AW$13:$AW$22=3))+SUMPRODUCT(($AL$13:$AQ$22=P9)*($AY$13:$AY$22=3))","v":2},{"$f":"SUMPRODUCT(($AE$13:$AJ$22=P9)*($AW$13:$AW$22=1))+SUMPRODUCT(($AL$13:$AQ$22=P9)*($AY$13:$AY$22=1))","v":1},{"$f":"SUMPRODUCT(($AE$13:$AJ$22=P9)*($AW$13:$AW$22=0))+SUMPRODUCT(($AL$13:$AQ$22=P9)*($AY$13:$AY$22=0))","v":1},{"$f":"W9-X9","v":7},{"$f":"RANK(AM9,$AM$6:$AM$10,0)","v":5},"PC TEAM 4",null,null,null,null,null,{"$f":"SUMIF($F$26:$K$35,AE9,$T$26:$T$35)+SUMIF($M$26:$R$35,AE9,$V$26:$V$35)","v":7},{"$f":"SUMIF($F$26:$K$35,AE9,$V$26:$V$35)+SUMIF($M$26:$R$35,AE9,$T$26:$T$35)","v":19},{"$f":"(AN9*3)+AO9+(AK9*0.001)-(AL9*0.001)","v":-1.2E-2},{"$f":"SUMPRODUCT(($F$26:$K$35=AE9)*($X$26:$X$35=3))+SUMPRODUCT(($M$26:$R$35=AE9)*($Z$26:$Z$35=3))","v":0},{"$f":"SUMPRODUCT(($F$26:$K$35=AE9)*($X$26:$X$35=1))+SUMPRODUCT(($M$26:$R$35=AE9)*($Z$26:$Z$35=1))","v":0},{"$f":"SUMPRODUCT(($F$26:$K$35=AE9)*($X$26:$X$35=0))+SUMPRODUCT(($M$26:$R$35=AE9)*($Z$26:$Z$35=0))","v":4},{"$f":"AK9-AL9","v":-12},null,null,null,null,null,null,null,null,null,null,null,null,null,null,null,null,null,null,null,null,null,null,null,null,null,null,null,null,null,{"$f":"RANK(BW9,$BW$9:$BW$11,0)","v":3},{"$f":"VLOOKUP(2,$A$6:$N$9,2,FALSE)","v":"PA TEAM 3"},{"$f":"VLOOKUP(2,$A$6:$N$9,10,FALSE)","v":5.0020000000000007}]
[null,null,null,null,null,null,null,null,null,null,null,null,null,null,{"$f":"RANK(Y10,$Y$6:$Y$10,0)","v":5},"PB TEAM 5",null,null,null,null,null,null,{"$f":"SUMIF($AE$13:$AJ$22,P10,$AS$13:$AS$22)+SUMIF($AL$13:$AQ$22,P10,$AU$13:$AU$22)","v":2},{"$f":"SUMIF($AE$13:$AJ$22,P10,$AU$13:$AU$22)+SUMIF($AL$13:$AQ$22,P10,$AS$13:$AS$22)","v":10},{"$f":"(Z10*3)+AA10+(W10*0.001)-(X10*0.001)","v":1.9919999999999998},{"$f":"SUMPRODUCT(($AE$13:$AJ$22=P10)*($AW$13:$AW$22=3))+SUMPRODUCT(($AL$13:$AQ$22=P10)*($AY$13:$AY$22=3))","v":0},{"$f":"SUMPRODUCT(($AE$13:$AJ$22=P10)*($AW$13:$AW$22=1))+SUMPRODUCT(($AL$13:$AQ$22=P10)*($AY$13:$AY$22=1))","v":2},{"$f":"SUMPRODUCT(($AE$13:$AJ$22=P10)*($AW$13:$AW$22=0))+SUMPRODUCT(($AL$13:$AQ$22=P10)*($AY$13:$AY$22=0))","v":2},{"$f":"W10-X10","v":-8},{"$f":"RANK(AM10,$AM$6:$AM$10,0)","v":1},"PC TEAM 5",null,null,null,null,null,{"$f":"SUMIF($F$26:$K$35,AE10,$T$26:$T$35)+SUMIF($M$26:$R$35,AE10,$V$26:$V$35)","v":20},{"$f":"SUMIF($F$26:$K$35,AE10,$V$26:$V$35)+SUMIF($M$26:$R$35,AE10,$T$26:$T$35)","v":6},{"$f":"(AN10*3)+AO10+(AK10*0.001)-(AL10*0.001)","v":12.013999999999999},{"$f":"SUMPRODUCT(($F$26:$K$35=AE10)*($X$26:$X$35=3))+SUMPRODUCT(($M$26:$R$35=AE10)*($Z$26:$Z$35=3))","v":4},{"$f":"SUMPRODUCT(($F$26:$K$35=AE10)*($X$26:$X$35=1))+SUMPRODUCT(($M$26:$R$35=AE10)*($Z$26:$Z$35=1))","v":0},{"$f":"SUMPRODUCT(($F$26:$K$35=AE10)*($X$26:$X$35=0))+SUMPRODUCT(($M$26:$R$35=AE10)*($Z$26:$Z$35=0))","v":0},{"$f":"AK10-AL10","v":14},null,null,null,null,null,null,null,null,null,null,null,null,null,null,null,null,null,null,null,null,null,null,null,null,null,null,null,null,null,{"$f":"RANK(BW10,$BW$9:$BW$11,0)","v":1},{"$f":"VLOOKUP(2,$O$6:$Y$10,2,FALSE)","v":"PB TEAM 4"},{"$f":"VLOOKUP(2,$O$6:$Y$10,11,FALSE)","v":7.0070000000000006}]
[null,null,null,null,null,null,null,null,null,null,null,null,null,null,null,null,null,null,null,null,null,null,null,null,null,null,null,null,null,null,null,null,null,null,null,null,null,null,null,null,null,null,null,null,null,null,null,null,null,null,null,null,null,null,null,null,null,null,null,null,null,null,null,null,null,null,null,null,null,null,null,null,{"$f":"RANK(BW11,$BW$9:$BW$11,0)","v":2},{"$f":"VLOOKUP(2,$AD$6:$AM$10,2,FALSE)","v":"PC TEAM 1"},{"$f":"VLOOKUP(2,$AD$6:$AM$10,10,FALSE)","v":6.0049999999999999}]
[null,null,"Tijd",null,null,"VELD 1",null,null,null,null,null,null,null,null,null,null,null,null,null,"Uitslag",null,null,null,"Punten",null,null,null,"Tijd",null,null,"VELD 2",null,null,null,null,null,null,null,null,null,null,null,null,null,"Uitslag",null,null,null,"Punten"]
[null,null,"09:00:00",null,null,{"$f":"B6","v":"PA TEAM 1"},null,null,null,null,null,"--",{"$f":"B7","v":"PA TEAM 2"},null,null,null,null,null,null,1,"--",2,null,{"$f":"IF(T13=\"\",\"\",IF(T13>V13,3,IF(T13=V13,1,0)))","v":0},null,{"$f":"IF(V13=\"\",\"\",IF(V13>T13,3,IF(V13=T13,1,0)))","v":3},null,"09:00:00",null,null,{"$f":"P6","v":"PB TEAM 1"},null,null,null,null,null,"--",{"$f":"P7","v":"PB TEAM 2"},null,null,null,null,null,null,1,"--",0,null,{"$f":"IF(AS13=\"\",\"\",IF(AS13>AU13,3,IF(AS13=AU13,1,0)))","v":3},null,{"$f":"IF(AU13=\"\",\"\",IF(AU13>AS13,3,IF(AU13=AS13,1,0)))","v":0}]
[null,null,"09:20:00",null,null,{"$f":"B8","v":"PA TEAM 3"},null,null,null,null,null,"--",{"$f":"B9","v":"PA TEAM 4"},null,null,null,null,null,null,3,"--",1,null,{"$f":"IF(T14=\"\",\"\",IF(T14>V14,3,IF(T14=V14,1,0)))","v":3},null,{"$f":"IF(V14=\"\",\"\",IF(V14>T14,3,IF(V14=T14,1,0)))","v":0},null,"09:20:00",null,null,{"$f":"P8","v":"PB TEAM 3"},null,null,null,null,null,"--",{"$f":"P9","v":"PB TEAM 4"},null,null,null,null,null,null,1,"--",0,null,{"$f":"IF(AS14=\"\",\"\",IF(AS14>AU14,3,IF(AS14=AU14,1,0)))","v":3},null,{"$f":"IF(AU14=\"\",\"\",IF(AU14>AS14,3,IF(AU14=AS14,1,0)))","v":0}]
[null,null,"09:40:00",null,null,{"$f":"B9","v":"PA TEAM 4"},null,null,null,null,null,"--",{"$f":"B6","v":"PA TEAM 1"},null,null,null,null,null,null,3,"--",2,null,{"$f":"IF(T15=\"\",\"\",IF(T15>V15,3,IF(T15=V15,1,0)))","v":3},null,0,null,"09:40:00",null,null,{"$f":"P10","v":"PB TEAM 5"},null,null,null,null,null,"--",{"$f":"P6","v":"PB TEAM 1"},null,null,null,null,null,null,1,"--",1,null,{"$f":"IF(AS15=\"\",\"\",IF(AS15>AU15,3,IF(AS15=AU15,1,0)))","v":1},null,1]
[null,null,"10:00:00",null,null,{"$f":"B7","v":"PA TEAM 2"},null,null,null,null,null,"--",{"$f":"B8","v":"PA TEAM 3"},null,null,null,null,null,null,1,"--",1,null,1,null,1,null,"10:00:00",null,null,{"$f":"P7","v":"PB TEAM 2"},null,null,null,null,null,"--",{"$f":"P8","v":"PB TEAM 3"},null,null,null,null,null,null,1,"--",2,null,0,null,3]
[null,null,"10:20:00",null,null,{"$f":"B7","v":"PA TEAM 2"},null,null,null,null,null,"--",{"$f":"B9","v":"PA TEAM 4"},null,null,null,null,null,null,4,"--",2,null,3,null,0,null,"10:20:00",null,null,{"$f":"P10","v":"PB TEAM 5"},null,null,null,null,null,"--",{"$f":"P9","v":"PB TEAM 4"},null,null,null,null,null,null,1,"--",1,null,1,null,1]
[null,null,"10:40:00",null,null,{"$f":"B6","v":"PA TEAM 1"},null,null,null,null,null,"--",{"$f":"B8","v":"PA TEAM 3"},null,null,null,null,null,null,2,"--",2,null,1,null,1,null,"10:40:00",null,null,{"$f":"P6","v":"PB TEAM 1"},null,null,null,null,null,"--",{"$f":"P8","v":"PB TEAM 3"},null,null,null,null,null,null,4,"--",0,null,3,null,0]
[null,null,null,null,null,null,null,null,null,null,null,null,null,null,null,null,null,null,null,null,null,null,null,null,null,null,null,"10:40:00",null,null,{"$f":"P7","v":"PB TEAM 2"},null,null,null,null,null,"--",{"$f":"P10","v":"PB TEAM 5"},null,null,null,null,null,null,4,"--",0,null,{"$f":"IF(AS19=\"\",\"\",IF(AS19>AU19,3,IF(AS19=AU19,1,0)))","v":3},null,{"$f":"IF(AU19=\"\",\"\",IF(AU19>AS19,3,IF(AU19=AS19,1,0)))","v":0}]
[null,null,null,null,null,null,null,null,null,null,null,null,null,null,null,null,null,null,null,null,null,null,null,null,null,null,null,"10:40:00",null,null,{"$f":"P9","v":"PB TEAM 4"},null,null,null,null,null,"--",{"$f":"P6","v":"PB TEAM 1"},null,null,null,null,null,null,4,"--",0,null,3,null,0]
[null,null,null,null,null,null,null,null,null,null,null,null,null,null,null,null,null,null,null,null,null,null,null,null,null,null,null,"10:40:00",null,null,{"$f":"P8","v":"PB TEAM 3"},null,null,null,null,null,"--",{"$f":"P10","v":"PB TEAM 5"},null,null,null,null,null,null,4,"--",0,null,3,null,0]
[null,null,null,null,null,null,null,null,null,null,null,null,null,null,null,null,null,null,null,null,null,null,null,null,null,null,null,"10:40:00",null,null,{"$f":"P9","v":"PB TEAM 4"},null,null,null,null,null,"--",{"$f":"P7","v":"PB TEAM 2"},null,null,null,null,null,null,4,"--",0,null,3,null,0]
[]
[]
[null,null,"Tijd",null,null,"VELD 3",null,null,null,null,null,null,null,null,null,null,null,null,null,"Uitslag",null,null,null,"Punten"]
[null,null,"09:00:00",null,null,{"$f":"AE6","v":"PC TEAM 1"},null,null,null,null,null,"--",{"$f":"AE7","v":"PC TEAM 2"},null,null,null,null,null,null,9,"--",2,null,{"$f":"IF(T26=\"\",\"\",IF(T26>V26,3,IF(T26=V26,1,0)))","v":3},null,{"$f":"IF(V26=\"\",\"\",IF(V26>T26,3,IF(V26=T26,1,0)))","v":0}]
[null,null,"09:20:00",null,null,{"$f":"AE8","v":"PC TEAM 3"},null,null,null,null,null,"--",{"$f":"AE9","v":"PC TEAM 4"},null,null,null,null,null,null,8,"--",4,null,{"$f":"IF(T27=\"\",\"\",IF(T27>V27,3,IF(T27=V27,1,0)))","v":3},null,{"$f":"IF(V27=\"\",\"\",IF(V27>T27,3,IF(V27=T27,1,0)))","v":0}]
[null,null,"09:40:00",null,null,{"$f":"AE10","v":"PC TEAM 5"},null,null,null,null,null,"--",{"$f":"AE6","v":"PC TEAM 1"},null,null,null,null,null,null,7,"--",5,null,{"$f":"IF(T28=\"\",\"\",IF(T28>V28,3,IF(T28=V28,1,0)))","v":3},null,0]
[null,null,"10:00:00",null,null,{"$f":"AE7","v":"PC TEAM 2"},null,null,null,null,null,"--",{"$f":"AE8","v":"PC TEAM 3"},null,null,null,null,null,null,4,"--",1,null,3,null,0]
[null,null,"10:20:00",null,null,{"$f":"AE10","v":"PC TEAM 5"},null,null,null,null,null,"--",{"$f":"AE9","v":"PC TEAM 4"},null,null,null,null,null,null,5,"--",0,null,3,null,0]
[null,null,"10:40:00",null,null,{"$f":"AE6","v":"PC TEAM 1"},null,null,null,null,null,"--",{"$f":"AE8","v":"PC TEAM 3"},null,null,null,null,null,null,6,"--",8,null,0,null,3]
[null,null,"11:00:00",null,null,{"$f":"AE7","v":"PC TEAM 2"},null,null,null,null,null,"--",{"$f":"AE10","v":"PC TEAM 5"},null,null,null,null,null,null,1,"--",5,null,0,null,3]
[null,null,"11:20:00",null,null,{"$f":"AE9","v":"PC TEAM 4"},null,null,null,null,null,"--",{"$f":"AE6","v":"PC TEAM 1"},null,null,null,null,null,null,2,"--",4,null,0,null,3]
[null,null,"11:40:00",null,null,{"$f":"AE8","v":"PC TEAM 3"},null,null,null,null,null,"--",{"$f":"AE10","v":"PC TEAM 5"},null,null,null,null,null,null,0,"--",3,null,0,null,3]
[null,null,"12:00:00",null,null,{"$f":"AE9","v":"PC TEAM 4"},null,null,null,null,null,"--",{"$f":"AE7","v":"PC TEAM 2"},null,null,null,null,null,null,1,"--",2,null,0,null,3]

{"sheet":"Finale's","index":1,"n_rows":13,"n_cols":33,"rows_kept":13,"cut":false,"hidden":false,"merged":[[8,13,8,16],[8,18,8,21],[7,18,7,21],[7,13,7,16],[5,5,5,29],[12,14,14,20],[7,9,7,10],[12,0,12,3],[12,6,12,9],[0,5,0,29],[2,2,2,3],[2,26,2,29],[2,21,2,24],[2,10,2,13],[2,5,2,8],[2,18,2,19],[3,26,3,29],[3,21,3,24],[3,10,3,13],[3,5,3,8],[10,14,10,20]]}
[null,null,null,null,null,"Halve finale"]
[null,null,null,null,null,null,null,null,null,"HAL 1",null,null,null,null,null,null,null,null,null,null,null,null,null,null,null,"HAL 1"]
[null,null,"20:50:00",null,"E","Nr 1 groep 1",null,null,null,null,"Nr 1 groep 3",null,null,null,"Scheidsrechter",null,null,null,"21:07:00",null,"F","Nr 1 groep 2",null,null,null,null,"Beste nummer 2",null,null,null,"Scheidsrechter"]
[null,null,null,null,null,{"$f":"VLOOKUP(1,Poule!A6:G9,2,0)","v":"PA TEAM 2"},null,null,null,null,{"$f":"VLOOKUP(1,Poule!AD6:AJ10,2,0)","v":"PC TEAM 5"},null,null,null,"EW",null,"-",null,null,null,null,{"$f":"VLOOKUP(1,Poule!O6:V9,2,0)","v":"PB TEAM 3"},null,null,null,null,{"$f":"VLOOKUP(1,Poule!BU9:BV11,2,0)","v":"PB TEAM 4"},null,null,null,"PD",null,"-"]
[]
[null,null,null,null,null,"Finale"]
[null,null,null,null,null,null,null,null,null,null,null,null,null,null,null,null,null,"HAL 1"]
[null,null,null,null,null,null,null,null,null,"21:25:00",null,null,null,"Winnaar E",null,null,null,null,"Winnaar F"]
[null,null,null,null,null,null,null,null,null,null,null,null,null,{"$f":"IF(P4=\"\",\"\",IF(P4>R4,F4,K4))","v":""},null,null,null,null,{"$f":"IF(AF4=\"\",\"\",IF(AF4>AH4,V4,AA4))","v":""},null,null,null,null,null,"-",null,null,null,null,null,"Scheidsrechter"]
[null,null,null,null,null,null,null,null,null,null,null,null,null,null,null,null,null,null,null,null,null,null,null,null,null,null,null,null,null,null,"Mario van der Ende"]
[null,null,null,null,null,null,null,null,null,null,null,null,null,null,"Winnaar MEGA toernooi"]
[]
[null,null,null,null,null,null,null,null,null,null,null,null,null,null,{"$f":"IF(X9=\"\",\"\",IF(X9>Z9,N9,S9))","v":""}]

{"sheet":"GROEP-1","index":2,"n_rows":19,"n_cols":15,"rows_kept":19,"cut":false,"hidden":false,"merged":[[0,14,2,15],[0,0,2,13],[16,1,16,6],[17,1,17,6],[18,1,18,6],[12,0,14,0],[3,0,3,1],[3,2,3,6],[3,7,3,9],[7,2,7,3],[7,5,7,6],[6,0,6,1],[7,0,7,1],[3,11,3,13],[12,1,14,6],[12,7,14,7],[12,8,14,8],[12,9,14,9],[12,11,14,11],[12,12,14,12],[12,13,14,13],[15,1,15,6],[12,10,14,10],[9,2,9,3],[9,5,9,6],[4,0,4,1],[5,0,5,1],[5,2,5,3],[4,2,4,3],[4,5,4,6],[5,5,5,6],[8,0,8,1],[9,0,9,1],[6,2,6,3],[6,5,6,6],[8,2,8,3],[8,5,8,6]]}
["MEGA TOERNOOI",null,null,null,null,null,null,null,null,null,null,null,null,null,"Scores By:\nOnlineExcelCursus.NL"]
[]
[]
[{"$f":"Poule!C12","v":"Tijd"},{"$f":"Poule!D12","v":0},{"$f":"Poule!F12","v":"VELD 1"},null,null,null,null,{"$f":"Poule!T12","v":"Uitslag"},null,null,null,{"$f":"Poule!X12","v":"Punten"}]
[{"$f":"Poule!C13","v":"09:00:00"},{"$f":"Poule!D13","v":"00:00:00"},{"$f":"Poule!F13","v":"PA TEAM 1"},{"$f":"Poule!G13","v":0},{"$f":"Poule!L13","v":"--"},{"$f":"Poule!M13","v":"PA TEAM 2"},{"$f":"Poule!N13","v":0},{"$f":"Poule!T13","v":1},{"$f":"Poule!U13","v":"--"},{"$f":"Poule!V13","v":2},null,{"$f":"Poule!X13","v":0},null,{"$f":"Poule!Z13","v":3}]
[{"$f":"Poule!C14","v":"09:20:00"},{"$f":"Poule!D14","v":"00:00:00"},{"$f":"Poule!F14","v":"PA TEAM 3"},{"$f":"Poule!G14","v":0},{"$f":"Poule!L14","v":"--"},{"$f":"Poule!M14","v":"PA TEAM 4"},{"$f":"Poule!N14","v":0},{"$f":"Poule!T14","v":3},{"$f":"Poule!U14","v":"--"},{"$f":"Poule!V14","v":1},null,{"$f":"Poule!X14","v":3},null,{"$f":"Poule!Z14","v":0}]
[{"$f":"Poule!C15","v":"09:40:00"},{"$f":"Poule!D15","v":"00:00:00"},{"$f":"Poule!F15","v":"PA TEAM 4"},{"$f":"Poule!G15","v":0},{"$f":"Poule!L15","v":"--"},{"$f":"Poule!M15","v":"PA TEAM 1"},{"$f":"Poule!N15","v":0},{"$f":"Poule!T15","v":3},{"$f":"Poule!U15","v":"--"},{"$f":"Poule!V15","v":2},null,{"$f":"Poule!X15","v":3},null,{"$f":"Poule!Z15","v":0}]
[{"$f":"Poule!C16","v":"10:00:00"},{"$f":"Poule!D16","v":"00:00:00"},{"$f":"Poule!F16","v":"PA TEAM 2"},{"$f":"Poule!G16","v":0},{"$f":"Poule!L16","v":"--"},{"$f":"Poule!M16","v":"PA TEAM 3"},{"$f":"Poule!N16","v":0},{"$f":"Poule!T16","v":1},{"$f":"Poule!U16","v":"--"},{"$f":"Poule!V16","v":1},null,{"$f":"Poule!X16","v":1},null,{"$f":"Poule!Z16","v":1}]
[{"$f":"Poule!C17","v":"10:20:00"},{"$f":"Poule!D17","v":"00:00:00"},{"$f":"Poule!F17","v":"PA TEAM 2"},{"$f":"Poule!G17","v":0},{"$f":"Poule!L17","v":"--"},{"$f":"Poule!M17","v":"PA TEAM 4"},{"$f":"Poule!N17","v":0},{"$f":"Poule!T17","v":4},{"$f":"Poule!U17","v":"--"},{"$f":"Poule!V17","v":2},null,{"$f":"Poule!X17","v":3},null,{"$f":"Poule!Z17","v":0}]
[{"$f":"Poule!C18","v":"10:40:00"},{"$f":"Poule!D18","v":"00:00:00"},{"$f":"Poule!F18","v":"PA TEAM 1"},{"$f":"Poule!G18","v":0},{"$f":"Poule!L18","v":"--"},{"$f":"Poule!M18","v":"PA TEAM 3"},{"$f":"Poule!N18","v":0},{"$f":"Poule!T18","v":2},{"$f":"Poule!U18","v":"--"},{"$f":"Poule!V18","v":2},null,{"$f":"Poule!X18","v":1},null,{"$f":"Poule!Z18","v":1}]
[]
[]
[{"$f":"Poule!A3","v":"Stand"},{"$f":"Poule!B5","v":"Groep 1"},null,null,null,null,null,{"$f":"Poule!H5","v":"V"},{"$f":"Poule!I5","v":"T"},{"$f":"Poule!J5","v":"P"},{"$f":"Poule!K3","v":"Gewonnen"},{"$f":"Poule!L3","v":"Gelijk"},{"$f":"Poule!M3","v":"Verloren"},{"$f":"Poule!N3","v":"Saldo"}]
[{"$f":"Poule!A4","v":0},null,null,null,null,null,null,null,null,null,{"$f":"Poule!K4","v":0},{"$f":"Poule!L4","v":0},{"$f":"Poule!M4","v":0},{"$f":"Poule!N4","v":0}]
[{"$f":"Poule!A5","v":0},null,null,null,null,null,null,null,null,null,{"$f":"Poule!K5","v":0},{"$f":"Poule!L5","v":0},{"$f":"Poule!M5","v":0},{"$f":"Poule!N5","v":0}]
[{"$f":"Poule!A6","v":4},{"$f":"Poule!B6","v":"PA TEAM 1"},{"$f":"Poule!C6","v":0},{"$f":"Poule!D6","v":0},{"$f":"Poule!E6","v":0},{"$f":"Poule!F6","v":0},{"$f":"Poule!G6","v":0},{"$f":"Poule!H6","v":5},{"$f":"Poule!I6","v":7},{"$f":"Poule!J6","v":0.99799999999999989},{"$f":"Poule!K6","v":0},{"$f":"Poule!L6","v":1},{"$f":"Poule!M6","v":2},{"$f":"Poule!N6","v":-2}]
[{"$f":"Poule!A7","v":1},{"$f":"Poule!B7","v":"PA TEAM 2"},{"$f":"Poule!C7","v":0},{"$f":"Poule!D7","v":0},{"$f":"Poule!E7","v":0},{"$f":"Poule!F7","v":0},{"$f":"Poule!G7","v":0},{"$f":"Poule!H7","v":7},{"$f":"Poule!I7","v":4},{"$f":"Poule!J7","v":7.0030000000000001},{"$f":"Poule!K7","v":2},{"$f":"Poule!L7","v":1},{"$f":"Poule!M7","v":0},{"$f":"Poule!N7","v":3}]
[{"$f":"Poule!A8","v":2},{"$f":"Poule!B8","v":"PA TEAM 3"},{"$f":"Poule!C8","v":0},{"$f":"Poule!D8","v":0},{"$f":"Poule!E8","v":0},{"$f":"Poule!F8","v":0},{"$f":"Poule!G8","v":0},{"$f":"Poule!H8","v":6},{"$f":"Poule!I8","v":4},{"$f":"Poule!J8","v":5.0020000000000007},{"$f":"Poule!K8","v":1},{"$f":"Poule!L8","v":2},{"$f":"Poule!M8","v":0},{"$f":"Poule!N8","v":2}]
[{"$f":"Poule!A9","v":3},{"$f":"Poule!B9","v":"PA TEAM 4"},{"$f":"Poule!C9","v":0},{"$f":"Poule!D9","v":0},{"$f":"Poule!E9","v":0},{"$f":"Poule!F9","v":0},{"$f":"Poule!G9","v":0},{"$f":"Poule!H9","v":6},{"$f":"Poule!I9","v":9},{"$f":"Poule!J9","v":2.9969999999999999},{"$f":"Poule!K9","v":1},{"$f":"Poule!L9","v":0},{"$f":"Poule!M9","v":2},{"$f":"Poule!N9","v":-3}]

{"sheet":"GROEP-2","index":3,"n_rows":25,"n_cols":13,"rows_kept":25,"cut":false,"hidden":false,"merged":[[24,1,24,4],[0,12,2,13],[20,1,20,4],[21,1,21,4],[22,1,22,4],[0,0,2,11],[3,5,3,7],[3,9,3,11],[3,0,3,1],[3,2,3,4],[9,0,9,1],[6,0,6,1],[17,8,19,8],[17,9,19,9],[17,10,19,10],[17,7,19,7],[17,6,19,6],[23,1,23,4],[7,0,7,1],[8,0,8,1],[17,11,19,11],[4,0,4,1],[5,0,5,1],[17,0,19,0],[17,1,19,4],[17,5,19,5],[10,0,10,1],[11,0,11,1],[12,0,12,1],[13,0,13,1]]}
["MEGA TOERNOOI",null,null,null,null,null,null,null,null,null,null,null,"Scores By:\nOnlineExcelCursus.NL"]
[]
[]
[{"$f":"Poule!AB12","v":"Tijd"},null,{"$f":"Poule!AE12","v":"VELD 2"},null,null,{"$f":"Poule!AS12","v":"Uitslag"},null,null,null,{"$f":"Poule!AW12","v":"Punten"}]
[{"$f":"Poule!AB13","v":"09:00:00"},{"$f":"Poule!AC13","v":"00:00:00"},{"$f":"Poule!AE13","v":"PB TEAM 1"},{"$f":"Poule!AK13","v":"--"},{"$f":"Poule!AL13","v":"PB TEAM 2"},{"$f":"Poule!AS13","v":1},{"$f":"Poule!AT13","v":"--"},{"$f":"Poule!AU13","v":0},null,{"$f":"Poule!AW13","v":3},null,{"$f":"Poule!AY13","v":0}]
[{"$f":"Poule!AB14","v":"09:20:00"},{"$f":"Poule!AC14","v":"00:00:00"},{"$f":"Poule!AE14","v":"PB TEAM 3"},{"$f":"Poule!AK14","v":"--"},{"$f":"Poule!AL14","v":"PB TEAM 4"},{"$f":"Poule!AS14","v":1},{"$f":"Poule!AT14","v":"--"},{"$f":"Poule!AU14","v":0},null,{"$f":"Poule!AW14","v":3},null,{"$f":"Poule!AY14","v":0}]
[{"$f":"Poule!AB15","v":"09:40:00"},{"$f":"Poule!AC15","v":"00:00:00"},{"$f":"Poule!AE15","v":"PB TEAM 5"},{"$f":"Poule!AK15","v":"--"},{"$f":"Poule!AL15","v":"PB TEAM 1"},{"$f":"Poule!AS15","v":1},{"$f":"Poule!AT15","v":"--"},{"$f":"Poule!AU15","v":1},null,{"$f":"Poule!AW15","v":1},null,{"$f":"Poule!AY15","v":1}]
[{"$f":"Poule!AB16","v":"10:00:00"},{"$f":"Poule!AC16","v":"00:00:00"},{"$f":"Poule!AE16","v":"PB TEAM 2"},{"$f":"Poule!AK16","v":"--"},{"$f":"Poule!AL16","v":"PB TEAM 3"},{"$f":"Poule!AS16","v":1},{"$f":"Poule!AT16","v":"--"},{"$f":"Poule!AU16","v":2},null,{"$f":"Poule!AW16","v":0},null,{"$f":"Poule!AY16","v":3}]
[{"$f":"Poule!AB17","v":"10:20:00"},{"$f":"Poule!AC17","v":"00:00:00"},{"$f":"Poule!AE17","v":"PB TEAM 5"},{"$f":"Poule!AK17","v":"--"},{"$f":"Poule!AL17","v":"PB TEAM 4"},{"$f":"Poule!AS17","v":1},{"$f":"Poule!AT17","v":"--"},{"$f":"Poule!AU17","v":1},null,{"$f":"Poule!AW17","v":1},null,{"$f":"Poule!AY17","v":1}]
[{"$f":"Poule!AB18","v":"10:40:00"},{"$f":"Poule!AC18","v":"00:00:00"},{"$f":"Poule!AE18","v":"PB TEAM 1"},{"$f":"Poule!AK18","v":"--"},{"$f":"Poule!AL18","v":"PB TEAM 3"},{"$f":"Poule!AS18","v":4},{"$f":"Poule!AT18","v":"--"},{"$f":"Poule!AU18","v":0},null,{"$f":"Poule!AW18","v":3},null,{"$f":"Poule!AY18","v":0}]
[{"$f":"Poule!AB19","v":"10:40:00"},{"$f":"Poule!AC19","v":"00:00:00"},{"$f":"Poule!AE19","v":"PB TEAM 2"},{"$f":"Poule!AK19","v":"--"},{"$f":"Poule!AL19","v":"PB TEAM 5"},{"$f":"Poule!AS19","v":4},{"$f":"Poule!AT19","v":"--"},{"$f":"Poule!AU19","v":0},null,{"$f":"Poule!AW19","v":3},null,{"$f":"Poule!AY19","v":0}]
[{"$f":"Poule!AB20","v":"10:40:00"},{"$f":"Poule!AC20","v":"00:00:00"},{"$f":"Poule!AE20","v":"PB TEAM 4"},{"$f":"Poule!AK20","v":"--"},{"$f":"Poule!AL20","v":"PB TEAM 1"},{"$f":"Poule!AS20","v":4},{"$f":"Poule!AT20","v":"--"},{"$f":"Poule!AU20","v":0},null,{"$f":"Poule!AW20","v":3},null,{"$f":"Poule!AY20","v":0}]
[{"$f":"Poule!AB21","v":"10:40:00"},{"$f":"Poule!AC21","v":"00:00:00"},{"$f":"Poule!AE21","v":"PB TEAM 3"},{"$f":"Poule!AK21","v":"--"},{"$f":"Poule!AL21","v":"PB TEAM 5"},{"$f":"Poule!AS21","v":4},{"$f":"Poule!AT21","v":"--"},{"$f":"Poule!AU21","v":0},null,{"$f":"Poule!AW21","v":3},null,{"$f":"Poule!AY21","v":0}]
[{"$f":"Poule!AB22","v":"10:40:00"},{"$f":"Poule!AC22","v":"00:00:00"},{"$f":"Poule!AE22","v":"PB TEAM 4"},{"$f":"Poule!AK22","v":"--"},{"$f":"Poule!AL22","v":"PB TEAM 2"},{"$f":"Poule!AS22","v":4},{"$f":"Poule!AT22","v":"--"},{"$f":"Poule!AU22","v":0},null,{"$f":"Poule!AW22","v":3},null,{"$f":"Poule!AY22","v":0}]
[]
[]
[]
[{"$f":"Poule!O3","v":"Stand"},{"$f":"Poule!P5","v":"Groep 2"},null,null,null,{"$f":"Poule!W5","v":"V"},{"$f":"Poule!X5","v":"T"},{"$f":"Poule!Y5","v":"P"},{"$f":"Poule!Z3","v":"Gewonnen"},{"$f":"Poule!AA3","v":"Gelijk"},{"$f":"Poule!AB3","v":"Verloren"},{"$f":"Poule!AC3","v":"Saldo"}]
[{"$f":"Poule!O4","v":0},null,null,null,null,null,null,null,{"$f":"Poule!Z4","v":0},{"$f":"Poule!AA4","v":0},{"$f":"Poule!AB4","v":0},{"$f":"Poule!AC4","v":0}]
[{"$f":"Poule!O5","v":0},null,null,null,null,null,null,null,{"$f":"Poule!Z5","v":0},{"$f":"Poule!AA5","v":0},{"$f":"Poule!AB5","v":0},{"$f":"Poule!AC5","v":0}]
[{"$f":"Poule!O6","v":3},{"$f":"Poule!P6","v":"PB TEAM 1"},null,null,null,{"$f":"Poule!W6","v":6},{"$f":"Poule!X6","v":5},{"$f":"Poule!Y6","v":7.0010000000000003},{"$f":"Poule!Z6","v":2},{"$f":"Poule!AA6","v":1},{"$f":"Poule!AB6","v":1},{"$f":"Poule!AC6","v":1}]
[{"$f":"Poule!O7","v":4},{"$f":"Poule!P7","v":"PB TEAM 2"},null,null,null,{"$f":"Poule!W7","v":5},{"$f":"Poule!X7","v":7},{"$f":"Poule!Y7","v":2.9979999999999998},{"$f":"Poule!Z7","v":1},{"$f":"Poule!AA7","v":0},{"$f":"Poule!AB7","v":3},{"$f":"Poule!AC7","v":-2}]
[{"$f":"Poule!O8","v":1},{"$f":"Poule!P8","v":"PB TEAM 3"},null,null,null,{"$f":"Poule!W8","v":7},{"$f":"Poule!X8","v":5},{"$f":"Poule!Y8","v":9.0019999999999989},{"$f":"Poule!Z8","v":3},{"$f":"Poule!AA8","v":0},{"$f":"Poule!AB8","v":1},{"$f":"Poule!AC8","v":2}]
[{"$f":"Poule!O9","v":2},{"$f":"Poule!P9","v":"PB TEAM 4"},null,null,null,{"$f":"Poule!W9","v":9},{"$f":"Poule!X9","v":2},{"$f":"Poule!Y9","v":7.0070000000000006},{"$f":"Poule!Z9","v":2},{"$f":"Poule!AA9","v":1},{"$f":"Poule!AB9","v":1},{"$f":"Poule!AC9","v":7}]
[{"$f":"Poule!O10","v":5},{"$f":"Poule!P10","v":"PB TEAM 5"},null,null,null,{"$f":"Poule!W10","v":2},{"$f":"Poule!X10","v":10},{"$f":"Poule!Y10","v":1.9919999999999998},{"$f":"Poule!Z10","v":0},{"$f":"Poule!AA10","v":2},{"$f":"Poule!AB10","v":2},{"$f":"Poule!AC10","v":-8}]

{"sheet":"GROEP-3","index":4,"n_rows":24,"n_cols":13,"rows_kept":24,"cut":false,"hidden":false,"merged":[[23,1,23,4],[16,8,18,8],[16,9,18,9],[0,12,2,13],[16,5,18,5],[16,6,18,6],[16,7,18,7],[0,0,2,11],[16,10,18,10],[16,11,18,11],[9,0,9,1],[7,0,7,1],[3,9,3,11],[4,0,4,1],[3,0,3,1],[3,5,3,7],[3,2,3,4],[21,1,21,4],[22,1,22,4],[19,1,19,4],[16,0,18,0],[5,0,5,1],[6,0,6,1],[20,1,20,4],[16,1,18,4],[8,0,8,1],[10,0,10,1],[11,0,11,1],[12,0,12,1],[13,0,13,1]]}
["MEGA TOERNOOI",null,null,null,null,null,null,null,null,null,null,null,"Scores By:\nOnlineExcelCursus.NL"]
[]
[]
[{"$f":"Poule!C25","v":"Tijd"},{"$f":"Poule!D25","v":0},{"$f":"Poule!F25","v":"VELD 3"},null,null,{"$f":"Poule!T25","v":"Uitslag"},{"$f":"Poule!U25","v":0},{"$f":"Poule!V25","v":0},null,{"$f":"Poule!X25","v":"Punten"}]
[{"$f":"Poule!C26","v":"09:00:00"},{"$f":"Poule!D26","v":"00:00:00"},{"$f":"Poule!F26","v":"PC TEAM 1"},{"$f":"Poule!L26","v":"--"},{"$f":"Poule!M26","v":"PC TEAM 2"},{"$f":"Poule!T26","v":9},{"$f":"Poule!U26","v":"--"},{"$f":"Poule!V26","v":2},null,{"$f":"Poule!X26","v":3},null,{"$f":"Poule!Z26","v":0}]
[{"$f":"Poule!C27","v":"09:20:00"},{"$f":"Poule!D27","v":"00:00:00"},{"$f":"Poule!F27","v":"PC TEAM 3"},{"$f":"Poule!L27","v":"--"},{"$f":"Poule!M27","v":"PC TEAM 4"},{"$f":"Poule!T27","v":8},{"$f":"Poule!U27","v":"--"},{"$f":"Poule!V27","v":4},null,{"$f":"Poule!X27","v":3},null,{"$f":"Poule!Z27","v":0}]
[{"$f":"Poule!C28","v":"09:40:00"},{"$f":"Poule!D28","v":"00:00:00"},{"$f":"Poule!F28","v":"PC TEAM 5"},{"$f":"Poule!L28","v":"--"},{"$f":"Poule!M28","v":"PC TEAM 1"},{"$f":"Poule!T28","v":7},{"$f":"Poule!U28","v":"--"},{"$f":"Poule!V28","v":5},null,{"$f":"Poule!X28","v":3},null,{"$f":"Poule!Z28","v":0}]
[{"$f":"Poule!C29","v":"10:00:00"},{"$f":"Poule!D29","v":"00:00:00"},{"$f":"Poule!F29","v":"PC TEAM 2"},{"$f":"Poule!L29","v":"--"},{"$f":"Poule!M29","v":"PC TEAM 3"},{"$f":"Poule!T29","v":4},{"$f":"Poule!U29","v":"--"},{"$f":"Poule!V29","v":1},null,{"$f":"Poule!X29","v":3},null,{"$f":"Poule!Z29","v":0}]
[{"$f":"Poule!C30","v":"10:20:00"},{"$f":"Poule!D30","v":"00:00:00"},{"$f":"Poule!F30","v":"PC TEAM 5"},{"$f":"Poule!L30","v":"--"},{"$f":"Poule!M30","v":"PC TEAM 4"},{"$f":"Poule!T30","v":5},{"$f":"Poule!U30","v":"--"},{"$f":"Poule!V30","v":0},null,{"$f":"Poule!X30","v":3},null,{"$f":"Poule!Z30","v":0}]
[{"$f":"Poule!C31","v":"10:40:00"},{"$f":"Poule!D31","v":"00:00:00"},{"$f":"Poule!F31","v":"PC TEAM 1"},{"$f":"Poule!L31","v":"--"},{"$f":"Poule!M31","v":"PC TEAM 3"},{"$f":"Poule!T31","v":6},{"$f":"Poule!U31","v":"--"},{"$f":"Poule!V31","v":8},null,{"$f":"Poule!X31","v":0},null,{"$f":"Poule!Z31","v":3}]
[{"$f":"Poule!C32","v":"11:00:00"},{"$f":"Poule!D32","v":"00:00:00"},{"$f":"Poule!F32","v":"PC TEAM 2"},{"$f":"Poule!L32","v":"--"},{"$f":"Poule!M32","v":"PC TEAM 5"},{"$f":"Poule!T32","v":1},{"$f":"Poule!U32","v":"--"},{"$f":"Poule!V32","v":5},null,{"$f":"Poule!X32","v":0},null,{"$f":"Poule!Z32","v":3}]
[{"$f":"Poule!C33","v":"11:20:00"},{"$f":"Poule!D33","v":"00:00:00"},{"$f":"Poule!F33","v":"PC TEAM 4"},{"$f":"Poule!L33","v":"--"},{"$f":"Poule!M33","v":"PC TEAM 1"},{"$f":"Poule!T33","v":2},{"$f":"Poule!U33","v":"--"},{"$f":"Poule!V33","v":4},null,{"$f":"Poule!X33","v":0},null,{"$f":"Poule!Z33","v":3}]
[{"$f":"Poule!C34","v":"11:40:00"},{"$f":"Poule!D34","v":"00:00:00"},{"$f":"Poule!F34","v":"PC TEAM 3"},{"$f":"Poule!L34","v":"--"},{"$f":"Poule!M34","v":"PC TEAM 5"},{"$f":"Poule!T34","v":0},{"$f":"Poule!U34","v":"--"},{"$f":"Poule!V34","v":3},null,{"$f":"Poule!X34","v":0},null,{"$f":"Poule!Z34","v":3}]
[{"$f":"Poule!C35","v":"12:00:00"},{"$f":"Poule!D35","v":"00:00:00"},{"$f":"Poule!F35","v":"PC TEAM 4"},{"$f":"Poule!L35","v":"--"},{"$f":"Poule!M35","v":"PC TEAM 2"},{"$f":"Poule!T35","v":1},{"$f":"Poule!U35","v":"--"},{"$f":"Poule!V35","v":2},null,{"$f":"Poule!X35","v":0},null,{"$f":"Poule!Z35","v":3}]
[]
[]
[{"$f":"Poule!AD3","v":"Stand"},{"$f":"Poule!AE5","v":"Groep 3"},null,null,null,{"$f":"Poule!AK5","v":"V"},{"$f":"Poule!AL5","v":"T"},{"$f":"Poule!AM5","v":"P"},{"$f":"Poule!AN3","v":"Gewonnen"},{"$f":"Poule!AO3","v":"Gelijk"},{"$f":"Poule!AP3","v":"Verloren"},{"$f":"Poule!AQ3","v":"Saldo"}]
[{"$f":"Poule!AD4","v":0},null,null,null,null,null,null,null,{"$f":"Poule!AN4","v":0},{"$f":"Poule!AO4","v":0},{"$f":"Poule!AP4","v":0},{"$f":"Poule!AQ4","v":0}]
[{"$f":"Poule!AD5","v":0},null,null,null,null,null,null,null,{"$f":"Poule!AN5","v":0},{"$f":"Poule!AO5","v":0},{"$f":"Poule!AP5","v":0},{"$f":"Poule!AQ5","v":0}]
[{"$f":"Poule!AD6","v":2},{"$f":"Poule!AE6","v":"PC TEAM 1"},null,null,null,{"$f":"Poule!AK6","v":24},{"$f":"Poule!AL6","v":19},{"$f":"Poule!AM6","v":6.0049999999999999},{"$f":"Poule!AN6","v":2},{"$f":"Poule!AO6","v":0},{"$f":"Poule!AP6","v":2},{"$f":"Poule!AQ6","v":5}]
[{"$f":"Poule!AD7","v":4},{"$f":"Poule!AE7","v":"PC TEAM 2"},null,null,null,{"$f":"Poule!AK7","v":9},{"$f":"Poule!AL7","v":16},{"$f":"Poule!AM7","v":5.9930000000000003},{"$f":"Poule!AN7","v":2},{"$f":"Poule!AO7","v":0},{"$f":"Poule!AP7","v":2},{"$f":"Poule!AQ7","v":-7}]
[{"$f":"Poule!AD8","v":3},{"$f":"Poule!AE8","v":"PC TEAM 3"},null,null,null,{"$f":"Poule!AK8","v":17},{"$f":"Poule!AL8","v":17},{"$f":"Poule!AM8","v":6},{"$f":"Poule!AN8","v":2},{"$f":"Poule!AO8","v":0},{"$f":"Poule!AP8","v":2},{"$f":"Poule!AQ8","v":0}]
[{"$f":"Poule!AD9","v":5},{"$f":"Poule!AE9","v":"PC TEAM 4"},null,null,null,{"$f":"Poule!AK9","v":7},{"$f":"Poule!AL9","v":19},{"$f":"Poule!AM9","v":-1.2E-2},{"$f":"Poule!AN9","v":0},{"$f":"Poule!AO9","v":0},{"$f":"Poule!AP9","v":4},{"$f":"Poule!AQ9","v":-12}]
[{"$f":"Poule!AD10","v":1},{"$f":"Poule!AE10","v":"PC TEAM 5"},null,null,null,{"$f":"Poule!AK10","v":20},{"$f":"Poule!AL10","v":6},{"$f":"Poule!AM10","v":12.013999999999999},{"$f":"Poule!AN10","v":4},{"$f":"Poule!AO10","v":0},{"$f":"Poule!AP10","v":0},{"$f":"Poule!AQ10","v":14}]