{"text_format":"1","workbook":"xlsx","n_sheets":4,"sheets":["Poule","Finale","GROEP-1","GROEP-2"],"not_rendered":{"charts":0,"images":4,"macros":1,"external_links":0,"defined_names":0,"comments":0,"pivot_tables":0},"unopened":[],"bounds":{"document_bytes":16777216,"sheet_cells":100000,"rows_first":2000,"rows_last":500,"rows_between":2000,"halvings":0,"cell_chars":16384,"cell_head_chars":4096},"cells_cut":0,"cells_raw":0,"read":"whole","date_system":"1900"}

{"sheet":"Poule","index":0,"n_rows":44,"n_cols":69,"rows_kept":44,"cut":false,"hidden":false,"merged":[[6,15,6,21],[2,28,4,28],[11,13,11,18],[14,28,14,29],[15,28,15,29],[12,6,12,11],[11,6,11,11],[12,13,12,18],[8,1,8,6],[10,3,10,4],[10,6,10,18],[12,3,12,4],[13,6,13,11],[11,3,11,4],[13,3,13,4],[13,13,13,18],[15,3,15,4],[16,13,16,18],[14,13,14,18],[14,3,14,4],[16,3,16,4],[16,6,16,11],[15,6,15,11],[14,6,14,11],[15,13,15,18],[0,0,1,49],[5,1,5,6],[6,1,6,6],[7,1,7,6],[4,1,4,6],[2,0,4,0],[2,12,4,12],[2,11,4,11],[2,10,4,10],[2,27,4,27],[2,14,4,14],[4,15,4,21],[2,13,4,13],[2,25,4,25],[2,26,4,26],[5,15,5,21],[10,20,10,22],[7,15,7,21],[8,15,8,21],[10,31,10,43],[12,28,12,29],[11,38,11,43],[10,24,10,26],[10,28,10,29],[10,45,10,47],[10,49,10,51],[11,28,11,29],[16,31,16,36],[16,38,16,43],[15,31,15,36],[14,31,14,36],[13,31,13,36],[13,38,13,43],[12,38,12,43],[12,31,12,36],[11,31,11,36],[16,28,16,29],[15,38,15,43],[14,38,14,43],[13,28,13,29]]}
["Schoonhoven toernooi 2015",null,null,null,null,null,null,null,null,null,null,null,null,null,null,null,null,null,null,null,null,null,null,null,null,null,null,null,null,null,null,null,null,null,null,null,null,null,null,null,null,null,null,null,null,null,null,null,null,null,{"$f":"COUNTA(U12:W17)","v":18},{"$f":"COUNTA(AT12:AV17)","v":18},{"$f":"COUNTA(U20:W25)","v":0},{"$f":"COUNTA(AT20:AV25)","v":0},null,null,null,null,null,null,null,{"$f":"VALUE(A6)","v":1},{"$f":"B6","v":"G1A"},{"$f":"VALUE(O6)","v":1},{"$f":"P6","v":"G2A"},{"$f":"VALUE(AD6)","v":0},{"$f":"AE6","v":0},{"$f":"VALUE(AR6)","v":0},{"$f":"AS6","v":0}]
[null,null,null,null,null,null,null,null,null,null,null,null,null,null,null,null,null,null,null,null,null,null,null,null,null,null,null,null,null,null,null,null,null,null,null,null,null,null,null,null,null,null,null,null,null,null,null,null,null,null,null,null,null,null,null,null,null,null,null,null,null,{"$f":"VALUE(A7)","v":2},{"$f":"B7","v":"G1B"},{"$f":"VALUE(O7)","v":4},{"$f":"P7","v":"G2B"},{"$f":"VALUE(AD7)","v":0},{"$f":"AE7","v":0},{"$f":"VALUE(AR7)","v":0},{"$f":"AS7","v":0}]
["Stand",null,null,null,null,null,null,null,null,null,"Gewonnen","Gelijk","Verloren","Saldo","Stand",null,null,null,null,null,null,null,null,null,null,"Gewonnen","Gelijk","Verloren","Saldo",null,null,null,null,null,null,null,null,null,null,null,null,null,null,null,null,null,null,null,null,null,null,null,null,null,null,null,null,null,null,null,null,{"$f":"VALUE(A8)","v":3},{"$f":"B8","v":"G1C"},{"$f":"VALUE(O8)","v":3},{"$f":"P8","v":"G2C"},{"$f":"VALUE(AD8)","v":0},{"$f":"AE8","v":0},{"$f":"VALUE(AR8)","v":0},{"$f":"AS8","v":0}]
[null,null,null,null,null,null,null,null,null,null,null,null,null,null,null,null,null,null,null,null,null,null,null,null,null,null,null,null,null,null,null,null,null,null,null,null,null,null,null,null,null,null,null,null,null,null,null,null,null,null,null,null,null,null,null,null,null,null,null,null,null,{"$f":"VALUE(A9)","v":4},{"$f":"B9","v":"G1D"},{"$f":"VALUE(O9)","v":2},{"$f":"P9","v":"G2D"},{"$f":"VALUE(AD9)","v":0},{"$f":"AE9","v":0},{"$f":"VALUE(AR9)","v":0},{"$f":"AS9","v":0}]
[null,"Groep 1",null,null,null,null,null,"V","T","P",null,null,null,null,null,"Groep 2",null,null,null,null,null,null,"V","T","P"]
[{"$f":"RANK(J6,$J$6:$J$9,0)","v":1},"G1A",null,null,null,null,null,{"$f":"SUMIF($G$12:$L$17,B6,$U$12:$U$17)+SUMIF($N$12:$S$17,B6,$W$12:$W$17)","v":8},{"$f":"SUMIF($G$12:$L$17,B6,$W$12:$W$17)+SUMIF($N$12:$S$17,B6,$U$12:$U$17)","v":6},{"$f":"(K6*3)+L6+(H6*0.001)-(I6*0.001)","v":6.0019999999999998},{"$f":"SUMPRODUCT(($G$12:$L$17=B6)*($Y$12:$Y$17=3))+SUMPRODUCT(($N$12:$S$17=B6)*($AA$12:$AA$17=3))","v":2},{"$f":"SUMPRODUCT(($G$12:$L$17=B6)*($Y$12:$Y$17=1))+SUMPRODUCT(($N$12:$S$17=B6)*($AA$12:$AA$17=1))","v":0},{"$f":"SUMPRODUCT(($G$12:$L$17=B6)*($Y$12:$Y$17=0))+SUMPRODUCT(($N$12:$S$17=B6)*($AA$12:$AA$17=0))","v":1},{"$f":"H6-I6","v":2},{"$f":"RANK(Y6,$Y$6:$Y$9,0)","v":1},"G2A",null,null,null,null,null,null,{"$f":"SUMIF($AF$12:$AK$17,P6,$AT$12:$AT$17)+SUMIF($AM$12:$AR$17,P6,$AV$12:$AV$17)","v":3},{"$f":"SUMIF($AF$12:$AK$17,P6,$AV$12:$AV$17)+SUMIF($AM$12:$AR$17,P6,$AT$12:$AT$17)","v":2},{"$f":"(Z6*3)+AA6+(W6*0.001)-(X6*0.001)","v":5.0010000000000003},{"$f":"SUMPRODUCT(($AF$12:$AK$17=P6)*($AX$12:$AX$17=3))+SUMPRODUCT(($AM$12:$AR$17=P6)*($AZ$12:$AZ$17=3))","v":1},{"$f":"SUMPRODUCT(($AF$12:$AK$17=P6)*($AX$12:$AX$17=1))+SUMPRODUCT(($AM$12:$AR$17=P6)*($AZ$12:$AZ$17=1))","v":2},{"$f":"SUMPRODUCT(($AF$12:$AK$17=P6)*($AX$12:$AX$17=0))+SUMPRODUCT(($AM$12:$AR$17=P6)*($AZ$12:$AZ$17=0))","v":0},{"$f":"W6-X6","v":1}]
[{"$f":"RANK(J7,$J$6:$J$9,0)","v":2},"G1B",null,null,null,null,null,{"$f":"SUMIF($G$12:$L$17,B7,$U$12:$U$17)+SUMIF($N$12:$S$17,B7,$W$12:$W$17)","v":5},{"$f":"SUMIF($G$12:$L$17,B7,$W$12:$W$17)+SUMIF($N$12:$S$17,B7,$U$12:$U$17)","v":4},{"$f":"(K7*3)+L7+(H7*0.001)-(I7*0.001)","v":5.0010000000000003},{"$f":"SUMPRODUCT(($G$12:$L$17=B7)*($Y$12:$Y$17=3))+SUMPRODUCT(($N$12:$S$17=B7)*($AA$12:$AA$17=3))","v":1},{"$f":"SUMPRODUCT(($G$12:$L$17=B7)*($Y$12:$Y$17=1))+SUMPRODUCT(($N$12:$S$17=B7)*($AA$12:$AA$17=1))","v":2},{"$f":"SUMPRODUCT(($G$12:$L$17=B7)*($Y$12:$Y$17=0))+SUMPRODUCT(($N$12:$S$17=B7)*($AA$12:$AA$17=0))","v":0},{"$f":"H7-I7","v":1},{"$f":"RANK(Y7,$Y$6:$Y$9,0)","v":4},"G2B",null,null,null,null,null,null,{"$f":"SUMIF($AF$12:$AK$17,P7,$AT$12:$AT$17)+SUMIF($AM$12:$AR$17,P7,$AV$12:$AV$17)","v":5},{"$f":"SUMIF($AF$12:$AK$17,P7,$AV$12:$AV$17)+SUMIF($AM$12:$AR$17,P7,$AT$12:$AT$17)","v":3},{"$f":"(Z7*3)+AA7+(W7*0.001)-(X7*0.001)","v":3.0019999999999998},{"$f":"SUMPRODUCT(($AF$12:$AK$17=P7)*($AX$12:$AX$17=3))+SUMPRODUCT(($AM$12:$AR$17=P7)*($AZ$12:$AZ$17=3))","v":1},{"$f":"SUMPRODUCT(($AF$12:$AK$17=P7)*($AX$12:$AX$17=1))+SUMPRODUCT(($AM$12:$AR$17=P7)*($AZ$12:$AZ$17=1))","v":0},{"$f":"SUMPRODUCT(($AF$12:$AK$17=P7)*($AX$12:$AX$17=0))+SUMPRODUCT(($AM$12:$AR$17=P7)*($AZ$12:$AZ$17=0))","v":2},{"$f":"W7-X7","v":2}]
[{"$f":"RANK(J8,$J$6:$J$9,0)","v":3},"G1C",null,null,null,null,null,{"$f":"SUMIF($G$12:$L$17,B8,$U$12:$U$17)+SUMIF($N$12:$S$17,B8,$W$12:$W$17)","v":7},{"$f":"SUMIF($G$12:$L$17,B8,$W$12:$W$17)+SUMIF($N$12:$S$17,B8,$U$12:$U$17)","v":6},{"$f":"(K8*3)+L8+(H8*0.001)-(I8*0.001)","v":4.0009999999999994},{"$f":"SUMPRODUCT(($G$12:$L$17=B8)*($Y$12:$Y$17=3))+SUMPRODUCT(($N$12:$S$17=B8)*($AA$12:$AA$17=3))","v":1},{"$f":"SUMPRODUCT(($G$12:$L$17=B8)*($Y$12:$Y$17=1))+SUMPRODUCT(($N$12:$S$17=B8)*($AA$12:$AA$17=1))","v":1},{"$f":"SUMPRODUCT(($G$12:$L$17=B8)*($Y$12:$Y$17=0))+SUMPRODUCT(($N$12:$S$17=B8)*($AA$12:$AA$17=0))","v":1},{"$f":"H8-I8","v":1},{"$f":"RANK(Y8,$Y$6:$Y$9,0)","v":3},"G2C",null,null,null,null,null,null,{"$f":"SUMIF($AF$12:$AK$17,P8,$AT$12:$AT$17)+SUMIF($AM$12:$AR$17,P8,$AV$12:$AV$17)","v":2},{"$f":"SUMIF($AF$12:$AK$17,P8,$AV$12:$AV$17)+SUMIF($AM$12:$AR$17,P8,$AT$12:$AT$17)","v":5},{"$f":"(Z8*3)+AA8+(W8*0.001)-(X8*0.001)","v":3.9969999999999999},{"$f":"SUMPRODUCT(($AF$12:$AK$17=P8)*($AX$12:$AX$17=3))+SUMPRODUCT(($AM$12:$AR$17=P8)*($AZ$12:$AZ$17=3))","v":1},{"$f":"SUMPRODUCT(($AF$12:$AK$17=P8)*($AX$12:$AX$17=1))+SUMPRODUCT(($AM$12:$AR$17=P8)*($AZ$12:$AZ$17=1))","v":1},{"$f":"SUMPRODUCT(($AF$12:$AK$17=P8)*($AX$12:$AX$17=0))+SUMPRODUCT(($AM$12:$AR$17=P8)*($AZ$12:$AZ$17=0))","v":1},{"$f":"W8-X8","v":-3}]
[{"$f":"RANK(J9,$J$6:$J$9,0)","v":4},"G1D",null,null,null,null,null,{"$f":"SUMIF($G$12:$L$17,B9,$U$12:$U$17)+SUMIF($N$12:$S$17,B9,$W$12:$W$17)","v":4},{"$f":"SUMIF($G$12:$L$17,B9,$W$12:$W$17)+SUMIF($N$12:$S$17,B9,$U$12:$U$17)","v":8},{"$f":"(K9*3)+L9+(H9*0.001)-(I9*0.001)","v":0.996},{"$f":"SUMPRODUCT(($G$12:$L$17=B9)*($Y$12:$Y$17=3))+SUMPRODUCT(($N$12:$S$17=B9)*($AA$12:$AA$17=3))","v":0},{"$f":"SUMPRODUCT(($G$12:$L$17=B9)*($Y$12:$Y$17=1))+SUMPRODUCT(($N$12:$S$17=B9)*($AA$12:$AA$17=1))","v":1},{"$f":"SUMPRODUCT(($G$12:$L$17=B9)*($Y$12:$Y$17=0))+SUMPRODUCT(($N$12:$S$17=B9)*($AA$12:$AA$17=0))","v":2},{"$f":"H9-I9","v":-4},{"$f":"RANK(Y9,$Y$6:$Y$9,0)","v":2},"G2D",null,null,null,null,null,null,{"$f":"SUMIF($AF$12:$AK$17,P9,$AT$12:$AT$17)+SUMIF($AM$12:$AR$17,P9,$AV$12:$AV$17)","v":3},{"$f":"SUMIF($AF$12:$AK$17,P9,$AV$12:$AV$17)+SUMIF($AM$12:$AR$17,P9,$AT$12:$AT$17)","v":3},{"$f":"(Z9*3)+AA9+(W9*0.001)-(X9*0.001)","v":4},{"$f":"SUMPRODUCT(($AF$12:$AK$17=P9)*($AX$12:$AX$17=3))+SUMPRODUCT(($AM$12:$AR$17=P9)*($AZ$12:$AZ$17=3))","v":1},{"$f":"SUMPRODUCT(($AF$12:$AK$17=P9)*($AX$12:$AX$17=1))+SUMPRODUCT(($AM$12:$AR$17=P9)*($AZ$12:$AZ$17=1))","v":1},{"$f":"SUMPRODUCT(($AF$12:$AK$17=P9)*($AX$12:$AX$17=0))+SUMPRODUCT(($AM$12:$AR$17=P9)*($AZ$12:$AZ$17=0))","v":1},{"$f":"W9-X9","v":0}]
[]
[null,null,null,"Tijd",null,null,"VELD 1",null,null,null,null,null,null,null,null,null,null,null,null,null,"Uitslag",null,null,null,"Punten",null,null,null,"Tijd",null,null,"VELD 2",null,null,null,null,null,null,null,null,null,null,null,null,null,"Uitslag",null,null,null,"Punten"]
[null,null,null,"11.00 - 11.20",null,null,{"$f":"B6","v":"G1A"},null,null,null,null,null,"--",{"$f":"B7","v":"G1B"},null,null,null,null,null,null,1,"--",2,null,{"$f":"IF(U12=\"\",\"\",IF(U12>W12,3,IF(U12=W12,1,0)))","v":0},null,{"$f":"IF(W12=\"\",\"\",IF(W12>U12,3,IF(W12=U12,1,0)))","v":3},null,"11.00 - 11.20",null,null,{"$f":"P6","v":"G2A"},null,null,null,null,null,"--",{"$f":"P7","v":"G2B"},null,null,null,null,null,null,1,"--",0,null,{"$f":"IF(AT12=\"\",\"\",IF(AT12>AV12,3,IF(AT12=AV12,1,0)))","v":3},null,{"$f":"IF(AV12=\"\",\"\",IF(AV12>AT12,3,IF(AV12=AT12,1,0)))","v":0}]
[null,null,null,"11.20 - 11.40",null,null,{"$f":"B8","v":"G1C"},null,null,null,null,null,"--",{"$f":"B9","v":"G1D"},null,null,null,null,null,null,3,"--",1,null,{"$f":"IF(U13=\"\",\"\",IF(U13>W13,3,IF(U13=W13,1,0)))","v":3},null,{"$f":"IF(W13=\"\",\"\",IF(W13>U13,3,IF(W13=U13,1,0)))","v":0},null,"11.20 - 11.40",null,null,{"$f":"P8","v":"G2C"},null,null,null,null,null,"--",{"$f":"P9","v":"G2D"},null,null,null,null,null,null,1,"--",0,null,{"$f":"IF(AT13=\"\",\"\",IF(AT13>AV13,3,IF(AT13=AV13,1,0)))","v":3},null,{"$f":"IF(AV13=\"\",\"\",IF(AV13>AT13,3,IF(AV13=AT13,1,0)))","v":0}]
[null,null,null,"11.40 - 12.00",null,null,{"$f":"B6","v":"G1A"},null,null,null,null,null,"--",{"$f":"B8","v":"G1C"},null,null,null,null,null,null,3,"--",2,null,{"$f":"IF(U14=\"\",\"\",IF(U14>W14,3,IF(U14=W14,1,0)))","v":3},null,0,null,"11.40 - 12.00",null,null,{"$f":"P6","v":"G2A"},null,null,null,null,null,"--",{"$f":"P8","v":"G2C"},null,null,null,null,null,null,1,"--",1,null,{"$f":"IF(AT14=\"\",\"\",IF(AT14>AV14,3,IF(AT14=AV14,1,0)))","v":1},null,1]
[null,null,null,"12.00 - 12.20",null,null,{"$f":"B7","v":"G1B"},null,null,null,null,null,"--",{"$f":"B9","v":"G1D"},null,null,null,null,null,null,1,"--",1,null,1,null,1,null,"12.00 - 12.20",null,null,{"$f":"P7","v":"G2B"},null,null,null,null,null,"--",{"$f":"P9","v":"G2D"},null,null,null,null,null,null,1,"--",2,null,0,null,3]
[null,null,null,"12.40 - 13.00",null,null,{"$f":"B6","v":"G1A"},null,null,null,null,null,"--",{"$f":"B9","v":"G1D"},null,null,null,null,null,null,4,"--",2,null,3,null,0,null,"12.40 - 13.00",null,null,{"$f":"P6","v":"G2A"},null,null,null,null,null,"--",{"$f":"P9","v":"G2D"},null,null,null,null,null,null,1,"--",1,null,1,null,1]
[null,null,null,"13.00 - 13.20",null,null,{"$f":"B7","v":"G1B"},null,null,null,null,null,"--",{"$f":"B8","v":"G1C"},null,null,null,null,null,null,2,"--",2,null,1,null,1,null,"13.00 - 13.20",null,null,{"$f":"P7","v":"G2B"},null,null,null,null,null,"--",{"$f":"P8","v":"G2C"},null,null,null,null,null,null,4,"--",0,null,3,null,0]
[]
[]
[]
[]
[]
[]
[]
[]
[]
[]
[]
[]
[]
[]
[]
[]
[]
[]
[]
[]
[]
[]
[]
[null,null,null,"Scheidsrechters",null,null,null,null,"Scheidsrechter 1",null,null,null,null,null,"EW"]
[null,null,null,null,null,null,null,null,"Scheidsrechter 2",null,null,null,null,null,"PD"]
[null,null,null,null,null,null,null,null,"Scheidsrechter 3",null,null,null,null,null,"RH"]
[null,null,null,null,null,null,null,null,"Scheidsrechter 4",null,null,null,null,null,"IG"]

{"sheet":"Finale","index":1,"n_rows":21,"n_cols":39,"rows_kept":21,"cut":false,"hidden":false,"merged":[[9,8,9,9],[9,11,9,14],[9,16,9,19],[9,28,9,31],[20,0,20,1],[20,4,20,7],[20,12,22,18],[18,12,18,18],[11,8,11,9],[11,11,11,14],[11,16,11,19],[11,28,11,31],[12,8,12,9],[12,11,12,14],[12,16,12,19],[12,28,12,31],[8,8,8,9],[8,11,8,14],[3,28,3,31],[3,11,3,14],[3,16,3,19],[4,11,4,14],[4,28,4,31],[4,16,4,19],[8,16,8,19],[8,28,8,31],[5,28,5,31],[6,8,6,9],[6,11,6,14],[6,16,6,19],[6,28,6,31],[0,3,0,27],[5,8,5,9],[5,11,5,14],[5,16,5,19],[3,8,3,9],[4,8,4,9]]}
[null,null,null,"Finale"]
[]
[]
["W7","Veld: 1",null,null,null,null,"13.30 - 13.50",null,null,null,null,{"$f":"VLOOKUP(3,Poule!$A$6:$G$9,2,0)","v":"G1C"},null,null,null,null,{"$f":"VLOOKUP(4,Poule!$O$6:$V$9,2,0)","v":"G2B"},null,null,null,null,1,"-",2,null,null,null,null,"3e poule A – 4e poule B",null,null,null,null,null,null,null,null,"Bekers 1e - 2e"]
["W8","Veld: 2",null,null,null,null,"13.30 - 13.50",null,null,null,null,{"$f":"VLOOKUP(4,Poule!$A$6:$G$9,2,0)","v":"G1D"},null,null,null,null,{"$f":"VLOOKUP(3,Poule!$O$6:$V$9,2,0)","v":"G2C"},null,null,null,null,1,"-",0,null,null,null,null,"4e poule A – 3e poule B",null,null,null,null,null,null,null,null,"Bekers 3e - 4e"]
["W9","Veld: 1",null,null,null,null,"13.50 - 14.10",null,null,null,null,{"$f":"VLOOKUP(1,Poule!$A$6:$G$9,2,0)","v":"G1A"},null,null,null,null,{"$f":"VLOOKUP(2,Poule!$O$6:$V$9,2,0)","v":"G2D"},null,null,null,null,0,"-",1,null,null,null,null,"1e poule A – 2e poule B",null,null,null,null,null,null,null,null,"Bekers 5e - 6e"]
["W10","Veld: 2",null,null,null,null,"13.50 - 14.10",null,null,null,null,{"$f":"VLOOKUP(2,Poule!$A$6:$G$9,2,0)","v":"G1B"},null,null,null,null,{"$f":"VLOOKUP(1,Poule!$O$6:$V$9,2,0)","v":"G2A"},null,null,null,null,1,"-",0,null,null,null,null,"2e poule A – 1e poule B",null,null,null,null,null,null,null,null,"Beker","EZ - toernooi 2015"]
[]
["W11","Veld: 1",null,null,null,null,"14.20 - 14.40",null,null,null,null,{"$f":"IF(V4=\"\",\"\",IF(V4>X4,Q4,L4))","v":"G1C"},null,null,null,null,{"$f":"IF(V5=\"\",\"\",IF(V5>X5,Q5,L5))","v":"G2C"},null,null,null,null,1,"-",0,null,null,null,null,"Verl W 7 – Verl W 8 ",null,null,null,"Wedstrijden: 7e / 8e plaats",null,null,null,null,"Beker","EZ - toernooi 2015"]
["W12","Veld: 1",null,null,null,null,"14.20 - 14.40",null,null,null,null,{"$f":"IF(V4=\"\",\"\",IF(V4>X4,L4,Q4))","v":"G2B"},null,null,null,null,{"$f":"IF(V5=\"\",\"\",IF(V5>X5,L5,Q5))","v":"G1D"},null,null,null,null,4,"-",1,null,null,null,null,"Win W 7 – Win W 8 ",null,null,null,"Wedstrijden: 5e / 6e plaats",null,null,null,null,"Beker","EZ - toernooi 2015"]
[]
["W13","Veld: 1",null,null,null,null,"15.15 - 15.45",null,null,null,null,{"$f":"IF(V6=\"\",\"\",IF(V6>X6,Q6,L6))","v":"G1A"},null,null,null,null,{"$f":"IF(V7=\"\",\"\",IF(V7>X7,Q7,L7))","v":"G2A"},null,null,null,null,2,"-",1,null,null,null,null,"Verliezer W9 – Verliezer W10 ",null,null,null,"3e en 4e plaats",null,null,null,null,"Beker","EZ - toernooi 2015"]
["W14","Veld: 1",null,null,null,null,"17.00 - 17.15",null,null,null,null,{"$f":"IF(V6=\"\",\"\",IF(V6>X6,L6,Q6))","v":"G2D"},null,null,null,null,{"$f":"IF(V7=\"\",\"\",IF(V7>X7,L7,Q7))","v":"G1B"},null,null,null,null,1,"-",3,null,null,null,null,"Winnaar W9 – Winnaar W10 ",null,null,null,"Finale",null,null,null,null,"Beker","EZ - toernooi 2015"]
[null,null,null,null,null,null,null,null,null,null,null,null,null,null,null,null,null,null,null,null,null,null,null,null,null,null,null,null,null,null,null,null,null,null,null,null,null,"Beker","EZ - toernooi 2015"]
[null,null,null,null,null,null,null,null,null,null,null,null,null,null,null,null,null,null,null,null,null,null,null,null,null,null,null,null,null,null,null,null,null,null,null,null,null,"Beker","EZ - toernooi 2015"]
[null,null,null,null,null,null,null,null,null,null,null,null,null,null,null,null,null,null,null,null,null,null,null,null,null,null,null,null,null,null,null,null,null,null,null,null,null,"Beker","EZ - toernooi 2015"]
[]
[]
[]
[]
[null,null,null,null,null,null,null,null,null,null,null,null,{"$f":"IF(V13=\"\",\"\",IF(V13>X13,L13,Q13))","v":"G1B"}]

{"sheet":"GROEP-1","index":2,"n_rows":19,"n_cols":15,"rows_kept":19,"cut":false,"hidden":false,"merged":[[15,1,15,6],[12,10,14,10],[9,2,9,3],[9,5,9,6],[4,0,4,1],[5,0,5,1],[5,2,5,3],[4,2,4,3],[4,5,4,6],[5,5,5,6],[8,0,8,1],[9,0,9,1],[6,2,6,3],[6,5,6,6],[8,2,8,3],[8,5,8,6],[12,8,14,8],[12,9,14,9],[12,11,14,11],[12,12,14,12],[12,13,14,13],[0,14,2,15],[0,0,2,13],[16,1,16,6],[17,1,17,6],[18,1,18,6],[12,0,14,0],[3,0,3,1],[3,2,3,6],[3,7,3,9],[7,2,7,3],[7,5,7,6],[6,0,6,1],[7,0,7,1],[3,11,3,13],[12,1,14,6],[12,7,14,7]]}
["Schoonhoven Toernooi 2015",null,null,null,null,null,null,null,null,null,null,null,null,null,"Scores By:\nOnlineExcelCursus.NL"]
[]
[]
[{"$f":"Poule!D11","v":"Tijd"},{"$f":"Poule!E11","v":0},{"$f":"Poule!G11","v":"VELD 1"},null,null,null,null,{"$f":"Poule!U11","v":"Uitslag"},null,null,null,{"$f":"Poule!Y11","v":"Punten"}]
[{"$f":"Poule!D12","v":"11.00 - 11.20"},{"$f":"Poule!E12","v":"00:00:00"},{"$f":"Poule!G12","v":"G1A"},{"$f":"Poule!H12","v":0},{"$f":"Poule!M12","v":"--"},{"$f":"Poule!N12","v":"G1B"},{"$f":"Poule!O12","v":0},{"$f":"Poule!U12","v":1},{"$f":"Poule!V12","v":"--"},{"$f":"Poule!W12","v":2},null,{"$f":"Poule!Y12","v":0},null,{"$f":"Poule!AA12","v":3}]
[{"$f":"Poule!D13","v":"11.20 - 11.40"},{"$f":"Poule!E13","v":"00:00:00"},{"$f":"Poule!G13","v":"G1C"},{"$f":"Poule!H13","v":0},{"$f":"Poule!M13","v":"--"},{"$f":"Poule!N13","v":"G1D"},{"$f":"Poule!O13","v":0},{"$f":"Poule!U13","v":3},{"$f":"Poule!V13","v":"--"},{"$f":"Poule!W13","v":1},null,{"$f":"Poule!Y13","v":3},null,{"$f":"Poule!AA13","v":0}]
[{"$f":"Poule!D14","v":"11.40 - 12.00"},{"$f":"Poule!E14","v":"00:00:00"},{"$f":"Poule!G14","v":"G1A"},{"$f":"Poule!H14","v":0},{"$f":"Poule!M14","v":"--"},{"$f":"Poule!N14","v":"G1C"},{"$f":"Poule!O14","v":0},{"$f":"Poule!U14","v":3},{"$f":"Poule!V14","v":"--"},{"$f":"Poule!W14","v":2},null,{"$f":"Poule!Y14","v":3},null,{"$f":"Poule!AA14","v":0}]
[{"$f":"Poule!D15","v":"12.00 - 12.20"},{"$f":"Poule!E15","v":"00:00:00"},{"$f":"Poule!G15","v":"G1B"},{"$f":"Poule!H15","v":0},{"$f":"Poule!M15","v":"--"},{"$f":"Poule!N15","v":"G1D"},{"$f":"Poule!O15","v":0},{"$f":"Poule!U15","v":1},{"$f":"Poule!V15","v":"--"},{"$f":"Poule!W15","v":1},null,{"$f":"Poule!Y15","v":1},null,{"$f":"Poule!AA15","v":1}]
[{"$f":"Poule!D16","v":"12.40 - 13.00"},{"$f":"Poule!E16","v":"00:00:00"},{"$f":"Poule!G16","v":"G1A"},{"$f":"Poule!H16","v":0},{"$f":"Poule!M16","v":"--"},{"$f":"Poule!N16","v":"G1D"},{"$f":"Poule!O16","v":0},{"$f":"Poule!U16","v":4},{"$f":"Poule!V16","v":"--"},{"$f":"Poule!W16","v":2},null,{"$f":"Poule!Y16","v":3},null,{"$f":"Poule!AA16","v":0}]
[{"$f":"Poule!D17","v":"13.00 - 13.20"},{"$f":"Poule!E17","v":"00:00:00"},{"$f":"Poule!G17","v":"G1B"},{"$f":"Poule!H17","v":0},{"$f":"Poule!M17","v":"--"},{"$f":"Poule!N17","v":"G1C"},{"$f":"Poule!O17","v":0},{"$f":"Poule!U17","v":2},{"$f":"Poule!V17","v":"--"},{"$f":"Poule!W17","v":2},null,{"$f":"Poule!Y17","v":1},null,{"$f":"Poule!AA17","v":1}]
[]
[]
[{"$f":"Poule!A3","v":"Stand"},{"$f":"Poule!B5","v":"Groep 1"},null,null,null,null,null,{"$f":"Poule!H5","v":"V"},{"$f":"Poule!I5","v":"T"},{"$f":"Poule!J5","v":"P"},{"$f":"Poule!K3","v":"Gewonnen"},{"$f":"Poule!L3","v":"Gelijk"},{"$f":"Poule!M3","v":"Verloren"},{"$f":"Poule!N3","v":"Saldo"}]
[{"$f":"Poule!A4","v":0},null,null,null,null,null,null,null,null,null,{"$f":"Poule!K4","v":0},{"$f":"Poule!L4","v":0},{"$f":"Poule!M4","v":0},{"$f":"Poule!N4","v":0}]
[{"$f":"Poule!A5","v":0},null,null,null,null,null,null,null,null,null,{"$f":"Poule!K5","v":0},{"$f":"Poule!L5","v":0},{"$f":"Poule!M5","v":0},{"$f":"Poule!N5","v":0}]
[{"$f":"Poule!A6","v":1},{"$f":"Poule!B6","v":"G1A"},{"$f":"Poule!C6","v":0},{"$f":"Poule!D6","v":0},{"$f":"Poule!E6","v":0},{"$f":"Poule!F6","v":0},{"$f":"Poule!G6","v":0},{"$f":"Poule!H6","v":8},{"$f":"Poule!I6","v":6},{"$f":"Poule!J6","v":6.0019999999999998},{"$f":"Poule!K6","v":2},{"$f":"Poule!L6","v":0},{"$f":"Poule!M6","v":1},{"$f":"Poule!N6","v":2}]
[{"$f":"Poule!A7","v":2},{"$f":"Poule!B7","v":"G1B"},{"$f":"Poule!C7","v":0},{"$f":"Poule!D7","v":0},{"$f":"Poule!E7","v":0},{"$f":"Poule!F7","v":0},{"$f":"Poule!G7","v":0},{"$f":"Poule!H7","v":5},{"$f":"Poule!I7","v":4},{"$f":"Poule!J7","v":5.0010000000000003},{"$f":"Poule!K7","v":1},{"$f":"Poule!L7","v":2},{"$f":"Poule!M7","v":0},{"$f":"Poule!N7","v":1}]
[{"$f":"Poule!A8","v":3},{"$f":"Poule!B8","v":"G1C"},{"$f":"Poule!C8","v":0},{"$f":"Poule!D8","v":0},{"$f":"Poule!E8","v":0},{"$f":"Poule!F8","v":0},{"$f":"Poule!G8","v":0},{"$f":"Poule!H8","v":7},{"$f":"Poule!I8","v":6},{"$f":"Poule!J8","v":4.0009999999999994},{"$f":"Poule!K8","v":1},{"$f":"Poule!L8","v":1},{"$f":"Poule!M8","v":1},{"$f":"Poule!N8","v":1}]
[{"$f":"Poule!A9","v":4},{"$f":"Poule!B9","v":"G1D"},{"$f":"Poule!C9","v":0},{"$f":"Poule!D9","v":0},{"$f":"Poule!E9","v":0},{"$f":"Poule!F9","v":0},{"$f":"Poule!G9","v":0},{"$f":"Poule!H9","v":4},{"$f":"Poule!I9","v":8},{"$f":"Poule!J9","v":0.996},{"$f":"Poule!K9","v":0},{"$f":"Poule!L9","v":1},{"$f":"Poule!M9","v":2},{"$f":"Poule!N9","v":-4}]

{"sheet":"GROEP-2","index":3,"n_rows":20,"n_cols":13,"rows_kept":20,"cut":false,"hidden":false,"merged":[[19,1,19,4],[7,0,7,1],[8,0,8,1],[13,11,15,11],[4,0,4,1],[5,0,5,1],[13,0,15,0],[13,1,15,4],[13,5,15,5],[0,12,2,13],[16,1,16,4],[17,1,17,4],[18,1,18,4],[0,0,2,11],[3,5,3,7],[3,9,3,11],[3,0,3,1],[3,2,3,4],[9,0,9,1],[6,0,6,1],[13,8,15,8],[13,9,15,9],[13,10,15,10],[13,7,15,7],[13,6,15,6]]}
["Schoonhoven Toernooi 2015",null,null,null,null,null,null,null,null,null,null,null,"Scores By:\nOnlineExcelCursus.NL"]
[]
[]
[{"$f":"Poule!AC11","v":"Tijd"},null,{"$f":"Poule!AF11","v":"VELD 2"},null,null,{"$f":"Poule!AT11","v":"Uitslag"},null,null,null,{"$f":"Poule!AX11","v":"Punten"}]
[{"$f":"Poule!AC12","v":"11.00 - 11.20"},{"$f":"Poule!AD12","v":"00:00:00"},{"$f":"Poule!AF12","v":"G2A"},{"$f":"Poule!AL12","v":"--"},{"$f":"Poule!AM12","v":"G2B"},{"$f":"Poule!AT12","v":1},{"$f":"Poule!AU12","v":"--"},{"$f":"Poule!AV12","v":0},null,{"$f":"Poule!AX12","v":3},null,{"$f":"Poule!AZ12","v":0}]
[{"$f":"Poule!AC13","v":"11.20 - 11.40"},{"$f":"Poule!AD13","v":"00:00:00"},{"$f":"Poule!AF13","v":"G2C"},{"$f":"Poule!AL13","v":"--"},{"$f":"Poule!AM13","v":"G2D"},{"$f":"Poule!AT13","v":1},{"$f":"Poule!AU13","v":"--"},{"$f":"Poule!AV13","v":0},null,{"$f":"Poule!AX13","v":3},null,{"$f":"Poule!AZ13","v":0}]
[{"$f":"Poule!AC14","v":"11.40 - 12.00"},{"$f":"Poule!AD14","v":"00:00:00"},{"$f":"Poule!AF14","v":"G2A"},{"$f":"Poule!AL14","v":"--"},{"$f":"Poule!AM14","v":"G2C"},{"$f":"Poule!AT14","v":1},{"$f":"Poule!AU14","v":"--"},{"$f":"Poule!AV14","v":1},null,{"$f":"Poule!AX14","v":1},null,{"$f":"Poule!AZ14","v":1}]
[{"$f":"Poule!AC15","v":"12.00 - 12.20"},{"$f":"Poule!AD15","v":"00:00:00"},{"$f":"Poule!AF15","v":"G2B"},{"$f":"Poule!AL15","v":"--"},{"$f":"Poule!AM15","v":"G2D"},{"$f":"Poule!AT15","v":1},{"$f":"Poule!AU15","v":"--"},{"$f":"Poule!AV15","v":2},null,{"$f":"Poule!AX15","v":0},null,{"$f":"Poule!AZ15","v":3}]
[{"$f":"Poule!AC16","v":"12.40 - 13.00"},{"$f":"Poule!AD16","v":"00:00:00"},{"$f":"Poule!AF16","v":"G2A"},{"$f":"Poule!AL16","v":"--"},{"$f":"Poule!AM16","v":"G2D"},{"$f":"Poule!AT16","v":1},{"$f":"Poule!AU16","v":"--"},{"$f":"Poule!AV16","v":1},null,{"$f":"Poule!AX16","v":1},null,{"$f":"Poule!AZ16","v":1}]
[{"$f":"Poule!AC17","v":"13.00 - 13.20"},{"$f":"Poule!AD17","v":"00:00:00"},{"$f":"Poule!AF17","v":"G2B"},{"$f":"Poule!AL17","v":"--"},{"$f":"Poule!AM17","v":"G2C"},{"$f":"Poule!AT17","v":4},{"$f":"Poule!AU17","v":"--"},{"$f":"Poule!AV17","v":0},null,{"$f":"Poule!AX17","v":3},null,{"$f":"Poule!AZ17","v":0}]
[]
[]
[]
[{"$f":"Poule!O3","v":"Stand"},{"$f":"Poule!P5","v":"Groep 2"},null,null,null,{"$f":"Poule!W5","v":"V"},{"$f":"Poule!X5","v":"T"},{"$f":"Poule!Y5","v":"P"},{"$f":"Poule!Z3","v":"Gewonnen"},{"$f":"Poule!AA3","v":"Gelijk"},{"$f":"Poule!AB3","v":"Verloren"},{"$f":"Poule!AC3","v":"Saldo"}]
[{"$f":"Poule!O4","v":0},null,null,null,null,null,null,null,{"$f":"Poule!Z4","v":0},{"$f":"Poule!AA4","v":0},{"$f":"Poule!AB4","v":0},{"$f":"Poule!AC4","v":0}]
[{"$f":"Poule!O5","v":0},null,null,null,null,null,null,null,{"$f":"Poule!Z5","v":0},{"$f":"Poule!AA5","v":0},{"$f":"Poule!AB5","v":0},{"$f":"Poule!AC5","v":0}]
[{"$f":"Poule!O6","v":1},{"$f":"Poule!P6","v":"G2A"},null,null,null,{"$f":"Poule!W6","v":3},{"$f":"Poule!X6","v":2},{"$f":"Poule!Y6","v":5.0010000000000003},{"$f":"Poule!Z6","v":1},{"$f":"Poule!AA6","v":2},{"$f":"Poule!AB6","v":0},{"$f":"Poule!AC6","v":1}]
[{"$f":"Poule!O7","v":4},{"$f":"Poule!P7","v":"G2B"},null,null,null,{"$f":"Poule!W7","v":5},{"$f":"Poule!X7","v":3},{"$f":"Poule!Y7","v":3.0019999999999998},{"$f":"Poule!Z7","v":1},{"$f":"Poule!AA7","v":0},{"$f":"Poule!AB7","v":2},{"$f":"Poule!AC7","v":2}]
[{"$f":"Poule!O8","v":3},{"$f":"Poule!P8","v":"G2C"},null,null,null,{"$f":"Poule!W8","v":2},{"$f":"Poule!X8","v":5},{"$f":"Poule!Y8","v":3.9969999999999999},{"$f":"Poule!Z8","v":1},{"$f":"Poule!AA8","v":1},{"$f":"Poule!AB8","v":1},{"$f":"Poule!AC8","v":-3}]
[{"$f":"Poule!O9","v":2},{"$f":"Poule!P9","v":"G2D"},null,null,null,{"$f":"Poule!W9","v":3},{"$f":"Poule!X9","v":3},{"$f":"Poule!Y9","v":4},{"$f":"Poule!Z9","v":1},{"$f":"Poule!AA9","v":1},{"$f":"Poule!AB9","v":1},{"$f":"Poule!AC9","v":0}]