{"text_format":"1","workbook":"xlsx","n_sheets":4,"sheets":["Poule","Finale","GROEP-1","GROEP-2"],"not_rendered":{"charts":0,"images":5,"macros":1,"external_links":0,"defined_names":0,"comments":0,"pivot_tables":0},"unopened":[],"bounds":{"document_bytes":16777216,"sheet_cells":100000,"rows_first":2000,"rows_last":500,"rows_between":2000,"halvings":0,"cell_chars":16384,"cell_head_chars":4096},"cells_cut":0,"cells_raw":0,"read":"whole","date_system":"1900"}

{"sheet":"Poule","index":0,"n_rows":45,"n_cols":69,"rows_kept":45,"cut":false,"hidden":false,"merged":[[11,45,11,46],[5,1,5,7],[6,1,6,7],[7,1,7,7],[8,1,8,7],[9,1,9,7],[4,1,4,6],[2,0,4,0],[2,12,4,12],[2,11,4,11],[2,10,4,10],[20,38,20,43],[21,3,21,4],[21,6,21,11],[21,13,21,18],[21,28,21,29],[21,31,21,36],[21,38,21,43],[20,3,20,4],[20,6,20,11],[20,13,20,18],[20,28,20,29],[20,31,20,36],[18,38,18,43],[19,3,19,4],[19,6,19,11],[19,13,19,18],[19,28,19,29],[19,31,19,36],[19,38,19,43],[18,3,18,4],[18,6,18,11],[18,13,18,18],[18,28,18,29],[18,31,18,36],[6,15,6,21],[12,13,12,18],[15,28,15,29],[16,28,16,29],[7,15,7,21],[9,15,9,21],[2,27,4,27],[2,14,4,14],[4,15,4,21],[2,13,4,13],[2,25,4,25],[2,26,4,26],[2,28,4,28],[11,3,11,4],[11,6,11,18],[13,3,13,4],[8,15,8,21],[11,20,11,21],[14,6,14,11],[12,3,12,4],[14,3,14,4],[14,13,14,18],[16,3,16,4],[13,6,13,11],[12,6,12,11],[13,13,13,18],[17,13,17,18],[15,13,15,18],[15,3,15,4],[17,3,17,4],[17,6,17,11],[16,6,16,11],[15,6,15,11],[16,13,16,18],[0,0,1,49],[5,15,5,21],[11,31,11,43],[13,28,13,29],[12,38,12,43],[11,24,11,26],[11,28,11,29],[11,49,11,51],[12,28,12,29],[17,31,17,36],[17,38,17,43],[16,31,16,36],[15,31,15,36],[14,31,14,36],[14,38,14,43],[13,38,13,43],[13,31,13,36],[12,31,12,36],[17,28,17,29],[16,38,16,43],[15,38,15,43],[14,28,14,29]]}
["Toernooi 2 poules 5 teams",null,null,null,null,null,null,null,null,null,null,null,null,null,null,null,null,null,null,null,null,null,null,null,null,null,null,null,null,null,null,null,null,null,null,null,null,null,null,null,null,null,null,null,null,null,null,null,null,null,{"$f":"COUNTA(U13:W18)","v":18},{"$f":"COUNTA(AT13:AV18)","v":18},{"$f":"COUNTA(U21:W26)","v":6},{"$f":"COUNTA(AT21:AV26)","v":6},null,null,null,null,null,null,null,{"$f":"VALUE(A6)","v":3},{"$f":"B6","v":"PA TEAM 1"},{"$f":"VALUE(O6)","v":4},{"$f":"P6","v":"PB TEAM 1"},{"$f":"VALUE(AD6)","v":0},{"$f":"AE6","v":0},{"$f":"VALUE(AR6)","v":0},{"$f":"AS6","v":0}]
[null,null,null,null,null,null,null,null,null,null,null,null,null,null,null,null,null,null,null,null,null,null,null,null,null,null,null,null,null,null,null,null,null,null,null,null,null,null,null,null,null,null,null,null,null,null,null,null,null,null,null,null,null,null,null,null,null,null,null,null,null,{"$f":"VALUE(A7)","v":5},{"$f":"B7","v":"PA TEAM 2"},{"$f":"VALUE(O7)","v":1},{"$f":"P7","v":"PB TEAM 2"},{"$f":"VALUE(AD7)","v":0},{"$f":"AE7","v":0},{"$f":"VALUE(AR7)","v":0},{"$f":"AS7","v":0}]
["Stand",null,null,null,null,null,null,null,null,null,"Gewonnen","Gelijk","Verloren","Saldo","Stand",null,null,null,null,null,null,null,null,null,null,"Gewonnen","Gelijk","Verloren","Saldo",null,null,null,null,null,null,null,null,null,null,null,null,null,null,null,null,null,null,null,null,null,null,null,null,null,null,null,null,null,null,null,null,{"$f":"VALUE(A8)","v":1},{"$f":"B8","v":"PA TEAM 3"},{"$f":"VALUE(O8)","v":2},{"$f":"P8","v":"PB TEAM 3"},{"$f":"VALUE(AD8)","v":0},{"$f":"AE8","v":0},{"$f":"VALUE(AR8)","v":0},{"$f":"AS8","v":0}]
[null,null,null,null,null,null,null,null,null,null,null,null,null,null,null,null,null,null,null,null,null,null,null,null,null,null,null,null,null,null,null,null,null,null,null,null,null,null,null,null,null,null,null,null,null,null,null,null,null,null,null,null,null,null,null,null,null,null,null,null,null,{"$f":"VALUE(A9)","v":2},{"$f":"B9","v":"PA TEAM 4"},{"$f":"VALUE(O9)","v":3},{"$f":"P9","v":"PB TEAM 4"},{"$f":"VALUE(AD9)","v":0},{"$f":"AE9","v":0},{"$f":"VALUE(AR9)","v":0},{"$f":"AS9","v":0}]
[null,"Groep 1",null,null,null,null,null,"V","T","P",null,null,null,null,null,"Groep 2",null,null,null,null,null,null,"V","T","P",null,null,null,null,null,null,null,null,null,null,null,null,null,null,null,null,null,null,null,null,null,null,null,null,null,null,null,null,null,null,null,null,null,null,null,null,{"$f":"VALUE(A10)","v":4},{"$f":"B10","v":"PA TEAM 5"},{"$f":"VALUE(O10)","v":5},{"$f":"P10","v":"PB TEAM 5"},{"$f":"VALUE(AD10)","v":0},{"$f":"AE10","v":0},{"$f":"VALUE(AR10)","v":0},{"$f":"AS10","v":0}]
[{"$f":"RANK(J6,$J$6:$J$10,0)","v":3},"PA TEAM 1",null,null,null,null,null,{"$f":"SUMIF($G$13:$L$22,B6,$U$13:$U$22)+SUMIF($N$13:$S$22,B6,$W$13:$W$22)","v":11},{"$f":"SUMIF($G$13:$L$22,B6,$W$13:$W$22)+SUMIF($N$13:$S$22,B6,$U$13:$U$22)","v":12},{"$f":"(K6*2)+L6+(H6*0.001)-(I6*0.001)+(H6*0.00001)","v":3.9991099999999999},{"$f":"SUMPRODUCT(($G$13:$L$22=B6)*($Y$13:$Y$22=2))+SUMPRODUCT(($N$13:$S$22=B6)*($AA$13:$AA$22=2))","v":1},{"$f":"SUMPRODUCT(($G$13:$L$22=B6)*($Y$13:$Y$22=1))+SUMPRODUCT(($N$13:$S$22=B6)*($AA$13:$AA$22=1))","v":2},{"$f":"SUMPRODUCT(($G$13:$L$22=B6)*($Y$13:$Y$22=0))+SUMPRODUCT(($N$13:$S$22=B6)*($AA$13:$AA$22=0))","v":1},{"$f":"H6-I6","v":-1},{"$f":"RANK(Y6,$Y$6:$Y$10,0)","v":4},"PB TEAM 1",null,null,null,null,null,null,{"$f":"SUMIF($AF$13:$AK$22,P6,$AT$13:$AT$22)+SUMIF($AM$13:$AR$22,P6,$AV$13:$AV$22)","v":15},{"$f":"SUMIF($AF$13:$AK$22,P6,$AV$13:$AV$22)+SUMIF($AM$13:$AR$22,P6,$AT$13:$AT$22)","v":20},{"$f":"(Z6*2)+AA6+(W6*0.001)-(X6*0.001)+(W6*0.00001)","v":3.9951499999999998},{"$f":"SUMPRODUCT(($AF$13:$AK$22=P6)*($AX$13:$AX$22=2))+SUMPRODUCT(($AM$13:$AR$22=P6)*($AZ$13:$AZ$22=2))","v":2},{"$f":"SUMPRODUCT(($AF$13:$AK$22=P6)*($AX$13:$AX$22=1))+SUMPRODUCT(($AM$13:$AR$22=P6)*($AZ$13:$AZ$22=1))","v":0},{"$f":"SUMPRODUCT(($AF$13:$AK$22=P6)*($AX$13:$AX$22=0))+SUMPRODUCT(($AM$13:$AR$22=P6)*($AZ$13:$AZ$22=0))","v":2},{"$f":"W6-X6","v":-5}]
[{"$f":"RANK(J7,$J$6:$J$10,0)","v":5},"PA TEAM 2",null,null,null,null,null,{"$f":"SUMIF($G$13:$L$22,B7,$U$13:$U$22)+SUMIF($N$13:$S$22,B7,$W$13:$W$22)","v":10},{"$f":"SUMIF($G$13:$L$22,B7,$W$13:$W$22)+SUMIF($N$13:$S$22,B7,$U$13:$U$22)","v":10},{"$f":"(K7*2)+L7+(H7*0.001)-(I7*0.001)+(H7*0.00001)","v":2.0000999999999998},{"$f":"SUMPRODUCT(($G$13:$L$22=B7)*($Y$13:$Y$22=2))+SUMPRODUCT(($N$13:$S$22=B7)*($AA$13:$AA$22=2))","v":1},{"$f":"SUMPRODUCT(($G$13:$L$22=B7)*($Y$13:$Y$22=1))+SUMPRODUCT(($N$13:$S$22=B7)*($AA$13:$AA$22=1))","v":0},{"$f":"SUMPRODUCT(($G$13:$L$22=B7)*($Y$13:$Y$22=0))+SUMPRODUCT(($N$13:$S$22=B7)*($AA$13:$AA$22=0))","v":3},{"$f":"H7-I7","v":0},{"$f":"RANK(Y7,$Y$6:$Y$10,0)","v":1},"PB TEAM 2",null,null,null,null,null,null,{"$f":"SUMIF($AF$13:$AK$22,P7,$AT$13:$AT$22)+SUMIF($AM$13:$AR$22,P7,$AV$13:$AV$22)","v":16},{"$f":"SUMIF($AF$13:$AK$22,P7,$AV$13:$AV$22)+SUMIF($AM$13:$AR$22,P7,$AT$13:$AT$22)","v":7},{"$f":"(Z7*2)+AA7+(W7*0.001)-(X7*0.001)+(W7*0.00001)","v":5.0091600000000005},{"$f":"SUMPRODUCT(($AF$13:$AK$22=P7)*($AX$13:$AX$22=2))+SUMPRODUCT(($AM$13:$AR$22=P7)*($AZ$13:$AZ$22=2))","v":2},{"$f":"SUMPRODUCT(($AF$13:$AK$22=P7)*($AX$13:$AX$22=1))+SUMPRODUCT(($AM$13:$AR$22=P7)*($AZ$13:$AZ$22=1))","v":1},{"$f":"SUMPRODUCT(($AF$13:$AK$22=P7)*($AX$13:$AX$22=0))+SUMPRODUCT(($AM$13:$AR$22=P7)*($AZ$13:$AZ$22=0))","v":1},{"$f":"W7-X7","v":9}]
[{"$f":"RANK(J8,$J$6:$J$10,0)","v":1},"PA TEAM 3",null,null,null,null,null,{"$f":"SUMIF($G$13:$L$22,B8,$U$13:$U$22)+SUMIF($N$13:$S$22,B8,$W$13:$W$22)","v":16},{"$f":"SUMIF($G$13:$L$22,B8,$W$13:$W$22)+SUMIF($N$13:$S$22,B8,$U$13:$U$22)","v":11},{"$f":"(K8*2)+L8+(H8*0.001)-(I8*0.001)+(H8*0.00001)","v":6.0051600000000001},{"$f":"SUMPRODUCT(($G$13:$L$22=B8)*($Y$13:$Y$22=2))+SUMPRODUCT(($N$13:$S$22=B8)*($AA$13:$AA$22=2))","v":3},{"$f":"SUMPRODUCT(($G$13:$L$22=B8)*($Y$13:$Y$22=1))+SUMPRODUCT(($N$13:$S$22=B8)*($AA$13:$AA$22=1))","v":0},{"$f":"SUMPRODUCT(($G$13:$L$22=B8)*($Y$13:$Y$22=0))+SUMPRODUCT(($N$13:$S$22=B8)*($AA$13:$AA$22=0))","v":1},{"$f":"H8-I8","v":5},{"$f":"RANK(Y8,$Y$6:$Y$10,0)","v":2},"PB TEAM 3",null,null,null,null,null,null,{"$f":"SUMIF($AF$13:$AK$22,P8,$AT$13:$AT$22)+SUMIF($AM$13:$AR$22,P8,$AV$13:$AV$22)","v":14},{"$f":"SUMIF($AF$13:$AK$22,P8,$AV$13:$AV$22)+SUMIF($AM$13:$AR$22,P8,$AT$13:$AT$22)","v":13},{"$f":"(Z8*2)+AA8+(W8*0.001)-(X8*0.001)+(W8*0.00001)","v":4.0011400000000004},{"$f":"SUMPRODUCT(($AF$13:$AK$22=P8)*($AX$13:$AX$22=2))+SUMPRODUCT(($AM$13:$AR$22=P8)*($AZ$13:$AZ$22=2))","v":1},{"$f":"SUMPRODUCT(($AF$13:$AK$22=P8)*($AX$13:$AX$22=1))+SUMPRODUCT(($AM$13:$AR$22=P8)*($AZ$13:$AZ$22=1))","v":2},{"$f":"SUMPRODUCT(($AF$13:$AK$22=P8)*($AX$13:$AX$22=0))+SUMPRODUCT(($AM$13:$AR$22=P8)*($AZ$13:$AZ$22=0))","v":1},{"$f":"W8-X8","v":1}]
[{"$f":"RANK(J9,$J$6:$J$10,0)","v":2},"PA TEAM 4",null,null,null,null,null,{"$f":"SUMIF($G$13:$L$22,B9,$U$13:$U$22)+SUMIF($N$13:$S$22,B9,$W$13:$W$22)","v":10},{"$f":"SUMIF($G$13:$L$22,B9,$W$13:$W$22)+SUMIF($N$13:$S$22,B9,$U$13:$U$22)","v":8},{"$f":"(K9*2)+L9+(H9*0.001)-(I9*0.001)+(H9*0.00001)","v":5.0020999999999995},{"$f":"SUMPRODUCT(($G$13:$L$22=B9)*($Y$13:$Y$22=2))+SUMPRODUCT(($N$13:$S$22=B9)*($AA$13:$AA$22=2))","v":2},{"$f":"SUMPRODUCT(($G$13:$L$22=B9)*($Y$13:$Y$22=1))+SUMPRODUCT(($N$13:$S$22=B9)*($AA$13:$AA$22=1))","v":1},{"$f":"SUMPRODUCT(($G$13:$L$22=B9)*($Y$13:$Y$22=0))+SUMPRODUCT(($N$13:$S$22=B9)*($AA$13:$AA$22=0))","v":1},{"$f":"H9-I9","v":2},{"$f":"RANK(Y9,$Y$6:$Y$10,0)","v":3},"PB TEAM 4",null,null,null,null,null,null,{"$f":"SUMIF($AF$13:$AK$22,P9,$AT$13:$AT$22)+SUMIF($AM$13:$AR$22,P9,$AV$13:$AV$22)","v":12},{"$f":"SUMIF($AF$13:$AK$22,P9,$AV$13:$AV$22)+SUMIF($AM$13:$AR$22,P9,$AT$13:$AT$22)","v":12},{"$f":"(Z9*2)+AA9+(W9*0.001)-(X9*0.001)+(W9*0.00001)","v":4.0001199999999999},{"$f":"SUMPRODUCT(($AF$13:$AK$22=P9)*($AX$13:$AX$22=2))+SUMPRODUCT(($AM$13:$AR$22=P9)*($AZ$13:$AZ$22=2))","v":2},{"$f":"SUMPRODUCT(($AF$13:$AK$22=P9)*($AX$13:$AX$22=1))+SUMPRODUCT(($AM$13:$AR$22=P9)*($AZ$13:$AZ$22=1))","v":0},{"$f":"SUMPRODUCT(($AF$13:$AK$22=P9)*($AX$13:$AX$22=0))+SUMPRODUCT(($AM$13:$AR$22=P9)*($AZ$13:$AZ$22=0))","v":2},{"$f":"W9-X9","v":0}]
[{"$f":"RANK(J10,$J$6:$J$10,0)","v":4},"PA TEAM 5",null,null,null,null,null,{"$f":"SUMIF($G$13:$L$22,B10,$U$13:$U$22)+SUMIF($N$13:$S$22,B10,$W$13:$W$22)","v":11},{"$f":"SUMIF($G$13:$L$22,B10,$W$13:$W$22)+SUMIF($N$13:$S$22,B10,$U$13:$U$22)","v":17},{"$f":"(K10*2)+L10+(H10*0.001)-(I10*0.001)+(H10*0.00001)","v":2.99411},{"$f":"SUMPRODUCT(($G$13:$L$22=B10)*($Y$13:$Y$22=2))+SUMPRODUCT(($N$13:$S$22=B10)*($AA$13:$AA$22=2))","v":1},{"$f":"SUMPRODUCT(($G$13:$L$22=B10)*($Y$13:$Y$22=1))+SUMPRODUCT(($N$13:$S$22=B10)*($AA$13:$AA$22=1))","v":1},{"$f":"SUMPRODUCT(($G$13:$L$22=B10)*($Y$13:$Y$22=0))+SUMPRODUCT(($N$13:$S$22=B10)*($AA$13:$AA$22=0))","v":2},{"$f":"H10-I10","v":-6},{"$f":"RANK(Y10,$Y$6:$Y$10,0)","v":5},"PB TEAM 5",null,null,null,null,null,null,{"$f":"SUMIF($AF$13:$AK$22,P10,$AT$13:$AT$22)+SUMIF($AM$13:$AR$22,P10,$AV$13:$AV$22)","v":9},{"$f":"SUMIF($AF$13:$AK$22,P10,$AV$13:$AV$22)+SUMIF($AM$13:$AR$22,P10,$AT$13:$AT$22)","v":14},{"$f":"(Z10*2)+AA10+(W10*0.001)-(X10*0.001)+(W10*0.00001)","v":2.9950900000000003},{"$f":"SUMPRODUCT(($AF$13:$AK$22=P10)*($AX$13:$AX$22=2))+SUMPRODUCT(($AM$13:$AR$22=P10)*($AZ$13:$AZ$22=2))","v":1},{"$f":"SUMPRODUCT(($AF$13:$AK$22=P10)*($AX$13:$AX$22=1))+SUMPRODUCT(($AM$13:$AR$22=P10)*($AZ$13:$AZ$22=1))","v":1},{"$f":"SUMPRODUCT(($AF$13:$AK$22=P10)*($AX$13:$AX$22=0))+SUMPRODUCT(($AM$13:$AR$22=P10)*($AZ$13:$AZ$22=0))","v":2},{"$f":"W10-X10","v":-5}]
[]
[null,null,null,"Tijd",null,null,"VELD 1",null,null,null,null,null,null,null,null,null,null,null,null,null,"Uitslag",null,null,null,"Punten",null,null,null,"Tijd",null,null,"VELD 2",null,null,null,null,null,null,null,null,null,null,null,null,null,"Uitslag",null,null,null,"Punten"]
[null,null,null,"09:00:00",null,null,{"$f":"B6","v":"PA TEAM 1"},null,null,null,null,null,"--",{"$f":"B7","v":"PA TEAM 2"},null,null,null,null,null,null,3,"--",2,null,{"$f":"IF(U13=\"\",\"\",IF(U13>W13,2,IF(U13=W13,1,0)))","v":2},null,{"$f":"IF(W13=\"\",\"\",IF(W13>U13,2,IF(W13=U13,1,0)))","v":0},null,"09:00:00",null,null,{"$f":"P6","v":"PB TEAM 1"},null,null,null,null,null,"--",{"$f":"P7","v":"PB TEAM 2"},null,null,null,null,null,null,1,"--",8,null,{"$f":"IF(AT13=\"\",\"\",IF(AT13>AV13,2,IF(AT13=AV13,1,0)))","v":0},null,{"$f":"IF(AV13=\"\",\"\",IF(AV13>AT13,2,IF(AV13=AT13,1,0)))","v":2}]
[null,null,null,"09:20:00",null,null,{"$f":"B8","v":"PA TEAM 3"},null,null,null,null,null,"--",{"$f":"B9","v":"PA TEAM 4"},null,null,null,null,null,null,5,"--",0,null,2,null,0,null,"09:20:00",null,null,{"$f":"P8","v":"PB TEAM 3"},null,null,null,null,null,"--",{"$f":"P9","v":"PB TEAM 4"},null,null,null,null,null,null,2,"--",6,null,0,null,2]
[null,null,null,"09:40:00",null,null,{"$f":"B10","v":"PA TEAM 5"},null,null,null,null,null,"--",{"$f":"B6","v":"PA TEAM 1"},null,null,null,null,null,null,5,"--",5,null,1,null,1,null,"09:40:00",null,null,{"$f":"P10","v":"PB TEAM 5"},null,null,null,null,null,"--",{"$f":"P6","v":"PB TEAM 1"},null,null,null,null,null,null,3,"--",8,null,0,null,2]
{"$rows_left_out":31}
{"sheet":"Finale","index":1,"n_rows":25,"n_cols":39,"rows_kept":25,"cut":false,"hidden":false,"merged":[[11,8,11,9],[11,11,11,14],[11,16,11,19],[4,28,4,31],[11,28,11,31],[13,8,13,9],[13,11,13,14],[13,16,13,19],[13,28,13,31],[24,0,24,1],[24,4,24,7],[24,12,26,18],[22,12,22,18],[15,8,15,9],[15,11,15,14],[15,16,15,19],[15,28,15,31],[16,8,16,9],[16,11,16,14],[16,16,16,19],[16,28,16,31],[12,8,12,9],[12,11,12,14],[3,28,3,31],[3,11,3,14],[3,16,3,19],[5,11,5,14],[5,28,5,31],[5,16,5,19],[12,16,12,19],[12,28,12,31],[6,28,6,31],[7,8,7,9],[7,11,7,14],[7,16,7,19],[7,28,7,31],[4,8,4,9],[0,3,0,27],[6,8,6,9],[6,11,6,14],[6,16,6,19],[3,8,3,9],[5,8,5,9],[4,11,4,14],[4,16,4,19]]}
[null,null,null,"Finale"]
[]
[]
["W6","Veld: 1",null,null,null,null,"12.10 - 12.30",null,null,null,null,{"$f":"VLOOKUP(5,Poule!$A$6:$G$10,2,0)","v":"PA TEAM 2"},null,null,null,null,{"$f":"VLOOKUP(5,Poule!$O$6:$V$10,2,0)","v":"PB TEAM 5"},null,null,null,null,1,"-",2,null,null,null,null,"5e poule A – 5e poule B",null,null,null,null,null,null,null,null,"Bekers 1e - 2e"]
["W7","Veld: 2",null,null,null,null,"12.10 - 12.30",null,null,null,null,{"$f":"VLOOKUP(4,Poule!$A$6:$G$10,2,0)","v":"PA TEAM 5"},null,null,null,null,{"$f":"VLOOKUP(4,Poule!$O$6:$V$10,2,0)","v":"PB TEAM 1"},null,null,null,null,1,"-",2,null,null,null,null,"4e poule A – 4e poule B"]
["W8","Veld: 3",null,null,null,null,"12.10 - 12.30",null,null,null,null,{"$f":"VLOOKUP(3,Poule!$A$6:$G$10,2,0)","v":"PA TEAM 1"},null,null,null,null,{"$f":"VLOOKUP(3,Poule!$O$6:$V$10,2,0)","v":"PB TEAM 4"},null,null,null,null,1,"-",0,null,null,null,null,"3e poule A – 3e poule B",null,null,null,null,null,null,null,null,"Bekers 3e - 4e"]
["W9","Veld: 1",null,null,null,null,"12.40 - 13.00",null,null,null,null,{"$f":"VLOOKUP(2,Poule!$A$6:$G$10,2,0)","v":"PA TEAM 4"},null,null,null,null,{"$f":"VLOOKUP(2,Poule!$O$6:$V$10,2,0)","v":"PB TEAM 3"},null,null,null,null,0,"-",1,null,null,null,null,"2e poule A – 2e poule B",null,null,null,null,null,null,null,null,"Bekers 5e - 6e"]
["W10","Veld: 2",null,null,null,null,"12.40 - 13.00",null,null,null,null,{"$f":"VLOOKUP(1,Poule!$A$6:$G$10,2,0)","v":"PA TEAM 3"},null,null,null,null,{"$f":"VLOOKUP(1,Poule!$O$6:$V$10,2,0)","v":"PB TEAM 2"},null,null,null,null,1,"-",0,null,null,null,null,"1e poule A – 1e poule B",null,null,null,null,null,null,null,null,"Beker","EZ - toernooi 2015"]
[]
[]
[]
["W11","Veld: 1",null,null,null,null,"13.10 - 13.30",null,null,null,null,{"$f":"IF(V4=\"\",\"\",IF(V4>X4,Q4,L4))","v":"PA TEAM 2"},null,null,null,null,{"$f":"IF(V5=\"\",\"\",IF(V5>X5,Q5,L5))","v":"PA TEAM 5"},null,null,null,null,1,"-",0,null,null,null,null,"Verl W6 – Verl W7 ",null,null,null,"Wedstrijden: 9e / 10e plaats"]
["W12","Veld: 2",null,null,null,null,"13.10 - 13.30",null,null,null,null,{"$f":"IF(V4=\"\",\"\",IF(V4>X4,L4,Q4))","v":"PB TEAM 5"},null,null,null,null,{"$f":"IF(V6=\"\",\"\",IF(V6>X6,Q6,L6))","v":"PB TEAM 4"},null,null,null,null,1,"-",0,null,null,null,null,"Win W6 – Verl W8",null,null,null,"Wedstrijden: 7e / 8e plaats",null,null,null,null,"Beker","EZ - toernooi 2015"]
["W13","Veld: 3",null,null,null,null,"13.10 - 13.30",null,null,null,null,{"$f":"IF(V5=\"\",\"\",IF(V5>X5,L5,Q5))","v":"PB TEAM 1"},null,null,null,null,{"$f":"IF(V6=\"\",\"\",IF(V6>X6,L6,Q6))","v":"PA TEAM 1"},null,null,null,null,4,"-",1,null,null,null,null,"Win W7 – Win W8 ",null,null,null,"Wedstrijden: 5e / 6e plaats",null,null,null,null,"Beker","EZ - toernooi 2015"]
[]
{"$rows_left_out":11}
{"sheet":"GROEP-1","index":2,"n_rows":24,"n_cols":15,"rows_kept":24,"cut":false,"hidden":false,"merged":[[11,5,11,6],[12,2,12,3],[12,5,12,6],[11,0,11,1],[4,0,4,1],[5,0,5,1],[8,0,8,1],[6,0,6,1],[7,0,7,1],[13,0,13,1],[21,1,21,6],[9,2,9,3],[9,5,9,6],[10,0,10,1],[12,0,12,1],[10,2,10,3],[10,5,10,6],[11,2,11,3],[19,1,19,6],[16,10,18,10],[13,2,13,3],[13,5,13,6],[5,2,5,3],[4,2,4,3],[4,5,4,6],[5,5,5,6],[9,0,9,1],[6,2,6,3],[6,5,6,6],[8,2,8,3],[8,5,8,6],[16,8,18,8],[16,9,18,9],[16,11,18,11],[16,12,18,12],[16,13,18,13],[0,14,2,15],[0,0,2,13],[20,1,20,6],[22,1,22,6],[23,1,23,6],[16,0,18,0],[3,0,3,1],[3,2,3,6],[3,7,3,9],[7,2,7,3],[7,5,7,6],[3,11,3,13],[16,1,18,6],[16,7,18,7]]}
["Toernooi 2 poules 5 teams",null,null,null,null,null,null,null,null,null,null,null,null,null,"Scores By:\nOnlineExcelCursus.NL"]
[]
[]
[{"$f":"Poule!D12","v":"Tijd"},{"$f":"Poule!E12","v":0},{"$f":"Poule!G12","v":"VELD 1"},null,null,null,null,{"$f":"Poule!U12","v":"Uitslag"},null,null,null,{"$f":"Poule!Y12","v":"Punten"}]
[{"$f":"Poule!D13","v":"09:00:00"},{"$f":"Poule!E13","v":"00:00:00"},{"$f":"Poule!G13","v":"PA TEAM 1"},{"$f":"Poule!H13","v":0},{"$f":"Poule!M13","v":"--"},{"$f":"Poule!N13","v":"PA TEAM 2"},{"$f":"Poule!O13","v":0},{"$f":"Poule!U13","v":3},{"$f":"Poule!V13","v":"--"},{"$f":"Poule!W13","v":2},null,{"$f":"Poule!Y13","v":2},null,{"$f":"Poule!AA13","v":0}]
[{"$f":"Poule!D14","v":"09:20:00"},{"$f":"Poule!E14","v":"00:00:00"},{"$f":"Poule!G14","v":"PA TEAM 3"},{"$f":"Poule!H14","v":0},{"$f":"Poule!M14","v":"--"},{"$f":"Poule!N14","v":"PA TEAM 4"},{"$f":"Poule!O14","v":0},{"$f":"Poule!U14","v":5},{"$f":"Poule!V14","v":"--"},{"$f":"Poule!W14","v":0},null,{"$f":"Poule!Y14","v":2},null,{"$f":"Poule!AA14","v":0}]
[{"$f":"Poule!D15","v":"09:40:00"},{"$f":"Poule!E15","v":"00:00:00"},{"$f":"Poule!G15","v":"PA TEAM 5"},{"$f":"Poule!H15","v":0},{"$f":"Poule!M15","v":"--"},{"$f":"Poule!N15","v":"PA TEAM 1"},{"$f":"Poule!O15","v":0},{"$f":"Poule!U15","v":5},{"$f":"Poule!V15","v":"--"},{"$f":"Poule!W15","v":5},null,{"$f":"Poule!Y15","v":1},null,{"$f":"Poule!AA15","v":1}]
[{"$f":"Poule!D16","v":"10:00:00"},{"$f":"Poule!E16","v":"00:00:00"},{"$f":"Poule!G16","v":"PA TEAM 2"},{"$f":"Poule!H16","v":0},{"$f":"Poule!M16","v":"--"},{"$f":"Poule!N16","v":"PA TEAM 3"},{"$f":"Poule!O16","v":0},{"$f":"Poule!U16","v":6},{"$f":"Poule!V16","v":"--"},{"$f":"Poule!W16","v":3},null,{"$f":"Poule!Y16","v":2},null,{"$f":"Poule!AA16","v":0}]
[{"$f":"Poule!D17","v":"10:20:00"},{"$f":"Poule!E17","v":"00:00:00"},{"$f":"Poule!G17","v":"PA TEAM 5"},{"$f":"Poule!H17","v":0},{"$f":"Poule!M17","v":"--"},{"$f":"Poule!N17","v":"PA TEAM 4"},{"$f":"Poule!O17","v":0},{"$f":"Poule!U17","v":2},{"$f":"Poule!V17","v":"--"},{"$f":"Poule!W17","v":8},null,{"$f":"Poule!Y17","v":0},null,{"$f":"Poule!AA17","v":2}]
[{"$f":"Poule!D18","v":"10:40:00"},{"$f":"Poule!E18","v":"00:00:00"},{"$f":"Poule!G18","v":"PA TEAM 1"},{"$f":"Poule!H18","v":0},{"$f":"Poule!M18","v":"--"},{"$f":"Poule!N18","v":"PA TEAM 3"},{"$f":"Poule!O18","v":0},{"$f":"Poule!U18","v":3},{"$f":"Poule!V18","v":"--"},{"$f":"Poule!W18","v":5},null,{"$f":"Poule!Y18","v":0},null,{"$f":"Poule!AA18","v":2}]
["11:00:00",{"$f":"Poule!E16","v":"00:00:00"},{"$f":"Poule!G19","v":"PA TEAM 2"},{"$f":"Poule!H19","v":0},{"$f":"Poule!M19","v":"--"},{"$f":"Poule!N19","v":"PA TEAM 5"},{"$f":"Poule!O19","v":0},{"$f":"Poule!U19","v":1},{"$f":"Poule!V19","v":"--"},{"$f":"Poule!W19","v":2},null,{"$f":"Poule!Y19","v":0},null,{"$f":"Poule!AA19","v":2}]
["11:20:00",{"$f":"Poule!E17","v":"00:00:00"},{"$f":"Poule!G20","v":"PA TEAM 4"},{"$f":"Poule!H20","v":0},{"$f":"Poule!M20","v":"--"},{"$f":"Poule!N20","v":"PA TEAM 1"},{"$f":"Poule!O20","v":0},{"$f":"Poule!U20","v":0},{"$f":"Poule!V20","v":"--"},{"$f":"Poule!W20","v":0},null,{"$f":"Poule!Y20","v":1},null,{"$f":"Poule!AA20","v":1}]
["11:40:00",{"$f":"Poule!E17","v":"00:00:00"},{"$f":"Poule!G21","v":"PA TEAM 3"},{"$f":"Poule!H21","v":0},{"$f":"Poule!M21","v":"--"},{"$f":"Poule!N21","v":"PA TEAM 5"},{"$f":"Poule!O21","v":0},{"$f":"Poule!U21","v":3},{"$f":"Poule!V21","v":"--"},{"$f":"Poule!W21","v":2},null,{"$f":"Poule!Y21","v":2},null,{"$f":"Poule!AA21","v":0}]
["12:00:00",{"$f":"Poule!E18","v":"00:00:00"},{"$f":"Poule!G18","v":"PA TEAM 1"},{"$f":"Poule!H18","v":0},{"$f":"Poule!M18","v":"--"},{"$f":"Poule!N18","v":"PA TEAM 3"},{"$f":"Poule!O18","v":0},{"$f":"Poule!U18","v":3},{"$f":"Poule!V18","v":"--"},{"$f":"Poule!W18","v":5},null,{"$f":"Poule!Y18","v":0},null,{"$f":"Poule!AA18","v":2}]
[]
{"$rows_left_out":10}
{"sheet":"GROEP-2","index":3,"n_rows":25,"n_cols":13,"rows_kept":25,"cut":false,"hidden":false,"merged":[[24,1,24,4],[9,0,9,1],[10,0,10,1],[11,0,11,1],[12,0,12,1],[23,1,23,4],[7,0,7,1],[8,0,8,1],[17,11,19,11],[4,0,4,1],[5,0,5,1],[17,0,19,0],[17,1,19,4],[17,5,19,5],[0,12,2,13],[20,1,20,4],[21,1,21,4],[22,1,22,4],[0,0,2,11],[3,5,3,7],[3,9,3,11],[3,0,3,1],[3,2,3,4],[13,0,13,1],[6,0,6,1],[17,8,19,8],[17,9,19,9],[17,10,19,10],[17,7,19,7],[17,6,19,6]]}
["Toernooi 2 poules 5 teams",null,null,null,null,null,null,null,null,null,null,null,"Scores By:\nOnlineExcelCursus.NL"]
[]
[]
[{"$f":"Poule!AC12","v":"Tijd"},null,{"$f":"Poule!AF12","v":"VELD 2"},null,null,{"$f":"Poule!AT12","v":"Uitslag"},null,null,null,{"$f":"Poule!AX12","v":"Punten"}]
[{"$f":"Poule!AC13","v":"09:00:00"},{"$f":"Poule!AD13","v":"00:00:00"},{"$f":"Poule!AF13","v":"PB TEAM 1"},{"$f":"Poule!AL13","v":"--"},{"$f":"Poule!AM13","v":"PB TEAM 2"},{"$f":"Poule!AT13","v":1},{"$f":"Poule!AU13","v":"--"},{"$f":"Poule!AV13","v":8},null,{"$f":"Poule!AX13","v":0},null,{"$f":"Poule!AZ13","v":2}]
[{"$f":"Poule!AC14","v":"09:20:00"},{"$f":"Poule!AD14","v":"00:00:00"},{"$f":"Poule!AF14","v":"PB TEAM 3"},{"$f":"Poule!AL14","v":"--"},{"$f":"Poule!AM14","v":"PB TEAM 4"},{"$f":"Poule!AT14","v":2},{"$f":"Poule!AU14","v":"--"},{"$f":"Poule!AV14","v":6},null,{"$f":"Poule!AX14","v":0},null,{"$f":"Poule!AZ14","v":2}]
[{"$f":"Poule!AC15","v":"09:40:00"},{"$f":"Poule!AD15","v":"00:00:00"},{"$f":"Poule!AF15","v":"PB TEAM 5"},{"$f":"Poule!AL15","v":"--"},{"$f":"Poule!AM15","v":"PB TEAM 1"},{"$f":"Poule!AT15","v":3},{"$f":"Poule!AU15","v":"--"},{"$f":"Poule!AV15","v":8},null,{"$f":"Poule!AX15","v":0},null,{"$f":"Poule!AZ15","v":2}]
[{"$f":"Poule!AC16","v":"10:00:00"},{"$f":"Poule!AD16","v":"00:00:00"},{"$f":"Poule!AF16","v":"PB TEAM 2"},{"$f":"Poule!AL16","v":"--"},{"$f":"Poule!AM16","v":"PB TEAM 3"},{"$f":"Poule!AT16","v":4},{"$f":"Poule!AU16","v":"--"},{"$f":"Poule!AV16","v":4},null,{"$f":"Poule!AX16","v":1},null,{"$f":"Poule!AZ16","v":1}]
[{"$f":"Poule!AC17","v":"10:20:00"},{"$f":"Poule!AD17","v":"00:00:00"},{"$f":"Poule!AF17","v":"PB TEAM 5"},{"$f":"Poule!AL17","v":"--"},{"$f":"Poule!AM17","v":"PB TEAM 4"},{"$f":"Poule!AT17","v":2},{"$f":"Poule!AU17","v":"--"},{"$f":"Poule!AV17","v":3},null,{"$f":"Poule!AX17","v":0},null,{"$f":"Poule!AZ17","v":2}]
[{"$f":"Poule!D18","v":"10:40:00"},{"$f":"Poule!E18","v":"00:00:00"},{"$f":"Poule!AF18","v":"PB TEAM 1"},{"$f":"Poule!AL18","v":"--"},{"$f":"Poule!AM18","v":"PB TEAM 3"},{"$f":"Poule!AT18","v":1},{"$f":"Poule!AU18","v":"--"},{"$f":"Poule!AV18","v":6},null,{"$f":"Poule!AX18","v":0},null,{"$f":"Poule!AZ18","v":2}]
["11:00:00",{"$f":"Poule!E16","v":"00:00:00"},{"$f":"Poule!AF19","v":"PB TEAM 2"},{"$f":"Poule!AL19","v":"--"},{"$f":"Poule!AM19","v":"PB TEAM 5"},{"$f":"Poule!AT19","v":1},{"$f":"Poule!AU19","v":"--"},{"$f":"Poule!AV19","v":2},null,{"$f":"Poule!AX19","v":0},null,{"$f":"Poule!AZ19","v":2}]
["11:20:00",{"$f":"Poule!E17","v":"00:00:00"},{"$f":"Poule!AF20","v":"PB TEAM 4"},{"$f":"Poule!AL20","v":"--"},{"$f":"Poule!AM20","v":"PB TEAM 1"},{"$f":"Poule!AT20","v":3},{"$f":"Poule!AU20","v":"--"},{"$f":"Poule!AV20","v":5},null,{"$f":"Poule!AX20","v":0},null,{"$f":"Poule!AZ20","v":2}]
["11:40:00",{"$f":"Poule!E17","v":"00:00:00"},{"$f":"Poule!AF21","v":"PB TEAM 3"},{"$f":"Poule!AL21","v":"--"},{"$f":"Poule!AM21","v":"PB TEAM 5"},{"$f":"Poule!AT21","v":2},{"$f":"Poule!AU21","v":"--"},{"$f":"Poule!AV21","v":2},null,{"$f":"Poule!AX21","v":1},null,{"$f":"Poule!AZ21","v":1}]
["12:00:00",{"$f":"Poule!E18","v":"00:00:00"},{"$f":"Poule!AF18","v":"PB TEAM 1"},{"$f":"Poule!AL18","v":"--"},{"$f":"Poule!AM18","v":"PB TEAM 3"},{"$f":"Poule!AT18","v":1},{"$f":"Poule!AU18","v":"--"},{"$f":"Poule!AV18","v":6},null,{"$f":"Poule!AX18","v":0},null,{"$f":"Poule!AZ18","v":2}]
[]
{"$rows_left_out":10}