{"text_format":"1","workbook":"xlsx","n_sheets":4,"sheets":["Poule","Finale","GROEP-1","GROEP-2"],"not_rendered":{"charts":0,"images":4,"macros":1,"external_links":0,"defined_names":0,"comments":0,"pivot_tables":0},"unopened":[],"bounds":{"document_bytes":16777216,"sheet_cells":100000,"rows_first":2000,"rows_last":500,"rows_between":2000,"halvings":0,"cell_chars":16384,"cell_head_chars":4096},"cells_cut":0,"cells_raw":0,"read":"whole","date_system":"1900"}

{"sheet":"Poule","index":0,"n_rows":50,"n_cols":70,"rows_kept":50,"cut":false,"hidden":false,"merged":[[15,29,15,31],[4,16,4,21],[12,29,12,31],[12,33,12,45],[13,40,13,45],[12,47,12,49],[12,51,12,53],[18,33,18,38],[18,40,18,45],[17,33,17,38],[16,33,16,38],[15,33,15,38],[15,40,15,45],[14,40,14,45],[14,33,14,38],[13,33,13,38],[17,40,17,45],[16,40,16,45],[0,0,1,49],[5,1,5,6],[6,1,6,6],[7,1,7,6],[4,1,4,6],[2,0,4,0],[2,12,4,12],[2,11,4,11],[2,10,4,10],[2,28,4,28],[2,15,4,15],[2,13,4,13],[2,26,4,26],[2,27,4,27],[5,16,5,22],[7,16,7,22],[15,6,15,11],[13,3,13,4],[10,1,10,6],[9,1,9,6],[12,0,12,1],[15,3,15,4],[15,13,15,18],[17,3,17,4],[18,13,18,18],[16,13,16,18],[16,3,16,4],[18,3,18,4],[18,6,18,11],[17,6,17,11],[16,6,16,11],[17,13,17,18],[6,16,6,22],[2,29,4,29],[13,13,13,18],[10,16,10,22],[9,16,9,22],[14,6,14,11],[13,6,13,11],[14,13,14,18],[8,1,8,6],[12,3,12,4],[12,6,12,18],[14,3,14,4],[12,20,12,22],[8,16,8,22],[14,29,14,31],[19,40,19,45],[20,3,20,4],[20,6,20,11],[20,13,20,18],[20,33,20,38],[20,40,20,45],[19,3,19,4],[19,6,19,11],[19,13,19,18],[19,33,19,38],[49,0,49,24],[25,3,25,4],[25,6,25,11],[25,13,25,18],[25,33,25,38],[23,40,23,45],[24,3,24,4],[24,6,24,11],[24,13,24,18],[24,33,24,38],[24,40,24,45],[23,3,23,4],[23,6,23,11],[23,13,23,18],[23,33,23,38],[27,40,27,45],[27,3,27,4],[27,6,27,11],[27,13,27,18],[27,33,27,38],[12,24,12,26],[13,29,13,31],[25,40,25,45],[26,3,26,4],[26,6,26,11],[26,13,26,18],[26,33,26,38],[26,40,26,45],[21,40,21,45],[22,3,22,4],[22,6,22,11],[22,13,22,18],[22,33,22,38],[22,40,22,45],[21,3,21,4],[21,6,21,11],[21,13,21,18],[21,33,21,38]]}
["Toernooi 2 poules 6 teams",null,null,null,null,null,null,null,null,null,null,null,null,null,null,null,null,null,null,null,null,null,null,null,null,null,null,null,null,null,null,null,null,null,null,null,null,null,null,null,null,null,null,null,null,null,null,null,null,null,{"$f":"COUNTA(U14:W19)","v":18},{"$f":"COUNTA(AV14:AX19)","v":18},{"$f":"COUNTA(U22:W27)","v":18},{"$f":"COUNTA(AV22:AX27)","v":18},null,null,null,null,null,null,null,{"$f":"VALUE(A6)","v":3},{"$f":"B6","v":"PA TEAM 1"},{"$f":"VALUE(P6)","v":4},{"$f":"Q6","v":"PB TEAM 1"},{"$f":"VALUE(AE6)","v":0},{"$f":"AF6","v":0},{"$f":"VALUE(AS6)","v":0},{"$f":"AT6","v":0}]
[null,null,null,null,null,null,null,null,null,null,null,null,null,null,null,null,null,null,null,null,null,null,null,null,null,null,null,null,null,null,null,null,null,null,null,null,null,null,null,null,null,null,null,null,null,null,null,null,null,null,null,null,null,null,null,null,null,null,null,null,null,{"$f":"VALUE(A7)","v":5},{"$f":"B7","v":"PA TEAM 2"},{"$f":"VALUE(P7)","v":3},{"$f":"Q7","v":"PB TEAM 2"},{"$f":"VALUE(AE7)","v":0},{"$f":"AF7","v":0},{"$f":"VALUE(AS7)","v":0},{"$f":"AT7","v":0}]
["Stand",null,null,null,null,null,null,null,null,null,"Gewonnen","Gelijk","Verloren","Saldo",null,"Stand",null,null,null,null,null,null,null,null,null,null,"Gewonnen","Gelijk","Verloren","Saldo",null,null,null,null,null,null,null,null,null,null,null,null,null,null,null,null,null,null,null,null,null,null,null,null,null,null,null,null,null,null,null,null,{"$f":"VALUE(A8)","v":2},{"$f":"B8","v":"PA TEAM 3"},{"$f":"VALUE(P8)","v":1},{"$f":"Q8","v":"PB TEAM 3"},{"$f":"VALUE(AE8)","v":0},{"$f":"AF8","v":0},{"$f":"VALUE(AS8)","v":0},{"$f":"AT8","v":0}]
[null,null,null,null,null,null,null,null,null,null,null,null,null,null,null,null,null,null,null,null,null,null,null,null,null,null,null,null,null,null,null,null,null,null,null,null,null,null,null,null,null,null,null,null,null,null,null,null,null,null,null,null,null,null,null,null,null,null,null,null,null,null,{"$f":"VALUE(A9)","v":1},{"$f":"B9","v":"PA TEAM 4"},{"$f":"VALUE(P9)","v":6},{"$f":"Q9","v":"PB TEAM 4"},{"$f":"VALUE(AE9)","v":0},{"$f":"AF9","v":0},{"$f":"VALUE(AS9)","v":0},{"$f":"AT9","v":0}]
[null,"Groep 1",null,null,null,null,null,"V","T","P",null,null,null,null,null,null,"Groep 2",null,null,null,null,null,null,"V","T","P"]
[{"$f":"RANK(J6,$J$6:$J$11,0)","v":3},"PA TEAM 1",null,null,null,null,null,{"$f":"SUMIF($G$14:$L$28,B6,$U$14:$U$28)+SUMIF($N$14:$S$28,B6,$W$14:$W$28)","v":10},{"$f":"SUMIF($G$14:$L$28,B6,$W$14:$W$28)+SUMIF($N$14:$S$28,B6,$U$14:$U$28)","v":11},{"$f":"(K6*3)+L6+(H6*0.001)-(I6*0.001)","v":5.9989999999999997},{"$f":"SUMPRODUCT(($G$14:$L$28=B6)*($Y$14:$Y$28=3))+SUMPRODUCT(($N$14:$S$28=B6)*($AA$14:$AA$28=3))","v":1},{"$f":"SUMPRODUCT(($G$14:$L$28=B6)*($Y$14:$Y$28=1))+SUMPRODUCT(($N$14:$S$28=B6)*($AA$14:$AA$28=1))","v":3},{"$f":"SUMPRODUCT(($G$14:$L$28=B6)*($Y$14:$Y$28=0))+SUMPRODUCT(($N$14:$S$28=B6)*($AA$14:$AA$28=0))","v":1},{"$f":"H6-I6","v":-1},null,{"$f":"RANK(Z6,$Z$6:$Z$11,0)","v":4},"PB TEAM 1",null,null,null,null,null,null,{"$f":"SUMIF($AH$14:$AM$28,Q6,$AV$14:$AV$28)+SUMIF($AO$14:$AT$28,Q6,$AX$14:$AX$28)","v":12},{"$f":"SUMIF($AH$14:$AM$28,Q6,$AX$14:$AX$28)+SUMIF($AO$14:$AT$28,Q6,$AV$14:$AV$28)","v":12},{"$f":"(AA6*3)+AB6+(X6*0.001)-(Y6*0.001)","v":7},{"$f":"SUMPRODUCT(($AH$14:$AM$28=Q6)*($AZ$14:$AZ$28=3))+SUMPRODUCT(($AO$14:$AT$28=Q6)*($BB$14:$BB$28=3))","v":2},{"$f":"SUMPRODUCT(($AH$14:$AM$28=Q6)*($AZ$14:$AZ$28=1))+SUMPRODUCT(($AO$14:$AT$28=Q6)*($BB$14:$BB$28=1))","v":1},{"$f":"SUMPRODUCT(($AH$14:$AM$28=Q6)*($AZ$14:$AZ$28=0))+SUMPRODUCT(($AO$14:$AT$28=Q6)*($BB$14:$BB$28=0))","v":2},{"$f":"X6-Y6","v":0}]
[5,"PA TEAM 2",null,null,null,null,null,{"$f":"SUMIF($G$14:$L$28,B7,$U$14:$U$28)+SUMIF($N$14:$S$28,B7,$W$14:$W$28)","v":11},13,4.9980000000000002,1,2,2,-2,null,3,"PB TEAM 2",null,null,null,null,null,null,11,8,7.0030000000000001,2,1,2,3]
[2,"PA TEAM 3",null,null,null,null,null,10,8,7.0019999999999998,1,4,0,2,null,1,"PB TEAM 3",null,null,null,null,null,null,7,7,9,3,0,2,0]
[1,"PA TEAM 4",null,null,null,null,null,13,8,11.005000000000001,3,2,0,5,null,6,"PB TEAM 4",null,null,null,null,null,null,8,14,3.9940000000000002,1,1,3,-6]
[6,"PA TEAM 5",null,null,null,null,null,9,13,1.996,0,2,3,-4,null,5,"PB TEAM 5",null,null,null,null,null,null,10,11,6.9989999999999997,2,1,2,-1]
[4,"PA TEAM 6",null,null,null,null,null,9,9,5,0,5,0,0,null,2,"PB TEAM 6",null,null,null,null,null,null,16,12,8.0039999999999996,2,2,1,4]
[]
["Veld",null,null,"Tijd",null,null,"POULE A",null,null,null,null,null,null,null,null,null,null,null,null,null,"Uitslag",null,null,null,"Punten",null,null,null,"Veld","Tijd",null,null,null,"POULE B",null,null,null,null,null,null,null,null,null,null,null,null,null,"Uitslag",null,null,null,"Punten"]
[1,null,null,"10.00 - 10.15",null,null,{"$f":"B6","v":"PA TEAM 1"},null,null,null,null,null,"--",{"$f":"B7","v":"PA TEAM 2"},null,null,null,null,null,null,1,"--",1,null,{"$f":"IF(U14=\"\",\"\",IF(U14>W14,3,IF(U14=W14,1,0)))","v":1},null,{"$f":"IF(W14=\"\",\"\",IF(W14>U14,3,IF(W14=U14,1,0)))","v":1},null,1,"10.15 - 10.30",null,null,null,{"$f":"Q6","v":"PB TEAM 1"},null,null,null,null,null,"--",{"$f":"Q7","v":"PB TEAM 2"},null,null,null,null,null,null,1,"--",0,null,{"$f":"IF(AV14=\"\",\"\",IF(AV14>AX14,3,IF(AV14=AX14,1,0)))","v":3},null,{"$f":"IF(AX14=\"\",\"\",IF(AX14>AV14,3,IF(AX14=AV14,1,0)))","v":0}]
[2,null,null,"10.00 - 10.15",null,null,{"$f":"B11","v":"PA TEAM 6"},null,null,null,null,null,"--",{"$f":"B8","v":"PA TEAM 3"},null,null,null,null,null,null,1,"--",1,null,{"$f":"IF(U15=\"\",\"\",IF(U15>W15,3,IF(U15=W15,1,0)))","v":1},null,{"$f":"IF(W15=\"\",\"\",IF(W15>U15,3,IF(W15=U15,1,0)))","v":1},null,2,"10.15 - 10.30",null,null,null,{"$f":"Q11","v":"PB TEAM 6"},null,null,null,null,null,"--",{"$f":"Q8","v":"PB TEAM 3"},null,null,null,null,null,null,1,"--",0,null,{"$f":"IF(AV15=\"\",\"\",IF(AV15>AX15,3,IF(AV15=AX15,1,0)))","v":3},null,{"$f":"IF(AX15=\"\",\"\",IF(AX15>AV15,3,IF(AX15=AV15,1,0)))","v":0}]
[3,null,null,"10.00 - 10.15",null,null,{"$f":"B10","v":"PA TEAM 5"},null,null,null,null,null,"--",{"$f":"B9","v":"PA TEAM 4"},null,null,null,null,null,null,1,"--",2,null,{"$f":"IF(U16=\"\",\"\",IF(U16>W16,3,IF(U16=W16,1,0)))","v":0},null,3,null,3,"10.15 - 10.30",null,null,null,{"$f":"Q10","v":"PB TEAM 5"},null,null,null,null,null,"--",{"$f":"Q9","v":"PB TEAM 4"},null,null,null,null,null,null,1,"--",1,null,{"$f":"IF(AV16=\"\",\"\",IF(AV16>AX16,3,IF(AV16=AX16,1,0)))","v":1},null,1]
[1,null,null,"10.30 - 10.45",null,null,{"$f":"B9","v":"PA TEAM 4"},null,null,null,null,null,"--",{"$f":"B8","v":"PA TEAM 3"},null,null,null,null,null,null,1,"--",1,null,1,null,1,null,1,"10.45 - 11.00",null,null,null,{"$f":"Q9","v":"PB TEAM 4"},null,null,null,null,null,"--",{"$f":"Q8","v":"PB TEAM 3"},null,null,null,null,null,null,1,"--",2,null,0,null,3]
[2,null,null,"10.30 - 10.45",null,null,{"$f":"B7","v":"PA TEAM 2"},null,null,null,null,null,"--",{"$f":"B10","v":"PA TEAM 5"},null,null,null,null,null,null,4,"--",2,null,3,null,0,null,2,"10.45 - 11.00",null,null,null,{"$f":"Q7","v":"PB TEAM 2"},null,null,null,null,null,"--",{"$f":"Q10","v":"PB TEAM 5"},null,null,null,null,null,null,3,"--",1,null,3,null,0]
[3,null,null,"10.30 - 10.45",null,null,{"$f":"B6","v":"PA TEAM 1"},null,null,null,null,null,"--",{"$f":"B11","v":"PA TEAM 6"},null,null,null,null,null,null,2,"--",2,null,1,null,1,null,3,"10.45 - 11.00",null,null,null,{"$f":"Q6","v":"PB TEAM 1"},null,null,null,null,null,"--",{"$f":"Q11","v":"PB TEAM 6"},null,null,null,null,null,null,4,"--",4,null,1,null,1]
[1,null,null,"11.00 - 11.15",null,null,{"$f":"B6","v":"PA TEAM 1"},null,null,null,null,null,"--",{"$f":"B10","v":"PA TEAM 5"},null,null,null,null,null,null,3,"--",2,null,{"$f":"IF(U20=\"\",\"\",IF(U20>W20,3,IF(U20=W20,1,0)))","v":3},null,{"$f":"IF(W20=\"\",\"\",IF(W20>U20,3,IF(W20=U20,1,0)))","v":0},null,1,"11.15 - 11.30",null,null,null,{"$f":"Q6","v":"PB TEAM 1"},null,null,null,null,null,"--",{"$f":"Q10","v":"PB TEAM 5"},null,null,null,null,null,null,2,"--",4,null,{"$f":"IF(AV20=\"\",\"\",IF(AV20>AX20,3,IF(AV20=AX20,1,0)))","v":0},null,{"$f":"IF(AX20=\"\",\"\",IF(AX20>AV20,3,IF(AX20=AV20,1,0)))","v":3}]
[2,null,null,"11.00 - 11.15",null,null,{"$f":"B9","v":"PA TEAM 4"},null,null,null,null,null,"--",{"$f":"B11","v":"PA TEAM 6"},null,null,null,null,null,null,2,"--",2,null,{"$f":"IF(U21=\"\",\"\",IF(U21>W21,3,IF(U21=W21,1,0)))","v":1},null,{"$f":"IF(W21=\"\",\"\",IF(W21>U21,3,IF(W21=U21,1,0)))","v":1},null,2,"11.15 - 11.30",null,null,null,{"$f":"Q9","v":"PB TEAM 4"},null,null,null,null,null,"--",{"$f":"Q11","v":"PB TEAM 6"},null,null,null,null,null,null,4,"--",3,null,{"$f":"IF(AV21=\"\",\"\",IF(AV21>AX21,3,IF(AV21=AX21,1,0)))","v":3},null,{"$f":"IF(AX21=\"\",\"\",IF(AX21>AV21,3,IF(AX21=AV21,1,0)))","v":0}]
[3,null,null,"11.00 - 11.15",null,null,{"$f":"B8","v":"PA TEAM 3"},null,null,null,null,null,"--",{"$f":"B7","v":"PA TEAM 2"},null,null,null,null,null,null,4,"--",2,null,3,null,0,null,3,"11.15 - 11.30",null,null,null,{"$f":"Q8","v":"PB TEAM 3"},null,null,null,null,null,"--",{"$f":"Q7","v":"PB TEAM 2"},null,null,null,null,null,null,2,"--",0,null,3,null,0]
[1,null,null,"11.30 - 11.45",null,null,{"$f":"B7","v":"PA TEAM 2"},null,null,null,null,null,"--",{"$f":"B11","v":"PA TEAM 6"},null,null,null,null,null,null,2,"--",2,null,1,null,1,null,1,"11.45 - 12.00",null,null,null,{"$f":"Q7","v":"PB TEAM 2"},null,null,null,null,null,"--",{"$f":"Q11","v":"PB TEAM 6"},null,null,null,null,null,null,4,"--",4,null,1,null,1]
[2,null,null,"11.30 - 11.45",null,null,{"$f":"B8","v":"PA TEAM 3"},null,null,null,null,null,"--",{"$f":"B10","v":"PA TEAM 5"},null,null,null,null,null,null,2,"--",2,null,1,null,1,null,2,"11.45 - 12.00",null,null,null,{"$f":"Q8","v":"PB TEAM 3"},null,null,null,null,null,"--",{"$f":"Q10","v":"PB TEAM 5"},null,null,null,null,null,null,1,"--",4,null,0,null,3]
[3,null,null,"11.30 - 11.45",null,null,{"$f":"B6","v":"PA TEAM 1"},null,null,null,null,null,"--",{"$f":"B9","v":"PA TEAM 4"},null,null,null,null,null,null,2,"--",4,null,0,null,3,null,3,"11.45 - 12.00",null,null,null,{"$f":"Q6","v":"PB TEAM 1"},null,null,null,null,null,"--",{"$f":"Q9","v":"PB TEAM 4"},null,null,null,null,null,null,4,"--",2,null,3,null,0]
[1,null,null,"12.00 - 12.15",null,null,{"$f":"B6","v":"PA TEAM 1"},null,null,null,null,null,"--",{"$f":"B8","v":"PA TEAM 3"},null,null,null,null,null,null,2,"--",2,null,{"$f":"IF(U26=\"\",\"\",IF(U26>W26,3,IF(U26=W26,1,0)))","v":1},null,{"$f":"IF(W26=\"\",\"\",IF(W26>U26,3,IF(W26=U26,1,0)))","v":1},null,1,"12.15 - 12.30",null,null,null,{"$f":"Q6","v":"PB TEAM 1"},null,null,null,null,null,"--",{"$f":"Q8","v":"PB TEAM 3"},null,null,null,null,null,null,1,"--",2,null,{"$f":"IF(AV26=\"\",\"\",IF(AV26>AX26,3,IF(AV26=AX26,1,0)))","v":0},null,{"$f":"IF(AX26=\"\",\"\",IF(AX26>AV26,3,IF(AX26=AV26,1,0)))","v":3}]
[2,null,null,"12.00 - 12.15",null,null,{"$f":"B7","v":"PA TEAM 2"},null,null,null,null,null,"--",{"$f":"B9","v":"PA TEAM 4"},null,null,null,null,null,null,2,"--",4,null,0,null,3,null,2,"12.15 - 12.30",null,null,null,{"$f":"Q7","v":"PB TEAM 2"},null,null,null,null,null,"--",{"$f":"Q9","v":"PB TEAM 4"},null,null,null,null,null,null,4,"--",0,null,3,null,0]
[3,null,null,"12.00 - 12.15",null,null,{"$f":"B11","v":"PA TEAM 6"},null,null,null,null,null,"--",{"$f":"B10","v":"PA TEAM 5"},null,null,null,null,null,null,2,"--",2,null,1,null,1,null,3,"12.15 - 12.30",null,null,null,{"$f":"Q11","v":"PB TEAM 6"},null,null,null,null,null,"--",{"$f":"Q10","v":"PB TEAM 5"},null,null,null,null,null,null,4,"--",0,null,3,null,0]
[]
[]
[]
[]
[]
[]
[]
[]
[]
[]
[]
[]
{"$rows_left_out":11}
{"sheet":"Finale","index":1,"n_rows":38,"n_cols":27,"rows_kept":38,"cut":false,"hidden":false,"merged":[[0,0,0,24],[37,0,37,24],[4,6,4,7],[6,6,6,7],[4,4,4,5],[5,4,5,5],[6,4,6,5],[4,9,4,12],[4,14,4,17],[6,9,6,12],[6,14,6,17],[5,9,5,12],[5,14,5,17],[13,16,13,17],[12,9,12,12],[9,4,9,5],[7,6,7,7],[9,6,9,7],[12,6,12,7],[9,9,9,12],[9,14,9,17],[8,8,8,9],[13,24,13,25],[15,4,15,5],[15,9,15,12],[15,14,15,17],[12,4,12,5],[13,8,13,9],[13,10,13,11],[13,12,13,13],[13,14,13,15],[13,18,13,19],[13,20,13,21],[13,22,13,23],[13,6,13,7],[12,14,12,17]]}
["Finale"]
[null,null,null,null,null,null,null,null,null,null,null,null,null,null,null,null,null,null,null,null,null,null,"c"]
[null,"Verliezersronde 7e tm 12e plaats"]
[null,"Veld",null,"Plaats","Tijd"]
[null,"Veld: 1",null,"11-12","12.45 - 13.00",null,null,null,null,{"$f":"VLOOKUP(6,Poule!$A$6:$G$11,2,FALSE)","v":"PA TEAM 5"},null,null,null,null,{"$f":"VLOOKUP(6,Poule!$P$6:$W$11,2,FALSE)","v":"PB TEAM 4"},null,null,null,null,null,"-",null,null,null,null,null,"nummer 6 poule A - nummer 6 poule B"]
[null,"Veld: 2",null,"9-10","12.45 - 13.00",null,null,null,null,{"$f":"VLOOKUP(5,Poule!A6:G11,2,FALSE)","v":"PA TEAM 2"},null,null,null,null,{"$f":"VLOOKUP(5,Poule!$P$6:$W$11,2,FALSE)","v":"PB TEAM 5"},null,null,null,null,null,"-",null,null,null,null,null,"nummer 5 poule A - nummer 5 poule B"]
[null,"Veld: 3",null,"7-8","12.45 - 13.00",null,null,null,null,{"$f":"VLOOKUP(4,Poule!$A$6:$G$11,2,FALSE)","v":"PA TEAM 6"},null,null,null,null,{"$f":"VLOOKUP(4,Poule!$P$6:$W$11,2,FALSE)","v":"PB TEAM 1"},null,null,null,null,null,"-",null,null,null,null,null,"nummer 4 poule A - nummer 4 poule B"]
[]
[null,"Winnaarsronde 5e tm 6e plaats"]
[null,"Veld: 2",null,"5-6","13.00 - 13.15",null,null,null,null,{"$f":"VLOOKUP(3,Poule!$A$6:$G$11,2,FALSE)","v":"PA TEAM 1"},null,null,null,null,{"$f":"VLOOKUP(3,Poule!$P$6:$W$11,2,FALSE)","v":"PB TEAM 2"},null,null,null,null,null,"-",null,null,null,null,null,"nummer 3 poule A - nummer 3 poule B"]
[]
[null,"Troost finale heren 3e en 4e plaats"]
[null,"Veld: 1",null,"3-4","13.00 - 13.15",null,null,null,null,{"$f":"VLOOKUP(2,Poule!$A$6:$G$11,2,FALSE)","v":"PA TEAM 3"},null,null,null,null,{"$f":"VLOOKUP(2,Poule!$P$6:$W$11,2,FALSE)","v":"PB TEAM 6"},null,null,null,null,null,"-",null,null,null,null,null,"Nummer 2 poule A – Nummer 2 poule B"]
[]
[null,"Finale"]
[null,"Veld: 1",null,"1-2","13.15 - 13.30",null,null,null,null,{"$f":"VLOOKUP(1,Poule!$A$6:$G$11,2,FALSE)","v":"PA TEAM 4"},null,null,null,null,{"$f":"VLOOKUP(1,Poule!$P$6:$W$11,2,FALSE)","v":"PB TEAM 3"},null,null,null,null,null,"-",null,null,null,null,null,"Nummer 1 poule A– Nummer 1 poule B"]
[]
[]
[]
[]
[]
[]
[]
[]
[]
[]
[]
[]
[]
[]
[]
[]
[]
[]
[]
[]
[]
["2016 Michael van den Dool - OnlineExcelCursus.nl"]

{"sheet":"GROEP-1","index":2,"n_rows":19,"n_cols":15,"rows_kept":19,"cut":false,"hidden":true,"merged":[[0,14,2,15],[0,0,2,13],[16,1,16,6],[17,1,17,6],[18,1,18,6],[12,0,14,0],[3,0,3,1],[3,2,3,6],[3,7,3,9],[7,2,7,3],[7,5,7,6],[6,0,6,1],[7,0,7,1],[3,11,3,13],[12,1,14,6],[12,7,14,7],[12,8,14,8],[12,9,14,9],[12,11,14,11],[12,12,14,12],[12,13,14,13],[15,1,15,6],[12,10,14,10],[9,2,9,3],[9,5,9,6],[4,0,4,1],[5,0,5,1],[5,2,5,3],[4,2,4,3],[4,5,4,6],[5,5,5,6],[8,0,8,1],[9,0,9,1],[6,2,6,3],[6,5,6,6],[8,2,8,3],[8,5,8,6]]}
["EZ Mixed Toernooi 2015",null,null,null,null,null,null,null,null,null,null,null,null,null,"Scores By:\nOnlineExcelCursus.NL"]
[]
[]
[{"$f":"Poule!D13","v":"Tijd"},{"$f":"Poule!E13","v":0},{"$f":"Poule!G13","v":"POULE A"},null,null,null,null,{"$f":"Poule!U13","v":"Uitslag"},null,null,null,{"$f":"Poule!Y13","v":"Punten"}]
[{"$f":"Poule!D14","v":"10.00 - 10.15"},{"$f":"Poule!E14","v":"00:00:00"},{"$f":"Poule!G14","v":"PA TEAM 1"},{"$f":"Poule!H14","v":0},{"$f":"Poule!M14","v":"--"},{"$f":"Poule!N14","v":"PA TEAM 2"},{"$f":"Poule!O14","v":0},{"$f":"Poule!U14","v":1},{"$f":"Poule!V14","v":"--"},{"$f":"Poule!W14","v":1},null,{"$f":"Poule!Y14","v":1},null,{"$f":"Poule!AA14","v":1}]
[{"$f":"Poule!D15","v":"10.00 - 10.15"},{"$f":"Poule!E15","v":"00:00:00"},{"$f":"Poule!G15","v":"PA TEAM 6"},{"$f":"Poule!H15","v":0},{"$f":"Poule!M15","v":"--"},{"$f":"Poule!N15","v":"PA TEAM 3"},{"$f":"Poule!O15","v":0},{"$f":"Poule!U15","v":1},{"$f":"Poule!V15","v":"--"},{"$f":"Poule!W15","v":1},null,{"$f":"Poule!Y15","v":1},null,{"$f":"Poule!AA15","v":1}]
[{"$f":"Poule!D16","v":"10.00 - 10.15"},{"$f":"Poule!E16","v":"00:00:00"},{"$f":"Poule!G16","v":"PA TEAM 5"},{"$f":"Poule!H16","v":0},{"$f":"Poule!M16","v":"--"},{"$f":"Poule!N16","v":"PA TEAM 4"},{"$f":"Poule!O16","v":0},{"$f":"Poule!U16","v":1},{"$f":"Poule!V16","v":"--"},{"$f":"Poule!W16","v":2},null,{"$f":"Poule!Y16","v":0},null,{"$f":"Poule!AA16","v":3}]
[{"$f":"Poule!D17","v":"10.30 - 10.45"},{"$f":"Poule!E17","v":"00:00:00"},{"$f":"Poule!G17","v":"PA TEAM 4"},{"$f":"Poule!H17","v":0},{"$f":"Poule!M17","v":"--"},{"$f":"Poule!N17","v":"PA TEAM 3"},{"$f":"Poule!O17","v":0},{"$f":"Poule!U17","v":1},{"$f":"Poule!V17","v":"--"},{"$f":"Poule!W17","v":1},null,{"$f":"Poule!Y17","v":1},null,{"$f":"Poule!AA17","v":1}]
[{"$f":"Poule!D18","v":"10.30 - 10.45"},{"$f":"Poule!E18","v":"00:00:00"},{"$f":"Poule!G18","v":"PA TEAM 2"},{"$f":"Poule!H18","v":0},{"$f":"Poule!M18","v":"--"},{"$f":"Poule!N18","v":"PA TEAM 5"},{"$f":"Poule!O18","v":0},{"$f":"Poule!U18","v":4},{"$f":"Poule!V18","v":"--"},{"$f":"Poule!W18","v":2},null,{"$f":"Poule!Y18","v":3},null,{"$f":"Poule!AA18","v":0}]
[{"$f":"Poule!D19","v":"10.30 - 10.45"},{"$f":"Poule!E19","v":"00:00:00"},{"$f":"Poule!G19","v":"PA TEAM 1"},{"$f":"Poule!H19","v":0},{"$f":"Poule!M19","v":"--"},{"$f":"Poule!N19","v":"PA TEAM 6"},{"$f":"Poule!O19","v":0},{"$f":"Poule!U19","v":2},{"$f":"Poule!V19","v":"--"},{"$f":"Poule!W19","v":2},null,{"$f":"Poule!Y19","v":1},null,{"$f":"Poule!AA19","v":1}]
[]
[]
[{"$f":"Poule!A3","v":"Stand"},{"$f":"Poule!B5","v":"Groep 1"},null,null,null,null,null,{"$f":"Poule!H5","v":"V"},{"$f":"Poule!I5","v":"T"},{"$f":"Poule!J5","v":"P"},{"$f":"Poule!K3","v":"Gewonnen"},{"$f":"Poule!L3","v":"Gelijk"},{"$f":"Poule!M3","v":"Verloren"},{"$f":"Poule!N3","v":"Saldo"}]
[{"$f":"Poule!A4","v":0},null,null,null,null,null,null,null,null,null,{"$f":"Poule!K4","v":0},{"$f":"Poule!L4","v":0},{"$f":"Poule!M4","v":0},{"$f":"Poule!N4","v":0}]
[{"$f":"Poule!A5","v":0},null,null,null,null,null,null,null,null,null,{"$f":"Poule!K5","v":0},{"$f":"Poule!L5","v":0},{"$f":"Poule!M5","v":0},{"$f":"Poule!N5","v":0}]
[{"$f":"Poule!A6","v":3},{"$f":"Poule!B6","v":"PA TEAM 1"},{"$f":"Poule!C6","v":0},{"$f":"Poule!D6","v":0},{"$f":"Poule!E6","v":0},{"$f":"Poule!F6","v":0},{"$f":"Poule!G6","v":0},{"$f":"Poule!H6","v":10},{"$f":"Poule!I6","v":11},{"$f":"Poule!J6","v":5.9989999999999997},{"$f":"Poule!K6","v":1},{"$f":"Poule!L6","v":3},{"$f":"Poule!M6","v":1},{"$f":"Poule!N6","v":-1}]
[{"$f":"Poule!A7","v":5},{"$f":"Poule!B7","v":"PA TEAM 2"},{"$f":"Poule!C7","v":0},{"$f":"Poule!D7","v":0},{"$f":"Poule!E7","v":0},{"$f":"Poule!F7","v":0},{"$f":"Poule!G7","v":0},{"$f":"Poule!H7","v":11},{"$f":"Poule!I7","v":13},{"$f":"Poule!J7","v":4.9980000000000002},{"$f":"Poule!K7","v":1},{"$f":"Poule!L7","v":2},{"$f":"Poule!M7","v":2},{"$f":"Poule!N7","v":-2}]
[{"$f":"Poule!A8","v":2},{"$f":"Poule!B8","v":"PA TEAM 3"},{"$f":"Poule!C8","v":0},{"$f":"Poule!D8","v":0},{"$f":"Poule!E8","v":0},{"$f":"Poule!F8","v":0},{"$f":"Poule!G8","v":0},{"$f":"Poule!H8","v":10},{"$f":"Poule!I8","v":8},{"$f":"Poule!J8","v":7.0019999999999998},{"$f":"Poule!K8","v":1},{"$f":"Poule!L8","v":4},{"$f":"Poule!M8","v":0},{"$f":"Poule!N8","v":2}]
[{"$f":"Poule!A9","v":1},{"$f":"Poule!B9","v":"PA TEAM 4"},{"$f":"Poule!C9","v":0},{"$f":"Poule!D9","v":0},{"$f":"Poule!E9","v":0},{"$f":"Poule!F9","v":0},{"$f":"Poule!G9","v":0},{"$f":"Poule!H9","v":13},{"$f":"Poule!I9","v":8},{"$f":"Poule!J9","v":11.005000000000001},{"$f":"Poule!K9","v":3},{"$f":"Poule!L9","v":2},{"$f":"Poule!M9","v":0},{"$f":"Poule!N9","v":5}]

{"sheet":"GROEP-2","index":3,"n_rows":20,"n_cols":13,"rows_kept":20,"cut":false,"hidden":true,"merged":[[0,12,2,13],[16,1,16,4],[17,1,17,4],[18,1,18,4],[0,0,2,11],[3,5,3,7],[3,9,3,11],[3,0,3,1],[3,2,3,4],[9,0,9,1],[6,0,6,1],[13,8,15,8],[13,9,15,9],[13,10,15,10],[13,7,15,7],[13,6,15,6],[19,1,19,4],[7,0,7,1],[8,0,8,1],[13,11,15,11],[4,0,4,1],[5,0,5,1],[13,0,15,0],[13,1,15,4],[13,5,15,5]]}
["EZ Mixed Toernooi 2015",null,null,null,null,null,null,null,null,null,null,null,"Scores By:\nOnlineExcelCursus.NL"]
[]
[]
[{"$f":"Poule!AD13","v":"Tijd"},null,{"$f":"Poule!AH13","v":"POULE B"},null,null,{"$f":"Poule!AV13","v":"Uitslag"},null,null,null,{"$f":"Poule!AZ13","v":"Punten"}]
[{"$f":"Poule!AD14","v":"10.15 - 10.30"},{"$f":"Poule!AE14","v":"00:00:00"},{"$f":"Poule!AH14","v":"PB TEAM 1"},{"$f":"Poule!AN14","v":"--"},{"$f":"Poule!AO14","v":"PB TEAM 2"},{"$f":"Poule!AV14","v":1},{"$f":"Poule!AW14","v":"--"},{"$f":"Poule!AX14","v":0},null,{"$f":"Poule!AZ14","v":3},null,{"$f":"Poule!BB14","v":0}]
[{"$f":"Poule!AD15","v":"10.15 - 10.30"},{"$f":"Poule!AE15","v":"00:00:00"},{"$f":"Poule!AH15","v":"PB TEAM 6"},{"$f":"Poule!AN15","v":"--"},{"$f":"Poule!AO15","v":"PB TEAM 3"},{"$f":"Poule!AV15","v":1},{"$f":"Poule!AW15","v":"--"},{"$f":"Poule!AX15","v":0},null,{"$f":"Poule!AZ15","v":3},null,{"$f":"Poule!BB15","v":0}]
[{"$f":"Poule!AD16","v":"10.15 - 10.30"},{"$f":"Poule!AE16","v":"00:00:00"},{"$f":"Poule!AH16","v":"PB TEAM 5"},{"$f":"Poule!AN16","v":"--"},{"$f":"Poule!AO16","v":"PB TEAM 4"},{"$f":"Poule!AV16","v":1},{"$f":"Poule!AW16","v":"--"},{"$f":"Poule!AX16","v":1},null,{"$f":"Poule!AZ16","v":1},null,{"$f":"Poule!BB16","v":1}]
[{"$f":"Poule!AD17","v":"10.45 - 11.00"},{"$f":"Poule!AE17","v":"00:00:00"},{"$f":"Poule!AH17","v":"PB TEAM 4"},{"$f":"Poule!AN17","v":"--"},{"$f":"Poule!AO17","v":"PB TEAM 3"},{"$f":"Poule!AV17","v":1},{"$f":"Poule!AW17","v":"--"},{"$f":"Poule!AX17","v":2},null,{"$f":"Poule!AZ17","v":0},null,{"$f":"Poule!BB17","v":3}]
[{"$f":"Poule!AD18","v":"10.45 - 11.00"},{"$f":"Poule!AE18","v":"00:00:00"},{"$f":"Poule!AH18","v":"PB TEAM 2"},{"$f":"Poule!AN18","v":"--"},{"$f":"Poule!AO18","v":"PB TEAM 5"},{"$f":"Poule!AV18","v":3},{"$f":"Poule!AW18","v":"--"},{"$f":"Poule!AX18","v":1},null,{"$f":"Poule!AZ18","v":3},null,{"$f":"Poule!BB18","v":0}]
[{"$f":"Poule!AD19","v":"10.45 - 11.00"},{"$f":"Poule!AE19","v":"00:00:00"},{"$f":"Poule!AH19","v":"PB TEAM 1"},{"$f":"Poule!AN19","v":"--"},{"$f":"Poule!AO19","v":"PB TEAM 6"},{"$f":"Poule!AV19","v":4},{"$f":"Poule!AW19","v":"--"},{"$f":"Poule!AX19","v":4},null,{"$f":"Poule!AZ19","v":1},null,{"$f":"Poule!BB19","v":1}]
[]
[]
[]
[{"$f":"Poule!P3","v":"Stand"},{"$f":"Poule!Q5","v":"Groep 2"},null,null,null,{"$f":"Poule!X5","v":"V"},{"$f":"Poule!Y5","v":"T"},{"$f":"Poule!Z5","v":"P"},{"$f":"Poule!AA3","v":"Gewonnen"},{"$f":"Poule!AB3","v":"Gelijk"},{"$f":"Poule!AC3","v":"Verloren"},{"$f":"Poule!AD3","v":"Saldo"}]
[{"$f":"Poule!P4","v":0},null,null,null,null,null,null,null,{"$f":"Poule!AA4","v":0},{"$f":"Poule!AB4","v":0},{"$f":"Poule!AC4","v":0},{"$f":"Poule!AD4","v":0}]
[{"$f":"Poule!P5","v":0},null,null,null,null,null,null,null,{"$f":"Poule!AA5","v":0},{"$f":"Poule!AB5","v":0},{"$f":"Poule!AC5","v":0},{"$f":"Poule!AD5","v":0}]
[{"$f":"Poule!P6","v":4},{"$f":"Poule!Q6","v":"PB TEAM 1"},null,null,null,{"$f":"Poule!X6","v":12},{"$f":"Poule!Y6","v":12},{"$f":"Poule!Z6","v":7},{"$f":"Poule!AA6","v":2},{"$f":"Poule!AB6","v":1},{"$f":"Poule!AC6","v":2},{"$f":"Poule!AD6","v":0}]
[{"$f":"Poule!P7","v":3},{"$f":"Poule!Q7","v":"PB TEAM 2"},null,null,null,{"$f":"Poule!X7","v":11},{"$f":"Poule!Y7","v":8},{"$f":"Poule!Z7","v":7.0030000000000001},{"$f":"Poule!AA7","v":2},{"$f":"Poule!AB7","v":1},{"$f":"Poule!AC7","v":2},{"$f":"Poule!AD7","v":3}]
[{"$f":"Poule!P8","v":1},{"$f":"Poule!Q8","v":"PB TEAM 3"},null,null,null,{"$f":"Poule!X8","v":7},{"$f":"Poule!Y8","v":7},{"$f":"Poule!Z8","v":9},{"$f":"Poule!AA8","v":3},{"$f":"Poule!AB8","v":0},{"$f":"Poule!AC8","v":2},{"$f":"Poule!AD8","v":0}]
[{"$f":"Poule!P9","v":6},{"$f":"Poule!Q9","v":"PB TEAM 4"},null,null,null,{"$f":"Poule!X9","v":8},{"$f":"Poule!Y9","v":14},{"$f":"Poule!Z9","v":3.9940000000000002},{"$f":"Poule!AA9","v":1},{"$f":"Poule!AB9","v":1},{"$f":"Poule!AC9","v":3},{"$f":"Poule!AD9","v":-6}]