{"text_format":"1","workbook":"xlsx","n_sheets":6,"sheets":["Poule","Finale's","GROEP-1","GROEP-2","GROEP-3","GROEP-4"],"not_rendered":{"charts":0,"images":4,"macros":1,"external_links":0,"defined_names":0,"comments":0,"pivot_tables":0},"unopened":[],"bounds":{"document_bytes":16777216,"sheet_cells":100000,"rows_first":2000,"rows_last":500,"rows_between":2000,"halvings":0,"cell_chars":16384,"cell_head_chars":4096},"cells_cut":0,"cells_raw":0,"read":"whole","date_system":"1900"}

{"sheet":"Poule","index":0,"n_rows":44,"n_cols":69,"rows_kept":44,"cut":false,"hidden":false,"merged":[[21,31,21,36],[20,31,20,36],[21,28,21,29],[22,28,22,29],[19,31,19,36],[24,38,24,43],[23,38,23,43],[22,38,22,43],[21,38,21,43],[20,38,20,43],[19,38,19,43],[24,31,24,36],[23,31,23,36],[22,31,22,36],[24,28,24,29],[23,28,23,29],[12,31,12,36],[11,31,11,36],[10,20,10,22],[7,15,7,21],[7,30,7,35],[8,15,8,21],[10,31,10,43],[12,28,12,29],[18,45,18,47],[18,24,18,26],[15,31,15,36],[14,31,14,36],[13,31,13,36],[13,38,13,43],[12,38,12,43],[11,38,11,43],[18,31,18,43],[8,44,8,49],[10,45,10,47],[10,49,10,51],[8,30,8,35],[11,28,11,29],[16,31,16,36],[16,38,16,43],[12,6,12,11],[11,6,11,11],[12,13,12,18],[11,13,11,18],[0,0,1,49],[5,1,5,6],[6,1,6,6],[7,1,7,6],[4,1,4,6],[2,0,4,0],[2,12,4,12],[2,11,4,11],[2,10,4,10],[2,27,4,27],[5,44,5,49],[7,44,7,49],[2,14,4,14],[2,29,4,29],[2,43,4,43],[4,15,4,21],[4,30,4,35],[6,30,6,35],[2,13,4,13],[2,25,4,25],[14,13,14,18],[14,3,14,4],[19,28,19,29],[20,28,20,29],[18,3,18,4],[16,3,16,4],[16,6,16,11],[15,6,15,11],[14,6,14,11],[23,3,23,4],[24,3,24,4],[20,6,20,11],[19,6,19,11],[22,13,22,18],[21,13,21,18],[24,6,24,11],[23,6,23,11],[22,6,22,11],[21,6,21,11],[24,13,24,18],[23,13,23,18],[20,13,20,18],[19,13,19,18],[22,3,22,4],[21,3,21,4],[19,3,19,4],[20,3,20,4],[15,38,15,43],[18,49,18,51],[10,24,10,26],[14,38,14,43],[10,28,10,29],[8,1,8,6],[10,3,10,4],[10,6,10,18],[11,3,11,4],[12,3,12,4],[10,0,10,1],[13,6,13,11],[15,13,15,18],[13,28,13,29],[14,28,14,29],[15,28,15,29],[16,28,16,29],[13,3,13,4],[13,13,13,18],[18,6,18,18],[18,28,18,29],[18,20,18,22],[15,3,15,4],[16,13,16,18],[2,26,4,26],[6,44,6,49],[5,15,5,21],[5,30,5,35],[6,15,6,21],[10,55,10,56],[2,56,4,56],[2,42,4,42],[2,53,4,53],[2,54,4,54],[2,55,4,55],[2,28,4,28],[2,39,4,39],[2,40,4,40],[2,41,4,41],[4,44,4,49]]}
["MEGA Toernooi 2014",null,null,null,null,null,null,null,null,null,null,null,null,null,null,null,null,null,null,null,null,null,null,null,null,null,null,null,null,null,null,null,null,null,null,null,null,null,null,null,null,null,null,null,null,null,null,null,null,null,{"$f":"COUNTA(U12:W17)","v":18},{"$f":"COUNTA(AT12:AV17)","v":18},{"$f":"COUNTA(U20:W25)","v":18},{"$f":"COUNTA(AT20:AV25)","v":18},null,null,null,null,null,null,null,{"$f":"VALUE(A6)","v":4},{"$f":"B6","v":"PA TEAM 1"},{"$f":"VALUE(O6)","v":2},{"$f":"P6","v":"PB TEAM 1"},{"$f":"VALUE(AD6)","v":4},{"$f":"AE6","v":"PC TEAM 1"},{"$f":"VALUE(AR6)","v":3},{"$f":"AS6","v":"PD TEAM 1"}]
[null,null,null,null,null,null,null,null,null,null,null,null,null,null,null,null,null,null,null,null,null,null,null,null,null,null,null,null,null,null,null,null,null,null,null,null,null,null,null,null,null,null,null,null,null,null,null,null,null,null,null,null,null,null,null,null,null,null,null,null,null,{"$f":"VALUE(A7)","v":1},{"$f":"B7","v":"PA TEAM 2"},{"$f":"VALUE(O7)","v":3},{"$f":"P7","v":"PB TEAM 2"},{"$f":"VALUE(AD7)","v":2},{"$f":"AE7","v":"PC TEAM 2"},{"$f":"VALUE(AR7)","v":4},{"$f":"AS7","v":"PD TEAM 2"}]
["Stand",null,null,null,null,null,null,null,null,null,"Gewonnen","Gelijk","Verloren","Saldo","Stand",null,null,null,null,null,null,null,null,null,null,"Gewonnen","Gelijk","Verloren","Saldo","Stand",null,null,null,null,null,null,null,null,null,"Gewonnen","Gelijk","Verloren","Saldo","Stand",null,null,null,null,null,null,null,null,null,"Gewonnen","Gelijk","Verloren","Saldo",null,null,null,null,{"$f":"VALUE(A8)","v":2},{"$f":"B8","v":"PA TEAM 3"},{"$f":"VALUE(O8)","v":1},{"$f":"P8","v":"PB TEAM 3"},{"$f":"VALUE(AD8)","v":3},{"$f":"AE8","v":"PC TEAM 3"},{"$f":"VALUE(AR8)","v":2},{"$f":"AS8","v":"PD TEAM 3"}]
[null,null,null,null,null,null,null,null,null,null,null,null,null,null,null,null,null,null,null,null,null,null,null,null,null,null,null,null,null,null,null,null,null,null,null,null,null,null,null,null,null,null,null,null,null,null,null,null,null,null,null,null,null,null,null,null,null,null,null,null,null,{"$f":"VALUE(A9)","v":3},{"$f":"B9","v":"PA TEAM 4"},{"$f":"VALUE(O9)","v":4},{"$f":"P9","v":"PB TEAM 4"},{"$f":"VALUE(AD9)","v":1},{"$f":"AE9","v":"PC TEAM 4"},{"$f":"VALUE(AR9)","v":1},{"$f":"AS9","v":"PD TEAM 4"}]
[null,"Groep 1",null,null,null,null,null,"V","T","P",null,null,null,null,null,"Groep 2",null,null,null,null,null,null,"V","T","P",null,null,null,null,null,"Groep 3",null,null,null,null,null,"V","T","P",null,null,null,null,null,"Groep 4",null,null,null,null,null,"V","T","P"]
[{"$f":"RANK(J6,$J$6:$J$9,0)","v":4},"PA TEAM 1",null,null,null,null,null,{"$f":"SUMIF($G$12:$L$17,B6,$U$12:$U$17)+SUMIF($N$12:$S$17,B6,$W$12:$W$17)","v":5},{"$f":"SUMIF($G$12:$L$17,B6,$W$12:$W$17)+SUMIF($N$12:$S$17,B6,$U$12:$U$17)","v":7},{"$f":"(K6*3)+L6+(H6*0.001)-(I6*0.001)","v":0.99799999999999989},{"$f":"SUMPRODUCT(($G$12:$L$17=B6)*($Y$12:$Y$17=3))+SUMPRODUCT(($N$12:$S$17=B6)*($AA$12:$AA$17=3))","v":0},{"$f":"SUMPRODUCT(($G$12:$L$17=B6)*($Y$12:$Y$17=1))+SUMPRODUCT(($N$12:$S$17=B6)*($AA$12:$AA$17=1))","v":1},{"$f":"SUMPRODUCT(($G$12:$L$17=B6)*($Y$12:$Y$17=0))+SUMPRODUCT(($N$12:$S$17=B6)*($AA$12:$AA$17=0))","v":2},{"$f":"H6-I6","v":-2},{"$f":"RANK(Y6,$Y$6:$Y$9,0)","v":2},"PB TEAM 1",null,null,null,null,null,null,{"$f":"SUMIF($AF$12:$AK$17,P6,$AT$12:$AT$17)+SUMIF($AM$12:$AR$17,P6,$AV$12:$AV$17)","v":3},{"$f":"SUMIF($AF$12:$AK$17,P6,$AV$12:$AV$17)+SUMIF($AM$12:$AR$17,P6,$AT$12:$AT$17)","v":2},{"$f":"(Z6*3)+AA6+(W6*0.001)-(X6*0.001)","v":5.0010000000000003},{"$f":"SUMPRODUCT(($AF$12:$AK$17=P6)*($AX$12:$AX$17=3))+SUMPRODUCT(($AM$12:$AR$17=P6)*($AZ$12:$AZ$17=3))","v":1},{"$f":"SUMPRODUCT(($AF$12:$AK$17=P6)*($AX$12:$AX$17=1))+SUMPRODUCT(($AM$12:$AR$17=P6)*($AZ$12:$AZ$17=1))","v":2},{"$f":"SUMPRODUCT(($AF$12:$AK$17=P6)*($AX$12:$AX$17=0))+SUMPRODUCT(($AM$12:$AR$17=P6)*($AZ$12:$AZ$17=0))","v":0},{"$f":"W6-X6","v":1},{"$f":"RANK(AM6,$AM$6:$AM$9,0)","v":4},"PC TEAM 1",null,null,null,null,null,{"$f":"SUMIF($G$20:$L$25,AE6,$U$20:$U$25)+SUMIF($N$20:$S$25,AE6,$W$20:$W$25)","v":3},{"$f":"SUMIF($G$20:$L$25,AE6,$W$20:$W$25)+SUMIF($N$20:$S$25,AE6,$U$20:$U$25)","v":5},{"$f":"(AN6*3)+AO6+(AK6*0.001)-(AL6*0.001)","v":2.9980000000000002},{"$f":"SUMPRODUCT(($G$20:$L$25=AE6)*($Y$20:$Y$25=3))+SUMPRODUCT(($N$20:$S$25=AE6)*($AA$20:$AA$25=3))","v":1},{"$f":"SUMPRODUCT(($G$20:$L$25=AE6)*($Y$20:$Y$25=1))+SUMPRODUCT(($N$20:$S$25=AE6)*($AA$20:$AA$25=1))","v":0},{"$f":"SUMPRODUCT(($G$20:$L$25=AE6)*($Y$20:$Y$25=0))+SUMPRODUCT(($N$20:$S$25=AE6)*($AA$20:$AA$25=0))","v":2},{"$f":"AK6-AL6","v":-2},{"$f":"RANK(BA6,$BA$6:$BA$9,0)","v":3},"PD TEAM 1",null,null,null,null,null,{"$f":"SUMIF($AF$20:$AK$25,AS6,$AT$20:$AT$25)+SUMIF($AM$20:$AR$25,AS6,$AV$20:$AV$25)","v":4},{"$f":"SUMIF($AF$20:$AK$25,AS6,$AV$20:$AV$25)+SUMIF($AM$20:$AR$25,AS6,$AT$20:$AT$25)","v":5},{"$f":"(BB6*3)+BC6+(AY6*0.001)-(AZ6*0.001)","v":3.9989999999999997},{"$f":"SUMPRODUCT(($AF$20:$AK$25=AS6)*($AX$20:$AX$25=3))+SUMPRODUCT(($AM$20:$AR$25=AS6)*($AZ$20:$AZ$25=3))","v":1},{"$f":"SUMPRODUCT(($AF$20:$AK$25=AS6)*($AX$20:$AX$25=1))+SUMPRODUCT(($AM$20:$AR$25=AS6)*($AZ$20:$AZ$25=1))","v":1},{"$f":"SUMPRODUCT(($AF$20:$AK$25=AS6)*($AX$20:$AX$25=0))+SUMPRODUCT(($AM$20:$AR$25=AS6)*($AZ$20:$AZ$25=0))","v":1},{"$f":"AY6-AZ6","v":-1}]
[{"$f":"RANK(J7,$J$6:$J$9,0)","v":1},"PA TEAM 2",null,null,null,null,null,{"$f":"SUMIF($G$12:$L$17,B7,$U$12:$U$17)+SUMIF($N$12:$S$17,B7,$W$12:$W$17)","v":7},{"$f":"SUMIF($G$12:$L$17,B7,$W$12:$W$17)+SUMIF($N$12:$S$17,B7,$U$12:$U$17)","v":4},{"$f":"(K7*3)+L7+(H7*0.001)-(I7*0.001)","v":7.0030000000000001},{"$f":"SUMPRODUCT(($G$12:$L$17=B7)*($Y$12:$Y$17=3))+SUMPRODUCT(($N$12:$S$17=B7)*($AA$12:$AA$17=3))","v":2},{"$f":"SUMPRODUCT(($G$12:$L$17=B7)*($Y$12:$Y$17=1))+SUMPRODUCT(($N$12:$S$17=B7)*($AA$12:$AA$17=1))","v":1},{"$f":"SUMPRODUCT(($G$12:$L$17=B7)*($Y$12:$Y$17=0))+SUMPRODUCT(($N$12:$S$17=B7)*($AA$12:$AA$17=0))","v":0},{"$f":"H7-I7","v":3},{"$f":"RANK(Y7,$Y$6:$Y$9,0)","v":3},"PB TEAM 2",null,null,null,null,null,null,{"$f":"SUMIF($AF$12:$AK$17,P7,$AT$12:$AT$17)+SUMIF($AM$12:$AR$17,P7,$AV$12:$AV$17)","v":5},{"$f":"SUMIF($AF$12:$AK$17,P7,$AV$12:$AV$17)+SUMIF($AM$12:$AR$17,P7,$AT$12:$AT$17)","v":3},{"$f":"(Z7*3)+AA7+(W7*0.001)-(X7*0.001)","v":3.0019999999999998},{"$f":"SUMPRODUCT(($AF$12:$AK$17=P7)*($AX$12:$AX$17=3))+SUMPRODUCT(($AM$12:$AR$17=P7)*($AZ$12:$AZ$17=3))","v":1},{"$f":"SUMPRODUCT(($AF$12:$AK$17=P7)*($AX$12:$AX$17=1))+SUMPRODUCT(($AM$12:$AR$17=P7)*($AZ$12:$AZ$17=1))","v":0},{"$f":"SUMPRODUCT(($AF$12:$AK$17=P7)*($AX$12:$AX$17=0))+SUMPRODUCT(($AM$12:$AR$17=P7)*($AZ$12:$AZ$17=0))","v":2},{"$f":"W7-X7","v":2},{"$f":"RANK(AM7,$AM$6:$AM$9,0)","v":2},"PC TEAM 2",null,null,null,null,null,{"$f":"SUMIF($G$20:$L$25,AE7,$U$20:$U$25)+SUMIF($N$20:$S$25,AE7,$W$20:$W$25)","v":5},{"$f":"SUMIF($G$20:$L$25,AE7,$W$20:$W$25)+SUMIF($N$20:$S$25,AE7,$U$20:$U$25)","v":4},{"$f":"(AN7*3)+AO7+(AK7*0.001)-(AL7*0.001)","v":6.0010000000000003},{"$f":"SUMPRODUCT(($G$20:$L$25=AE7)*($Y$20:$Y$25=3))+SUMPRODUCT(($N$20:$S$25=AE7)*($AA$20:$AA$25=3))","v":2},{"$f":"SUMPRODUCT(($G$20:$L$25=AE7)*($Y$20:$Y$25=1))+SUMPRODUCT(($N$20:$S$25=AE7)*($AA$20:$AA$25=1))","v":0},{"$f":"SUMPRODUCT(($G$20:$L$25=AE7)*($Y$20:$Y$25=0))+SUMPRODUCT(($N$20:$S$25=AE7)*($AA$20:$AA$25=0))","v":1},{"$f":"AK7-AL7","v":1},{"$f":"RANK(BA7,$BA$6:$BA$9,0)","v":4},"PD TEAM 2",null,null,null,null,null,{"$f":"SUMIF($AF$20:$AK$25,AS7,$AT$20:$AT$25)+SUMIF($AM$20:$AR$25,AS7,$AV$20:$AV$25)","v":3},{"$f":"SUMIF($AF$20:$AK$25,AS7,$AV$20:$AV$25)+SUMIF($AM$20:$AR$25,AS7,$AT$20:$AT$25)","v":4},{"$f":"(BB7*3)+BC7+(AY7*0.001)-(AZ7*0.001)","v":1.9990000000000001},{"$f":"SUMPRODUCT(($AF$20:$AK$25=AS7)*($AX$20:$AX$25=3))+SUMPRODUCT(($AM$20:$AR$25=AS7)*($AZ$20:$AZ$25=3))","v":0},{"$f":"SUMPRODUCT(($AF$20:$AK$25=AS7)*($AX$20:$AX$25=1))+SUMPRODUCT(($AM$20:$AR$25=AS7)*($AZ$20:$AZ$25=1))","v":2},{"$f":"SUMPRODUCT(($AF$20:$AK$25=AS7)*($AX$20:$AX$25=0))+SUMPRODUCT(($AM$20:$AR$25=AS7)*($AZ$20:$AZ$25=0))","v":1},{"$f":"AY7-AZ7","v":-1}]
[{"$f":"RANK(J8,$J$6:$J$9,0)","v":2},"PA TEAM 3",null,null,null,null,null,{"$f":"SUMIF($G$12:$L$17,B8,$U$12:$U$17)+SUMIF($N$12:$S$17,B8,$W$12:$W$17)","v":6},{"$f":"SUMIF($G$12:$L$17,B8,$W$12:$W$17)+SUMIF($N$12:$S$17,B8,$U$12:$U$17)","v":4},{"$f":"(K8*3)+L8+(H8*0.001)-(I8*0.001)","v":5.0020000000000007},{"$f":"SUMPRODUCT(($G$12:$L$17=B8)*($Y$12:$Y$17=3))+SUMPRODUCT(($N$12:$S$17=B8)*($AA$12:$AA$17=3))","v":1},{"$f":"SUMPRODUCT(($G$12:$L$17=B8)*($Y$12:$Y$17=1))+SUMPRODUCT(($N$12:$S$17=B8)*($AA$12:$AA$17=1))","v":2},{"$f":"SUMPRODUCT(($G$12:$L$17=B8)*($Y$12:$Y$17=0))+SUMPRODUCT(($N$12:$S$17=B8)*($AA$12:$AA$17=0))","v":0},{"$f":"H8-I8","v":2},{"$f":"RANK(Y8,$Y$6:$Y$9,0)","v":1},"PB TEAM 3",null,null,null,null,null,null,{"$f":"SUMIF($AF$12:$AK$17,P8,$AT$12:$AT$17)+SUMIF($AM$12:$AR$17,P8,$AV$12:$AV$17)","v":4},{"$f":"SUMIF($AF$12:$AK$17,P8,$AV$12:$AV$17)+SUMIF($AM$12:$AR$17,P8,$AT$12:$AT$17)","v":2},{"$f":"(Z8*3)+AA8+(W8*0.001)-(X8*0.001)","v":7.0019999999999998},{"$f":"SUMPRODUCT(($AF$12:$AK$17=P8)*($AX$12:$AX$17=3))+SUMPRODUCT(($AM$12:$AR$17=P8)*($AZ$12:$AZ$17=3))","v":2},{"$f":"SUMPRODUCT(($AF$12:$AK$17=P8)*($AX$12:$AX$17=1))+SUMPRODUCT(($AM$12:$AR$17=P8)*($AZ$12:$AZ$17=1))","v":1},{"$f":"SUMPRODUCT(($AF$12:$AK$17=P8)*($AX$12:$AX$17=0))+SUMPRODUCT(($AM$12:$AR$17=P8)*($AZ$12:$AZ$17=0))","v":0},{"$f":"W8-X8","v":2},{"$f":"RANK(AM8,$AM$6:$AM$9,0)","v":3},"PC TEAM 3",null,null,null,null,null,{"$f":"SUMIF($G$20:$L$25,AE8,$U$20:$U$25)+SUMIF($N$20:$S$25,AE8,$W$20:$W$25)","v":4},{"$f":"SUMIF($G$20:$L$25,AE8,$W$20:$W$25)+SUMIF($N$20:$S$25,AE8,$U$20:$U$25)","v":5},{"$f":"(AN8*3)+AO8+(AK8*0.001)-(AL8*0.001)","v":2.9990000000000001},{"$f":"SUMPRODUCT(($G$20:$L$25=AE8)*($Y$20:$Y$25=3))+SUMPRODUCT(($N$20:$S$25=AE8)*($AA$20:$AA$25=3))","v":1},{"$f":"SUMPRODUCT(($G$20:$L$25=AE8)*($Y$20:$Y$25=1))+SUMPRODUCT(($N$20:$S$25=AE8)*($AA$20:$AA$25=1))","v":0},{"$f":"SUMPRODUCT(($G$20:$L$25=AE8)*($Y$20:$Y$25=0))+SUMPRODUCT(($N$20:$S$25=AE8)*($AA$20:$AA$25=0))","v":2},{"$f":"AK8-AL8","v":-1},{"$f":"RANK(BA8,$BA$6:$BA$9,0)","v":2},"PD TEAM 3",null,null,null,null,null,{"$f":"SUMIF($AF$20:$AK$25,AS8,$AT$20:$AT$25)+SUMIF($AM$20:$AR$25,AS8,$AV$20:$AV$25)","v":3},{"$f":"SUMIF($AF$20:$AK$25,AS8,$AV$20:$AV$25)+SUMIF($AM$20:$AR$25,AS8,$AT$20:$AT$25)","v":2},{"$f":"(BB8*3)+BC8+(AY8*0.001)-(AZ8*0.001)","v":4.0010000000000003},{"$f":"SUMPRODUCT(($AF$20:$AK$25=AS8)*($AX$20:$AX$25=3))+SUMPRODUCT(($AM$20:$AR$25=AS8)*($AZ$20:$AZ$25=3))","v":1},{"$f":"SUMPRODUCT(($AF$20:$AK$25=AS8)*($AX$20:$AX$25=1))+SUMPRODUCT(($AM$20:$AR$25=AS8)*($AZ$20:$AZ$25=1))","v":1},{"$f":"SUMPRODUCT(($AF$20:$AK$25=AS8)*($AX$20:$AX$25=0))+SUMPRODUCT(($AM$20:$AR$25=AS8)*($AZ$20:$AZ$25=0))","v":1},{"$f":"AY8-AZ8","v":1}]
[{"$f":"RANK(J9,$J$6:$J$9,0)","v":3},"PA TEAM 4",null,null,null,null,null,{"$f":"SUMIF($G$12:$L$17,B9,$U$12:$U$17)+SUMIF($N$12:$S$17,B9,$W$12:$W$17)","v":6},{"$f":"SUMIF($G$12:$L$17,B9,$W$12:$W$17)+SUMIF($N$12:$S$17,B9,$U$12:$U$17)","v":9},{"$f":"(K9*3)+L9+(H9*0.001)-(I9*0.001)","v":2.9969999999999999},{"$f":"SUMPRODUCT(($G$12:$L$17=B9)*($Y$12:$Y$17=3))+SUMPRODUCT(($N$12:$S$17=B9)*($AA$12:$AA$17=3))","v":1},{"$f":"SUMPRODUCT(($G$12:$L$17=B9)*($Y$12:$Y$17=1))+SUMPRODUCT(($N$12:$S$17=B9)*($AA$12:$AA$17=1))","v":0},{"$f":"SUMPRODUCT(($G$12:$L$17=B9)*($Y$12:$Y$17=0))+SUMPRODUCT(($N$12:$S$17=B9)*($AA$12:$AA$17=0))","v":2},{"$f":"H9-I9","v":-3},{"$f":"RANK(Y9,$Y$6:$Y$9,0)","v":4},"PB TEAM 4",null,null,null,null,null,null,{"$f":"SUMIF($AF$12:$AK$17,P9,$AT$12:$AT$17)+SUMIF($AM$12:$AR$17,P9,$AV$12:$AV$17)","v":1},{"$f":"SUMIF($AF$12:$AK$17,P9,$AV$12:$AV$17)+SUMIF($AM$12:$AR$17,P9,$AT$12:$AT$17)","v":6},{"$f":"(Z9*3)+AA9+(W9*0.001)-(X9*0.001)","v":0.99499999999999988},{"$f":"SUMPRODUCT(($AF$12:$AK$17=P9)*($AX$12:$AX$17=3))+SUMPRODUCT(($AM$12:$AR$17=P9)*($AZ$12:$AZ$17=3))","v":0},{"$f":"SUMPRODUCT(($AF$12:$AK$17=P9)*($AX$12:$AX$17=1))+SUMPRODUCT(($AM$12:$AR$17=P9)*($AZ$12:$AZ$17=1))","v":1},{"$f":"SUMPRODUCT(($AF$12:$AK$17=P9)*($AX$12:$AX$17=0))+SUMPRODUCT(($AM$12:$AR$17=P9)*($AZ$12:$AZ$17=0))","v":2},{"$f":"W9-X9","v":-5},{"$f":"RANK(AM9,$AM$6:$AM$9,0)","v":1},"PC TEAM 4",null,null,null,null,null,{"$f":"SUMIF($G$20:$L$25,AE9,$U$20:$U$25)+SUMIF($N$20:$S$25,AE9,$W$20:$W$25)","v":7},{"$f":"SUMIF($G$20:$L$25,AE9,$W$20:$W$25)+SUMIF($N$20:$S$25,AE9,$U$20:$U$25)","v":5},{"$f":"(AN9*3)+AO9+(AK9*0.001)-(AL9*0.001)","v":6.0019999999999998},{"$f":"SUMPRODUCT(($G$20:$L$25=AE9)*($Y$20:$Y$25=3))+SUMPRODUCT(($N$20:$S$25=AE9)*($AA$20:$AA$25=3))","v":2},{"$f":"SUMPRODUCT(($G$20:$L$25=AE9)*($Y$20:$Y$25=1))+SUMPRODUCT(($N$20:$S$25=AE9)*($AA$20:$AA$25=1))","v":0},{"$f":"SUMPRODUCT(($G$20:$L$25=AE9)*($Y$20:$Y$25=0))+SUMPRODUCT(($N$20:$S$25=AE9)*($AA$20:$AA$25=0))","v":1},{"$f":"AK9-AL9","v":2},{"$f":"RANK(BA9,$BA$6:$BA$9,0)","v":1},"PD TEAM 4",null,null,null,null,null,{"$f":"SUMIF($AF$20:$AK$25,AS9,$AT$20:$AT$25)+SUMIF($AM$20:$AR$25,AS9,$AV$20:$AV$25)","v":4},{"$f":"SUMIF($AF$20:$AK$25,AS9,$AV$20:$AV$25)+SUMIF($AM$20:$AR$25,AS9,$AT$20:$AT$25)","v":3},{"$f":"(BB9*3)+BC9+(AY9*0.001)-(AZ9*0.001)","v":5.0009999999999994},{"$f":"SUMPRODUCT(($AF$20:$AK$25=AS9)*($AX$20:$AX$25=3))+SUMPRODUCT(($AM$20:$AR$25=AS9)*($AZ$20:$AZ$25=3))","v":1},{"$f":"SUMPRODUCT(($AF$20:$AK$25=AS9)*($AX$20:$AX$25=1))+SUMPRODUCT(($AM$20:$AR$25=AS9)*($AZ$20:$AZ$25=1))","v":2},{"$f":"SUMPRODUCT(($AF$20:$AK$25=AS9)*($AX$20:$AX$25=0))+SUMPRODUCT(($AM$20:$AR$25=AS9)*($AZ$20:$AZ$25=0))","v":0},{"$f":"AY9-AZ9","v":1}]
[]
["Scheidsrechter",null,null,"Tijd",null,null,"HAL 1",null,null,null,null,null,null,null,null,null,null,null,null,null,"Uitslag",null,null,null,"Punten",null,null,null,"Tijd",null,null,"HAL 2",null,null,null,null,null,null,null,null,null,null,null,null,null,"Uitslag",null,null,null,"Punten",null,null,null,null,null,"Scheidsrechter"]
["EW",null,null,"17:30:00",null,null,{"$f":"B6","v":"PA TEAM 1"},null,null,null,null,null,"--",{"$f":"B7","v":"PA TEAM 2"},null,null,null,null,null,null,1,"--",2,null,{"$f":"IF(U12=\"\",\"\",IF(U12>W12,3,IF(U12=W12,1,0)))","v":0},null,{"$f":"IF(W12=\"\",\"\",IF(W12>U12,3,IF(W12=U12,1,0)))","v":3},null,"17:30:00",null,null,{"$f":"P6","v":"PB TEAM 1"},null,null,null,null,null,"--",{"$f":"P7","v":"PB TEAM 2"},null,null,null,null,null,null,1,"--",0,null,{"$f":"IF(AT12=\"\",\"\",IF(AT12>AV12,3,IF(AT12=AV12,1,0)))","v":3},null,{"$f":"IF(AV12=\"\",\"\",IF(AV12>AT12,3,IF(AV12=AT12,1,0)))","v":0},null,null,null,"PD"]
["RH",null,null,"17:56:00",null,null,{"$f":"B8","v":"PA TEAM 3"},null,null,null,null,null,"--",{"$f":"B9","v":"PA TEAM 4"},null,null,null,null,null,null,3,"--",1,null,{"$f":"IF(U13=\"\",\"\",IF(U13>W13,3,IF(U13=W13,1,0)))","v":3},null,{"$f":"IF(W13=\"\",\"\",IF(W13>U13,3,IF(W13=U13,1,0)))","v":0},null,"17:56:00",null,null,{"$f":"P8","v":"PB TEAM 3"},null,null,null,null,null,"--",{"$f":"P9","v":"PB TEAM 4"},null,null,null,null,null,null,1,"--",0,null,{"$f":"IF(AT13=\"\",\"\",IF(AT13>AV13,3,IF(AT13=AV13,1,0)))","v":3},null,{"$f":"IF(AV13=\"\",\"\",IF(AV13>AT13,3,IF(AV13=AT13,1,0)))","v":0},null,null,null,"IG"]
["EW",null,null,"18:22:00",null,null,{"$f":"B9","v":"PA TEAM 4"},null,null,null,null,null,"--",{"$f":"B6","v":"PA TEAM 1"},null,null,null,null,null,null,3,"--",2,null,{"$f":"IF(U14=\"\",\"\",IF(U14>W14,3,IF(U14=W14,1,0)))","v":3},null,0,null,"18:22:00",null,null,{"$f":"P9","v":"PB TEAM 4"},null,null,null,null,null,"--",{"$f":"P6","v":"PB TEAM 1"},null,null,null,null,null,null,1,"--",1,null,{"$f":"IF(AT14=\"\",\"\",IF(AT14>AV14,3,IF(AT14=AV14,1,0)))","v":1},null,1,null,null,null,"PD"]
["RH",null,null,"18:48:00",null,null,{"$f":"B7","v":"PA TEAM 2"},null,null,null,null,null,"--",{"$f":"B8","v":"PA TEAM 3"},null,null,null,null,null,null,1,"--",1,null,1,null,1,null,"18:48:00",null,null,{"$f":"P7","v":"PB TEAM 2"},null,null,null,null,null,"--",{"$f":"P8","v":"PB TEAM 3"},null,null,null,null,null,null,1,"--",2,null,0,null,3,null,null,null,"IG"]
["EW",null,null,"19:14:00",null,null,{"$f":"B7","v":"PA TEAM 2"},null,null,null,null,null,"--",{"$f":"B9","v":"PA TEAM 4"},null,null,null,null,null,null,4,"--",2,null,3,null,0,null,"19:14:00",null,null,{"$f":"P6","v":"PB TEAM 1"},null,null,null,null,null,"--",{"$f":"P8","v":"PB TEAM 3"},null,null,null,null,null,null,1,"--",1,null,1,null,1,null,null,null,"PD"]
["RH",null,null,"19:40:00",null,null,{"$f":"B6","v":"PA TEAM 1"},null,null,null,null,null,"--",{"$f":"B8","v":"PA TEAM 3"},null,null,null,null,null,null,2,"--",2,null,1,null,1,null,"19:40:00",null,null,{"$f":"P7","v":"PB TEAM 2"},null,null,null,null,null,"--",{"$f":"P9","v":"PB TEAM 4"},null,null,null,null,null,null,4,"--",0,null,3,null,0,null,null,null,"IG"]
[]
[null,null,null,"Tijd",null,null,"HAL 1",null,null,null,null,null,null,null,null,null,null,null,null,null,"Uitslag",null,null,null,"Punten",null,null,null,"Tijd",null,null,"HAL 2",null,null,null,null,null,null,null,null,null,null,null,null,null,"Uitslag",null,null,null,"Punten"]
["EW",null,null,"17:43:00",null,null,{"$f":"AE6","v":"PC TEAM 1"},null,null,null,null,null,"--",{"$f":"AE7","v":"PC TEAM 2"},null,null,null,null,null,null,1,"--",2,null,{"$f":"IF(U20=\"\",\"\",IF(U20>W20,3,IF(U20=W20,1,0)))","v":0},null,{"$f":"IF(W20=\"\",\"\",IF(W20>U20,3,IF(W20=U20,1,0)))","v":3},null,"17:43:00",null,null,{"$f":"AS6","v":"PD TEAM 1"},null,null,null,null,null,"--",{"$f":"AS7","v":"PD TEAM 2"},null,null,null,null,null,null,3,"--",2,null,{"$f":"IF(AT20=\"\",\"\",IF(AT20>AV20,3,IF(AT20=AV20,1,0)))","v":3},null,{"$f":"IF(AV20=\"\",\"\",IF(AV20>AT20,3,IF(AV20=AT20,1,0)))","v":0},null,null,null,"PD"]
["RH",null,null,"18:09:00",null,null,{"$f":"AE8","v":"PC TEAM 3"},null,null,null,null,null,"--",{"$f":"AE9","v":"PC TEAM 4"},null,null,null,null,null,null,3,"--",2,null,{"$f":"IF(U21=\"\",\"\",IF(U21>W21,3,IF(U21=W21,1,0)))","v":3},null,{"$f":"IF(W21=\"\",\"\",IF(W21>U21,3,IF(W21=U21,1,0)))","v":0},null,"18:09:00",null,null,{"$f":"AS8","v":"PD TEAM 3"},null,null,null,null,null,"--",{"$f":"AS9","v":"PD TEAM 4"},null,null,null,null,null,null,1,"--",2,null,{"$f":"IF(AT21=\"\",\"\",IF(AT21>AV21,3,IF(AT21=AV21,1,0)))","v":0},null,{"$f":"IF(AV21=\"\",\"\",IF(AV21>AT21,3,IF(AV21=AT21,1,0)))","v":3},null,null,null,"IG"]
["EW",null,null,"18:35:00",null,null,{"$f":"AE9","v":"PC TEAM 4"},null,null,null,null,null,"--",{"$f":"AE6","v":"PC TEAM 1"},null,null,null,null,null,null,3,"--",1,null,{"$f":"IF(U22=\"\",\"\",IF(U22>W22,3,IF(U22=W22,1,0)))","v":3},null,0,null,"18:35:00",null,null,{"$f":"AS9","v":"PD TEAM 4"},null,null,null,null,null,"--",{"$f":"AS6","v":"PD TEAM 1"},null,null,null,null,null,null,1,"--",1,null,{"$f":"IF(AT22=\"\",\"\",IF(AT22>AV22,3,IF(AT22=AV22,1,0)))","v":1},null,1,null,null,null,"PD"]
["RH",null,null,"19:01:00",null,null,{"$f":"AE7","v":"PC TEAM 2"},null,null,null,null,null,"--",{"$f":"AE8","v":"PC TEAM 3"},null,null,null,null,null,null,2,"--",1,null,3,null,0,null,"19:01:00",null,null,{"$f":"AS7","v":"PD TEAM 2"},null,null,null,null,null,"--",{"$f":"AS8","v":"PD TEAM 3"},null,null,null,null,null,null,0,"--",0,null,1,null,1,null,null,null,"IG"]
["EW",null,null,"19:27:00",null,null,{"$f":"AE6","v":"PC TEAM 1"},null,null,null,null,null,"--",{"$f":"AE8","v":"PC TEAM 3"},null,null,null,null,null,null,1,"--",0,null,3,null,0,null,"19:27:00",null,null,{"$f":"AS7","v":"PD TEAM 2"},null,null,null,null,null,"--",{"$f":"AS9","v":"PD TEAM 4"},null,null,null,null,null,null,1,"--",1,null,1,null,1,null,null,null,"PD"]
["RH",null,null,"19:53:00",null,null,{"$f":"AE9","v":"PC TEAM 4"},null,null,null,null,null,"--",{"$f":"AE7","v":"PC TEAM 2"},null,null,null,null,null,null,2,"--",1,null,3,null,0,null,"19:53:00",null,null,{"$f":"AS6","v":"PD TEAM 1"},null,null,null,null,null,"--",{"$f":"AS8","v":"PD TEAM 3"},null,null,null,null,null,null,0,"--",2,null,0,null,3,null,null,null,"IG"]
[]
[]
[]
[]
[]
[]
[]
[]
[]
[]
[]
[]
[]
[]
[]
[null,null,null,"Scheidsrechters",null,null,null,null,"Scheidsrechter 1",null,null,null,null,null,"EW"]
[null,null,null,null,null,null,null,null,"Scheidsrechter 2",null,null,null,null,null,"PD"]
[null,null,null,null,null,null,null,null,"Scheidsrechter 3",null,null,null,null,null,"RH"]
[null,null,null,null,null,null,null,null,"Scheidsrechter 4",null,null,null,null,null,"IG"]

{"sheet":"Finale's","index":1,"n_rows":25,"n_cols":59,"rows_kept":25,"cut":false,"hidden":false,"merged":[[15,26,15,29],[15,21,15,24],[15,10,15,13],[15,5,15,8],[22,14,22,20],[20,13,20,16],[20,18,20,21],[19,18,19,21],[19,13,19,16],[17,5,17,29],[4,5,4,29],[12,5,12,29],[14,2,14,3],[14,26,14,29],[14,21,14,24],[14,10,14,13],[14,5,14,8],[10,26,10,29],[9,26,9,29],[9,21,9,24],[14,18,14,19],[10,21,10,24],[9,5,9,8],[6,18,6,19],[6,21,6,24],[9,10,9,13],[6,26,6,29],[7,5,7,8],[7,10,7,13],[7,26,7,29],[7,21,7,24],[24,14,26,20],[6,2,6,3],[6,5,6,8],[6,10,6,13],[9,2,9,3],[19,9,19,10],[9,18,9,19],[10,5,10,8],[10,10,10,13],[24,0,24,3],[24,6,24,9]]}
[]
[]
[]
[]
[null,null,null,null,null,"Kwartfinale",null,null,null,null,null,null,null,null,null,null,null,null,null,null,null,null,null,null,null,null,null,null,null,null,null,null,null,null,null,null,null,null,null,null,null,null,null,null,null,null,null,null,null,null,{"$f":"Poule!AY1","v":18},{"$f":"Poule!BJ1","v":4},{"$f":"Poule!BK1","v":"PA TEAM 1"},{"$f":"Poule!BL1","v":2},{"$f":"Poule!BM1","v":"PB TEAM 1"},{"$f":"Poule!BN1","v":4},{"$f":"Poule!BO1","v":"PC TEAM 1"},{"$f":"Poule!BP1","v":3},{"$f":"Poule!BQ1","v":"PD TEAM 1"}]
[null,null,null,null,null,null,null,null,null,"HAL 1",null,null,null,null,null,null,null,null,null,null,null,null,null,null,null,"HAL 2",null,null,null,null,null,null,null,null,null,null,null,null,null,null,null,null,null,null,null,null,null,null,null,null,{"$f":"Poule!AZ1","v":18},{"$f":"Poule!BJ2","v":1},{"$f":"Poule!BK2","v":"PA TEAM 2"},{"$f":"Poule!BL2","v":3},{"$f":"Poule!BM2","v":"PB TEAM 2"},{"$f":"Poule!BN2","v":2},{"$f":"Poule!BO2","v":"PC TEAM 2"},{"$f":"Poule!BP2","v":4},{"$f":"Poule!BQ2","v":"PD TEAM 2"}]
[null,null,"20:15:00",null,"A","Nr 1 groep 1",null,null,null,null,"Nr 2 groep 3",null,null,null,"Scheidsrechter",null,null,null,"20:15:00",null,"B","Nr 1 groep 2",null,null,null,null,"Nr 2 groep 4",null,null,null,"Scheidsrechter",null,null,null,null,null,null,null,null,null,null,null,null,null,null,null,null,null,null,null,{"$f":"Poule!BA1","v":18},{"$f":"Poule!BJ3","v":2},{"$f":"Poule!BK3","v":"PA TEAM 3"},{"$f":"Poule!BL3","v":1},{"$f":"Poule!BM3","v":"PB TEAM 3"},{"$f":"Poule!BN3","v":3},{"$f":"Poule!BO3","v":"PC TEAM 3"},{"$f":"Poule!BP3","v":2},{"$f":"Poule!BQ3","v":"PD TEAM 3"}]
[null,null,null,null,null,{"$f":"IF(AY5=18,VLOOKUP(1,AZ5:BA8,2,0),\"\")","v":"PA TEAM 2"},null,null,null,"--",{"$f":"IF(AY7=18,VLOOKUP(2,BD5:BE8,2,0),\"\")","v":"PC TEAM 2"},null,null,null,"EW",null,"-",null,null,null,null,{"$f":"IF(AY6=18,VLOOKUP(1,BB5:BC8,2,0),\"\")","v":"PB TEAM 3"},null,null,null,"--",{"$f":"IF(AY8=18,VLOOKUP(2,BF5:BG8,2,0),\"\")","v":"PD TEAM 3"},null,null,null,"PD",null,"-",null,null,null,null,null,null,null,null,null,null,null,null,null,null,null,null,null,{"$f":"Poule!BB1","v":18},{"$f":"Poule!BJ4","v":3},{"$f":"Poule!BK4","v":"PA TEAM 4"},{"$f":"Poule!BL4","v":4},{"$f":"Poule!BM4","v":"PB TEAM 4"},{"$f":"Poule!BN4","v":1},{"$f":"Poule!BO4","v":"PC TEAM 4"},{"$f":"Poule!BP4","v":1},{"$f":"Poule!BQ4","v":"PD TEAM 4"}]
[null,null,null,null,null,null,null,null,null,"HAL 1",null,null,null,null,null,null,null,null,null,null,null,null,null,null,null,"HAL 2"]
[null,null,"20:28:00",null,"C","Nr 1 groep 3",null,null,null,null,"Nr 2 groep 1",null,null,null,"Scheidsrechter",null,null,null,"20:28:00",null,"D","Nr 1 groep 4 ",null,null,null,null,"Nr 2 groep 2",null,null,null,"Scheidsrechter"]
[null,null,null,null,null,{"$f":"IF(AY7=18,VLOOKUP(1,BD5:BE8,2,0),\"\")","v":"PC TEAM 4"},null,null,null,null,{"$f":"IF(AY6=18,VLOOKUP(2,AZ5:BA8,2,0),\"\")","v":"PA TEAM 3"},null,null,null,"RH",null,"-",null,null,null,null,{"$f":"IF(AY8=18,VLOOKUP(1,BF5:BG8,2,0),\"\")","v":"PD TEAM 4"},null,null,null,null,{"$f":"IF(AY5=18,VLOOKUP(2,BB5:BC8,2,0),\"\")","v":"PB TEAM 1"},null,null,null,"IG",null,"-"]
[]
[null,null,null,null,null,"Halve finale"]
[null,null,null,null,null,null,null,null,null,"HAL 1",null,null,null,null,null,null,null,null,null,null,null,null,null,null,null,"HAL 1"]
[null,null,"20:50:00",null,"E","Winnaar A",null,null,null,null,"Winnaar B",null,null,null,"Scheidsrechter",null,null,null,"21:07:00",null,"F","Winnaar C",null,null,null,null,"Winnaar D",null,null,null,"Scheidsrechter"]
[null,null,null,null,null,{"$f":"IF(P8=\"\",\"\",IF(P8>R8,F8,K8))","v":""},null,null,null,null,{"$f":"IF(AF8=\"\",\"\",IF(AF8>AH8,V8,AA8))","v":""},null,null,null,"EW",null,"-",null,null,null,null,{"$f":"IF(P11=\"\",\"\",IF(P11>R11,F11,K11))","v":""},null,null,null,null,{"$f":"IF(AF11=\"\",\"\",IF(AF11>AH11,V11,AA11))","v":""},null,null,null,"PD",null,"-"]
[]
[null,null,null,null,null,"Finale"]
[null,null,null,null,null,null,null,null,null,null,null,null,null,null,null,null,null,"HAL 1"]
[null,null,null,null,null,null,null,null,null,"21:25:00",null,null,null,"Winnaar E",null,null,null,null,"Winnaar F"]
[null,null,null,null,null,null,null,null,null,null,null,null,null,{"$f":"IF(P16=\"\",\"\",IF(P16>R16,F16,K16))","v":""},null,null,null,null,{"$f":"IF(AF16=\"\",\"\",IF(AF16>AH16,V16,AA16))","v":""},null,null,null,null,null,"-",null,null,null,null,null,"Scheidsrechter"]
[null,null,null,null,null,null,null,null,null,null,null,null,null,null,null,null,null,null,null,null,null,null,null,null,null,null,null,null,null,null,"Mario van der Ende"]
[null,null,null,null,null,null,null,null,null,null,null,null,null,null,"Winnaar MEGA toernooi"]
[]
[null,null,null,null,null,null,null,null,null,null,null,null,null,null,{"$f":"IF(X21=\"\",\"\",IF(X21>Z21,N21,S21))","v":""}]

{"sheet":"GROEP-1","index":2,"n_rows":19,"n_cols":15,"rows_kept":19,"cut":false,"hidden":false,"merged":[[0,14,2,15],[0,0,2,13],[16,1,16,6],[17,1,17,6],[18,1,18,6],[12,0,14,0],[3,0,3,1],[3,2,3,6],[3,7,3,9],[7,2,7,3],[7,5,7,6],[6,0,6,1],[7,0,7,1],[3,11,3,13],[12,1,14,6],[12,7,14,7],[12,8,14,8],[12,9,14,9],[12,11,14,11],[12,12,14,12],[12,13,14,13],[15,1,15,6],[12,10,14,10],[9,2,9,3],[9,5,9,6],[4,0,4,1],[5,0,5,1],[5,2,5,3],[4,2,4,3],[4,5,4,6],[5,5,5,6],[8,0,8,1],[9,0,9,1],[6,2,6,3],[6,5,6,6],[8,2,8,3],[8,5,8,6]]}
["MEGA TOERNOOI",null,null,null,null,null,null,null,null,null,null,null,null,null,"Scores By:\nOnlineExcelCursus.NL"]
[]
[]
[{"$f":"Poule!D11","v":"Tijd"},{"$f":"Poule!E11","v":0},{"$f":"Poule!G11","v":"HAL 1"},null,null,null,null,{"$f":"Poule!U11","v":"Uitslag"},null,null,null,{"$f":"Poule!Y11","v":"Punten"}]
[{"$f":"Poule!D12","v":"17:30:00"},{"$f":"Poule!E12","v":"00:00:00"},{"$f":"Poule!G12","v":"PA TEAM 1"},{"$f":"Poule!H12","v":0},{"$f":"Poule!M12","v":"--"},{"$f":"Poule!N12","v":"PA TEAM 2"},{"$f":"Poule!O12","v":0},{"$f":"Poule!U12","v":1},{"$f":"Poule!V12","v":"--"},{"$f":"Poule!W12","v":2},null,{"$f":"Poule!Y12","v":0},null,{"$f":"Poule!AA12","v":3}]
[{"$f":"Poule!D13","v":"17:56:00"},{"$f":"Poule!E13","v":"00:00:00"},{"$f":"Poule!G13","v":"PA TEAM 3"},{"$f":"Poule!H13","v":0},{"$f":"Poule!M13","v":"--"},{"$f":"Poule!N13","v":"PA TEAM 4"},{"$f":"Poule!O13","v":0},{"$f":"Poule!U13","v":3},{"$f":"Poule!V13","v":"--"},{"$f":"Poule!W13","v":1},null,{"$f":"Poule!Y13","v":3},null,{"$f":"Poule!AA13","v":0}]
[{"$f":"Poule!D14","v":"18:22:00"},{"$f":"Poule!E14","v":"00:00:00"},{"$f":"Poule!G14","v":"PA TEAM 4"},{"$f":"Poule!H14","v":0},{"$f":"Poule!M14","v":"--"},{"$f":"Poule!N14","v":"PA TEAM 1"},{"$f":"Poule!O14","v":0},{"$f":"Poule!U14","v":3},{"$f":"Poule!V14","v":"--"},{"$f":"Poule!W14","v":2},null,{"$f":"Poule!Y14","v":3},null,{"$f":"Poule!AA14","v":0}]
[{"$f":"Poule!D15","v":"18:48:00"},{"$f":"Poule!E15","v":"00:00:00"},{"$f":"Poule!G15","v":"PA TEAM 2"},{"$f":"Poule!H15","v":0},{"$f":"Poule!M15","v":"--"},{"$f":"Poule!N15","v":"PA TEAM 3"},{"$f":"Poule!O15","v":0},{"$f":"Poule!U15","v":1},{"$f":"Poule!V15","v":"--"},{"$f":"Poule!W15","v":1},null,{"$f":"Poule!Y15","v":1},null,{"$f":"Poule!AA15","v":1}]
[{"$f":"Poule!D16","v":"19:14:00"},{"$f":"Poule!E16","v":"00:00:00"},{"$f":"Poule!G16","v":"PA TEAM 2"},{"$f":"Poule!H16","v":0},{"$f":"Poule!M16","v":"--"},{"$f":"Poule!N16","v":"PA TEAM 4"},{"$f":"Poule!O16","v":0},{"$f":"Poule!U16","v":4},{"$f":"Poule!V16","v":"--"},{"$f":"Poule!W16","v":2},null,{"$f":"Poule!Y16","v":3},null,{"$f":"Poule!AA16","v":0}]
[{"$f":"Poule!D17","v":"19:40:00"},{"$f":"Poule!E17","v":"00:00:00"},{"$f":"Poule!G17","v":"PA TEAM 1"},{"$f":"Poule!H17","v":0},{"$f":"Poule!M17","v":"--"},{"$f":"Poule!N17","v":"PA TEAM 3"},{"$f":"Poule!O17","v":0},{"$f":"Poule!U17","v":2},{"$f":"Poule!V17","v":"--"},{"$f":"Poule!W17","v":2},null,{"$f":"Poule!Y17","v":1},null,{"$f":"Poule!AA17","v":1}]
[]
[]
[{"$f":"Poule!A3","v":"Stand"},{"$f":"Poule!B5","v":"Groep 1"},null,null,null,null,null,{"$f":"Poule!H5","v":"V"},{"$f":"Poule!I5","v":"T"},{"$f":"Poule!J5","v":"P"},{"$f":"Poule!K3","v":"Gewonnen"},{"$f":"Poule!L3","v":"Gelijk"},{"$f":"Poule!M3","v":"Verloren"},{"$f":"Poule!N3","v":"Saldo"}]
[{"$f":"Poule!A4","v":0},null,null,null,null,null,null,null,null,null,{"$f":"Poule!K4","v":0},{"$f":"Poule!L4","v":0},{"$f":"Poule!M4","v":0},{"$f":"Poule!N4","v":0}]
[{"$f":"Poule!A5","v":0},null,null,null,null,null,null,null,null,null,{"$f":"Poule!K5","v":0},{"$f":"Poule!L5","v":0},{"$f":"Poule!M5","v":0},{"$f":"Poule!N5","v":0}]
[{"$f":"Poule!A6","v":4},{"$f":"Poule!B6","v":"PA TEAM 1"},{"$f":"Poule!C6","v":0},{"$f":"Poule!D6","v":0},{"$f":"Poule!E6","v":0},{"$f":"Poule!F6","v":0},{"$f":"Poule!G6","v":0},{"$f":"Poule!H6","v":5},{"$f":"Poule!I6","v":7},{"$f":"Poule!J6","v":0.99799999999999989},{"$f":"Poule!K6","v":0},{"$f":"Poule!L6","v":1},{"$f":"Poule!M6","v":2},{"$f":"Poule!N6","v":-2}]
[{"$f":"Poule!A7","v":1},{"$f":"Poule!B7","v":"PA TEAM 2"},{"$f":"Poule!C7","v":0},{"$f":"Poule!D7","v":0},{"$f":"Poule!E7","v":0},{"$f":"Poule!F7","v":0},{"$f":"Poule!G7","v":0},{"$f":"Poule!H7","v":7},{"$f":"Poule!I7","v":4},{"$f":"Poule!J7","v":7.0030000000000001},{"$f":"Poule!K7","v":2},{"$f":"Poule!L7","v":1},{"$f":"Poule!M7","v":0},{"$f":"Poule!N7","v":3}]
[{"$f":"Poule!A8","v":2},{"$f":"Poule!B8","v":"PA TEAM 3"},{"$f":"Poule!C8","v":0},{"$f":"Poule!D8","v":0},{"$f":"Poule!E8","v":0},{"$f":"Poule!F8","v":0},{"$f":"Poule!G8","v":0},{"$f":"Poule!H8","v":6},{"$f":"Poule!I8","v":4},{"$f":"Poule!J8","v":5.0020000000000007},{"$f":"Poule!K8","v":1},{"$f":"Poule!L8","v":2},{"$f":"Poule!M8","v":0},{"$f":"Poule!N8","v":2}]
[{"$f":"Poule!A9","v":3},{"$f":"Poule!B9","v":"PA TEAM 4"},{"$f":"Poule!C9","v":0},{"$f":"Poule!D9","v":0},{"$f":"Poule!E9","v":0},{"$f":"Poule!F9","v":0},{"$f":"Poule!G9","v":0},{"$f":"Poule!H9","v":6},{"$f":"Poule!I9","v":9},{"$f":"Poule!J9","v":2.9969999999999999},{"$f":"Poule!K9","v":1},{"$f":"Poule!L9","v":0},{"$f":"Poule!M9","v":2},{"$f":"Poule!N9","v":-3}]

{"sheet":"GROEP-2","index":3,"n_rows":20,"n_cols":13,"rows_kept":20,"cut":false,"hidden":false,"merged":[[0,12,2,13],[16,1,16,4],[17,1,17,4],[18,1,18,4],[0,0,2,11],[3,5,3,7],[3,9,3,11],[3,0,3,1],[3,2,3,4],[9,0,9,1],[6,0,6,1],[13,8,15,8],[13,9,15,9],[13,10,15,10],[13,7,15,7],[13,6,15,6],[19,1,19,4],[7,0,7,1],[8,0,8,1],[13,11,15,11],[4,0,4,1],[5,0,5,1],[13,0,15,0],[13,1,15,4],[13,5,15,5]]}
["MEGA TOERNOOI",null,null,null,null,null,null,null,null,null,null,null,"Scores By:\nOnlineExcelCursus.NL"]
[]
[]
[{"$f":"Poule!AC11","v":"Tijd"},null,{"$f":"Poule!AF11","v":"HAL 2"},null,null,{"$f":"Poule!AT11","v":"Uitslag"},null,null,null,{"$f":"Poule!AX11","v":"Punten"}]
[{"$f":"Poule!AC12","v":"17:30:00"},{"$f":"Poule!AD12","v":"00:00:00"},{"$f":"Poule!AF12","v":"PB TEAM 1"},{"$f":"Poule!AL12","v":"--"},{"$f":"Poule!AM12","v":"PB TEAM 2"},{"$f":"Poule!AT12","v":1},{"$f":"Poule!AU12","v":"--"},{"$f":"Poule!AV12","v":0},null,{"$f":"Poule!AX12","v":3},null,{"$f":"Poule!AZ12","v":0}]
[{"$f":"Poule!AC13","v":"17:56:00"},{"$f":"Poule!AD13","v":"00:00:00"},{"$f":"Poule!AF13","v":"PB TEAM 3"},{"$f":"Poule!AL13","v":"--"},{"$f":"Poule!AM13","v":"PB TEAM 4"},{"$f":"Poule!AT13","v":1},{"$f":"Poule!AU13","v":"--"},{"$f":"Poule!AV13","v":0},null,{"$f":"Poule!AX13","v":3},null,{"$f":"Poule!AZ13","v":0}]
[{"$f":"Poule!AC14","v":"18:22:00"},{"$f":"Poule!AD14","v":"00:00:00"},{"$f":"Poule!AF14","v":"PB TEAM 4"},{"$f":"Poule!AL14","v":"--"},{"$f":"Poule!AM14","v":"PB TEAM 1"},{"$f":"Poule!AT14","v":1},{"$f":"Poule!AU14","v":"--"},{"$f":"Poule!AV14","v":1},null,{"$f":"Poule!AX14","v":1},null,{"$f":"Poule!AZ14","v":1}]
[{"$f":"Poule!AC15","v":"18:48:00"},{"$f":"Poule!AD15","v":"00:00:00"},{"$f":"Poule!AF15","v":"PB TEAM 2"},{"$f":"Poule!AL15","v":"--"},{"$f":"Poule!AM15","v":"PB TEAM 3"},{"$f":"Poule!AT15","v":1},{"$f":"Poule!AU15","v":"--"},{"$f":"Poule!AV15","v":2},null,{"$f":"Poule!AX15","v":0},null,{"$f":"Poule!AZ15","v":3}]
[{"$f":"Poule!AC16","v":"19:14:00"},{"$f":"Poule!AD16","v":"00:00:00"},{"$f":"Poule!AF16","v":"PB TEAM 1"},{"$f":"Poule!AL16","v":"--"},{"$f":"Poule!AM16","v":"PB TEAM 3"},{"$f":"Poule!AT16","v":1},{"$f":"Poule!AU16","v":"--"},{"$f":"Poule!AV16","v":1},null,{"$f":"Poule!AX16","v":1},null,{"$f":"Poule!AZ16","v":1}]
[{"$f":"Poule!AC17","v":"19:40:00"},{"$f":"Poule!AD17","v":"00:00:00"},{"$f":"Poule!AF17","v":"PB TEAM 2"},{"$f":"Poule!AL17","v":"--"},{"$f":"Poule!AM17","v":"PB TEAM 4"},{"$f":"Poule!AT17","v":4},{"$f":"Poule!AU17","v":"--"},{"$f":"Poule!AV17","v":0},null,{"$f":"Poule!AX17","v":3},null,{"$f":"Poule!AZ17","v":0}]
[]
[]
[]
[{"$f":"Poule!O3","v":"Stand"},{"$f":"Poule!P5","v":"Groep 2"},null,null,null,{"$f":"Poule!W5","v":"V"},{"$f":"Poule!X5","v":"T"},{"$f":"Poule!Y5","v":"P"},{"$f":"Poule!Z3","v":"Gewonnen"},{"$f":"Poule!AA3","v":"Gelijk"},{"$f":"Poule!AB3","v":"Verloren"},{"$f":"Poule!AC3","v":"Saldo"}]
[{"$f":"Poule!O4","v":0},null,null,null,null,null,null,null,{"$f":"Poule!Z4","v":0},{"$f":"Poule!AA4","v":0},{"$f":"Poule!AB4","v":0},{"$f":"Poule!AC4","v":0}]
[{"$f":"Poule!O5","v":0},null,null,null,null,null,null,null,{"$f":"Poule!Z5","v":0},{"$f":"Poule!AA5","v":0},{"$f":"Poule!AB5","v":0},{"$f":"Poule!AC5","v":0}]
[{"$f":"Poule!O6","v":2},{"$f":"Poule!P6","v":"PB TEAM 1"},null,null,null,{"$f":"Poule!W6","v":3},{"$f":"Poule!X6","v":2},{"$f":"Poule!Y6","v":5.0010000000000003},{"$f":"Poule!Z6","v":1},{"$f":"Poule!AA6","v":2},{"$f":"Poule!AB6","v":0},{"$f":"Poule!AC6","v":1}]
[{"$f":"Poule!O7","v":3},{"$f":"Poule!P7","v":"PB TEAM 2"},null,null,null,{"$f":"Poule!W7","v":5},{"$f":"Poule!X7","v":3},{"$f":"Poule!Y7","v":3.0019999999999998},{"$f":"Poule!Z7","v":1},{"$f":"Poule!AA7","v":0},{"$f":"Poule!AB7","v":2},{"$f":"Poule!AC7","v":2}]
[{"$f":"Poule!O8","v":1},{"$f":"Poule!P8","v":"PB TEAM 3"},null,null,null,{"$f":"Poule!W8","v":4},{"$f":"Poule!X8","v":2},{"$f":"Poule!Y8","v":7.0019999999999998},{"$f":"Poule!Z8","v":2},{"$f":"Poule!AA8","v":1},{"$f":"Poule!AB8","v":0},{"$f":"Poule!AC8","v":2}]
[{"$f":"Poule!O9","v":4},{"$f":"Poule!P9","v":"PB TEAM 4"},null,null,null,{"$f":"Poule!W9","v":1},{"$f":"Poule!X9","v":6},{"$f":"Poule!Y9","v":0.99499999999999988},{"$f":"Poule!Z9","v":0},{"$f":"Poule!AA9","v":1},{"$f":"Poule!AB9","v":2},{"$f":"Poule!AC9","v":-5}]

{"sheet":"GROEP-3","index":4,"n_rows":19,"n_cols":13,"rows_kept":19,"cut":false,"hidden":false,"merged":[[12,8,14,8],[12,9,14,9],[0,12,2,13],[12,5,14,5],[12,6,14,6],[12,7,14,7],[0,0,2,11],[12,10,14,10],[12,11,14,11],[9,0,9,1],[7,0,7,1],[3,9,3,11],[4,0,4,1],[3,0,3,1],[3,5,3,7],[3,2,3,4],[17,1,17,4],[18,1,18,4],[15,1,15,4],[12,0,14,0],[5,0,5,1],[6,0,6,1],[16,1,16,4],[12,1,14,4],[8,0,8,1]]}
["MEGA TOERNOOI",null,null,null,null,null,null,null,null,null,null,null,"Scores By:\nOnlineExcelCursus.NL"]
[]
[]
[{"$f":"Poule!D19","v":"Tijd"},{"$f":"Poule!E19","v":0},{"$f":"Poule!G19","v":"HAL 1"},null,null,{"$f":"Poule!U19","v":"Uitslag"},{"$f":"Poule!V19","v":0},{"$f":"Poule!W19","v":0},null,{"$f":"Poule!Y19","v":"Punten"}]
[{"$f":"Poule!D20","v":"17:43:00"},{"$f":"Poule!E20","v":"00:00:00"},{"$f":"Poule!G20","v":"PC TEAM 1"},{"$f":"Poule!M20","v":"--"},{"$f":"Poule!N20","v":"PC TEAM 2"},{"$f":"Poule!U20","v":1},{"$f":"Poule!V20","v":"--"},{"$f":"Poule!W20","v":2},null,{"$f":"Poule!Y20","v":0},null,{"$f":"Poule!AA20","v":3}]
[{"$f":"Poule!D21","v":"18:09:00"},{"$f":"Poule!E21","v":"00:00:00"},{"$f":"Poule!G21","v":"PC TEAM 3"},{"$f":"Poule!M21","v":"--"},{"$f":"Poule!N21","v":"PC TEAM 4"},{"$f":"Poule!U21","v":3},{"$f":"Poule!V21","v":"--"},{"$f":"Poule!W21","v":2},null,{"$f":"Poule!Y21","v":3},null,{"$f":"Poule!AA21","v":0}]
[{"$f":"Poule!D22","v":"18:35:00"},{"$f":"Poule!E22","v":"00:00:00"},{"$f":"Poule!G22","v":"PC TEAM 4"},{"$f":"Poule!M22","v":"--"},{"$f":"Poule!N22","v":"PC TEAM 1"},{"$f":"Poule!U22","v":3},{"$f":"Poule!V22","v":"--"},{"$f":"Poule!W22","v":1},null,{"$f":"Poule!Y22","v":3},null,{"$f":"Poule!AA22","v":0}]
[{"$f":"Poule!D23","v":"19:01:00"},{"$f":"Poule!E23","v":"00:00:00"},{"$f":"Poule!G23","v":"PC TEAM 2"},{"$f":"Poule!M23","v":"--"},{"$f":"Poule!N23","v":"PC TEAM 3"},{"$f":"Poule!U23","v":2},{"$f":"Poule!V23","v":"--"},{"$f":"Poule!W23","v":1},null,{"$f":"Poule!Y23","v":3},null,{"$f":"Poule!AA23","v":0}]
[{"$f":"Poule!D24","v":"19:27:00"},{"$f":"Poule!E24","v":"00:00:00"},{"$f":"Poule!G24","v":"PC TEAM 1"},{"$f":"Poule!M24","v":"--"},{"$f":"Poule!N24","v":"PC TEAM 3"},{"$f":"Poule!U24","v":1},{"$f":"Poule!V24","v":"--"},{"$f":"Poule!W24","v":0},null,{"$f":"Poule!Y24","v":3},null,{"$f":"Poule!AA24","v":0}]
[{"$f":"Poule!D25","v":"19:53:00"},{"$f":"Poule!E25","v":"00:00:00"},{"$f":"Poule!G25","v":"PC TEAM 4"},{"$f":"Poule!M25","v":"--"},{"$f":"Poule!N25","v":"PC TEAM 2"},{"$f":"Poule!U25","v":2},{"$f":"Poule!V25","v":"--"},{"$f":"Poule!W25","v":1},null,{"$f":"Poule!Y25","v":3},null,{"$f":"Poule!AA25","v":0}]
[]
[]
[{"$f":"Poule!AD3","v":"Stand"},{"$f":"Poule!AE5","v":"Groep 3"},null,null,null,{"$f":"Poule!AK5","v":"V"},{"$f":"Poule!AL5","v":"T"},{"$f":"Poule!AM5","v":"P"},{"$f":"Poule!AN3","v":"Gewonnen"},{"$f":"Poule!AO3","v":"Gelijk"},{"$f":"Poule!AP3","v":"Verloren"},{"$f":"Poule!AQ3","v":"Saldo"}]
[{"$f":"Poule!AD4","v":0},null,null,null,null,null,null,null,{"$f":"Poule!AN4","v":0},{"$f":"Poule!AO4","v":0},{"$f":"Poule!AP4","v":0},{"$f":"Poule!AQ4","v":0}]
[{"$f":"Poule!AD5","v":0},null,null,null,null,null,null,null,{"$f":"Poule!AN5","v":0},{"$f":"Poule!AO5","v":0},{"$f":"Poule!AP5","v":0},{"$f":"Poule!AQ5","v":0}]
[{"$f":"Poule!AD6","v":4},{"$f":"Poule!AE6","v":"PC TEAM 1"},null,null,null,{"$f":"Poule!AK6","v":3},{"$f":"Poule!AL6","v":5},{"$f":"Poule!AM6","v":2.9980000000000002},{"$f":"Poule!AN6","v":1},{"$f":"Poule!AO6","v":0},{"$f":"Poule!AP6","v":2},{"$f":"Poule!AQ6","v":-2}]
[{"$f":"Poule!AD7","v":2},{"$f":"Poule!AE7","v":"PC TEAM 2"},null,null,null,{"$f":"Poule!AK7","v":5},{"$f":"Poule!AL7","v":4},{"$f":"Poule!AM7","v":6.0010000000000003},{"$f":"Poule!AN7","v":2},{"$f":"Poule!AO7","v":0},{"$f":"Poule!AP7","v":1},{"$f":"Poule!AQ7","v":1}]
[{"$f":"Poule!AD8","v":3},{"$f":"Poule!AE8","v":"PC TEAM 3"},null,null,null,{"$f":"Poule!AK8","v":4},{"$f":"Poule!AL8","v":5},{"$f":"Poule!AM8","v":2.9990000000000001},{"$f":"Poule!AN8","v":1},{"$f":"Poule!AO8","v":0},{"$f":"Poule!AP8","v":2},{"$f":"Poule!AQ8","v":-1}]
[{"$f":"Poule!AD9","v":1},{"$f":"Poule!AE9","v":"PC TEAM 4"},null,null,null,{"$f":"Poule!AK9","v":7},{"$f":"Poule!AL9","v":5},{"$f":"Poule!AM9","v":6.0019999999999998},{"$f":"Poule!AN9","v":2},{"$f":"Poule!AO9","v":0},{"$f":"Poule!AP9","v":1},{"$f":"Poule!AQ9","v":2}]

{"sheet":"GROEP-4","index":5,"n_rows":19,"n_cols":13,"rows_kept":19,"cut":false,"hidden":false,"merged":[[0,12,2,13],[12,6,14,6],[12,7,14,7],[15,1,15,4],[16,1,16,4],[0,0,2,11],[12,8,14,8],[12,9,14,9],[12,10,14,10],[12,11,14,11],[12,5,14,5],[3,5,3,7],[3,9,3,11],[3,0,3,1],[17,1,17,4],[18,1,18,4],[12,1,14,4],[3,2,3,4],[12,0,14,0],[9,0,9,1],[4,0,4,1],[7,0,7,1],[8,0,8,1],[5,0,5,1],[6,0,6,1]]}
["MEGA TOERNOOI",null,null,null,null,null,null,null,null,null,null,null,"Scores By:\nOnlineExcelCursus.NL"]
[]
[]
[{"$f":"Poule!AC19","v":"Tijd"},{"$f":"Poule!AD19","v":0},{"$f":"Poule!AF19","v":"HAL 2"},null,null,{"$f":"Poule!AT19","v":"Uitslag"},{"$f":"Poule!AU19","v":0},{"$f":"Poule!AV19","v":0},null,{"$f":"Poule!AX19","v":"Punten"},{"$f":"Poule!AY19","v":0},{"$f":"Poule!AZ19","v":0}]
[{"$f":"Poule!AC20","v":"17:43:00"},{"$f":"Poule!AD20","v":"00:00:00"},{"$f":"Poule!AF20","v":"PD TEAM 1"},{"$f":"Poule!AL20","v":"--"},{"$f":"Poule!AM20","v":"PD TEAM 2"},{"$f":"Poule!AT20","v":3},{"$f":"Poule!AU20","v":"--"},{"$f":"Poule!AV20","v":2},null,{"$f":"Poule!Y20","v":0},null,{"$f":"Poule!AA20","v":3}]
[{"$f":"Poule!AC21","v":"18:09:00"},{"$f":"Poule!AD21","v":"00:00:00"},{"$f":"Poule!AF21","v":"PD TEAM 3"},{"$f":"Poule!AL21","v":"--"},{"$f":"Poule!AM21","v":"PD TEAM 4"},{"$f":"Poule!AT21","v":1},{"$f":"Poule!AU21","v":"--"},{"$f":"Poule!AV21","v":2},null,{"$f":"Poule!Y21","v":3},null,{"$f":"Poule!AA21","v":0}]
[{"$f":"Poule!AC22","v":"18:35:00"},{"$f":"Poule!AD22","v":"00:00:00"},{"$f":"Poule!AF22","v":"PD TEAM 4"},{"$f":"Poule!AL22","v":"--"},{"$f":"Poule!AM22","v":"PD TEAM 1"},{"$f":"Poule!AT22","v":1},{"$f":"Poule!AU22","v":"--"},{"$f":"Poule!AV22","v":1},null,{"$f":"Poule!Y22","v":3},null,{"$f":"Poule!AA22","v":0}]
[{"$f":"Poule!AC23","v":"19:01:00"},{"$f":"Poule!AD23","v":"00:00:00"},{"$f":"Poule!AF23","v":"PD TEAM 2"},{"$f":"Poule!AL23","v":"--"},{"$f":"Poule!AM23","v":"PD TEAM 3"},{"$f":"Poule!AT23","v":0},{"$f":"Poule!AU23","v":"--"},{"$f":"Poule!AV23","v":0},null,{"$f":"Poule!Y23","v":3},null,{"$f":"Poule!AA23","v":0}]
[{"$f":"Poule!AC24","v":"19:27:00"},{"$f":"Poule!AD24","v":"00:00:00"},{"$f":"Poule!AF24","v":"PD TEAM 2"},{"$f":"Poule!AL24","v":"--"},{"$f":"Poule!AM24","v":"PD TEAM 4"},{"$f":"Poule!AT24","v":1},{"$f":"Poule!AU24","v":"--"},{"$f":"Poule!AV24","v":1},null,{"$f":"Poule!Y24","v":3},null,{"$f":"Poule!AA24","v":0}]
[{"$f":"Poule!AC25","v":"19:53:00"},{"$f":"Poule!AD25","v":"00:00:00"},{"$f":"Poule!AF25","v":"PD TEAM 1"},{"$f":"Poule!AL25","v":"--"},{"$f":"Poule!AM25","v":"PD TEAM 3"},{"$f":"Poule!AT25","v":0},{"$f":"Poule!AU25","v":"--"},{"$f":"Poule!AV25","v":2},null,{"$f":"Poule!Y25","v":3},null,{"$f":"Poule!AA25","v":0}]
[]
[]
[{"$f":"Poule!AR3","v":"Stand"},{"$f":"Poule!AS5","v":"Groep 4"},null,null,null,{"$f":"Poule!AY5","v":"V"},{"$f":"Poule!AZ5","v":"T"},{"$f":"Poule!BA5","v":"P"},{"$f":"Poule!BB3","v":"Gewonnen"},{"$f":"Poule!BC3","v":"Gelijk"},{"$f":"Poule!BD3","v":"Verloren"},{"$f":"Poule!BE3","v":"Saldo"}]
[{"$f":"Poule!AR4","v":0},null,null,null,null,null,null,null,{"$f":"Poule!BB4","v":0},{"$f":"Poule!BC4","v":0},{"$f":"Poule!BD4","v":0},{"$f":"Poule!BE4","v":0}]
[{"$f":"Poule!AR5","v":0},null,null,null,null,null,null,null,{"$f":"Poule!BB5","v":0},{"$f":"Poule!BC5","v":0},{"$f":"Poule!BD5","v":0},{"$f":"Poule!BE5","v":0}]
[{"$f":"Poule!AR6","v":3},{"$f":"Poule!AS6","v":"PD TEAM 1"},null,null,null,{"$f":"Poule!AY6","v":4},{"$f":"Poule!AZ6","v":5},{"$f":"Poule!BA6","v":3.9989999999999997},{"$f":"Poule!BB6","v":1},{"$f":"Poule!BC6","v":1},{"$f":"Poule!BD6","v":1},{"$f":"Poule!BE6","v":-1}]
[{"$f":"Poule!AR7","v":4},{"$f":"Poule!AS7","v":"PD TEAM 2"},null,null,null,{"$f":"Poule!AY7","v":3},{"$f":"Poule!AZ7","v":4},{"$f":"Poule!BA7","v":1.9990000000000001},{"$f":"Poule!BB7","v":0},{"$f":"Poule!BC7","v":2},{"$f":"Poule!BD7","v":1},{"$f":"Poule!BE7","v":-1}]
[{"$f":"Poule!AR8","v":2},{"$f":"Poule!AS8","v":"PD TEAM 3"},null,null,null,{"$f":"Poule!AY8","v":3},{"$f":"Poule!AZ8","v":2},{"$f":"Poule!BA8","v":4.0010000000000003},{"$f":"Poule!BB8","v":1},{"$f":"Poule!BC8","v":1},{"$f":"Poule!BD8","v":1},{"$f":"Poule!BE8","v":1}]
[{"$f":"Poule!AR9","v":1},{"$f":"Poule!AS9","v":"PD TEAM 4"},null,null,null,{"$f":"Poule!AY9","v":4},{"$f":"Poule!AZ9","v":3},{"$f":"Poule!BA9","v":5.0009999999999994},{"$f":"Poule!BB9","v":1},{"$f":"Poule!BC9","v":2},{"$f":"Poule!BD9","v":0},{"$f":"Poule!BE9","v":1}]