{"text_format":"1","workbook":"xlsx","n_sheets":7,"sheets":["E jeugd voorronde","E jeugd finaleronde","E-GROEP-1","E-GROEP-2","E-GROEP-3","E-GROEP-4","Blad1"],"not_rendered":{"charts":0,"images":0,"macros":1,"external_links":0,"defined_names":0,"comments":0,"pivot_tables":0},"unopened":[],"bounds":{"document_bytes":16777216,"sheet_cells":100000,"rows_first":2000,"rows_last":500,"rows_between":2000,"halvings":0,"cell_chars":16384,"cell_head_chars":4096},"cells_cut":0,"cells_raw":0,"read":"whole","date_system":"1900"}

{"sheet":"E jeugd voorronde","index":0,"n_rows":29,"n_cols":69,"rows_kept":29,"cut":false,"hidden":false,"merged":[[2,56,4,56],[2,42,4,42],[2,53,4,53],[2,54,4,54],[2,55,4,55],[2,28,4,28],[2,39,4,39],[2,40,4,40],[2,41,4,41],[4,44,4,49],[13,38,13,43],[12,38,12,43],[11,38,11,43],[18,31,18,43],[18,6,18,18],[18,28,18,29],[18,20,18,22],[8,44,8,49],[10,45,10,47],[10,49,10,51],[8,30,8,35],[11,28,11,29],[16,31,16,36],[16,38,16,43],[15,38,15,43],[18,49,18,51],[10,24,10,26],[14,38,14,43],[10,28,10,29],[8,1,8,6],[10,3,10,4],[10,6,10,18],[11,3,11,4],[12,3,12,4],[13,3,13,4],[13,13,13,18],[22,3,22,4],[23,3,23,4],[24,3,24,4],[20,6,20,11],[19,6,19,11],[22,13,22,18],[21,13,21,18],[24,6,24,11],[23,6,23,11],[22,6,22,11],[21,6,21,11],[24,13,24,18],[23,13,23,18],[20,13,20,18],[19,13,19,18],[15,31,15,36],[14,31,14,36],[13,31,13,36],[16,6,16,11],[15,6,15,11],[14,6,14,11],[13,6,13,11],[15,13,15,18],[13,28,13,29],[14,28,14,29],[15,28,15,29],[16,28,16,29],[18,24,18,26],[21,3,21,4],[19,3,19,4],[20,3,20,4],[15,3,15,4],[16,13,16,18],[14,13,14,18],[14,3,14,4],[19,28,19,29],[20,28,20,29],[18,3,18,4],[16,3,16,4],[12,6,12,11],[11,6,11,11],[12,13,12,18],[11,13,11,18],[0,0,1,49],[5,1,5,6],[6,1,6,6],[7,1,7,6],[4,1,4,6],[2,0,4,0],[2,12,4,12],[2,11,4,11],[2,10,4,10],[2,27,4,27],[5,44,5,49],[7,44,7,49],[2,14,4,14],[2,29,4,29],[2,43,4,43],[4,15,4,21],[4,30,4,35],[6,30,6,35],[2,13,4,13],[2,25,4,25],[2,26,4,26],[6,44,6,49],[5,15,5,21],[5,30,5,35],[6,15,6,21],[12,31,12,36],[11,31,11,36],[10,20,10,22],[7,15,7,21],[7,30,7,35],[8,15,8,21],[10,31,10,43],[12,28,12,29],[18,45,18,47],[21,31,21,36],[20,31,20,36],[21,28,21,29],[22,28,22,29],[19,31,19,36],[24,38,24,43],[23,38,23,43],[22,38,22,43],[21,38,21,43],[20,38,20,43],[19,38,19,43],[24,31,24,36],[23,31,23,36],[22,31,22,36],[24,28,24,29],[23,28,23,29]]}
["Schoonhoven E TOERNOOI 2014",null,null,null,null,null,null,null,null,null,null,null,null,null,null,null,null,null,null,null,null,null,null,null,null,null,null,null,null,null,null,null,null,null,null,null,null,null,null,null,null,null,null,null,null,null,null,null,null,null,{"$f":"COUNTA(U12:W17)","v":18},{"$f":"COUNTA(AT12:AV17)","v":18},{"$f":"COUNTA(U20:W25)","v":18},{"$f":"COUNTA(AT20:AV25)","v":18},null,null,null,null,null,null,null,{"$f":"VALUE(A6)","v":4},{"$f":"B6","v":"Schoonhoven E1"},{"$f":"VALUE(O6)","v":2},{"$f":"P6","v":"Schoonhoven E3"},{"$f":"VALUE(AD6)","v":4},{"$f":"AE6","v":"Schoonhoven E5"},{"$f":"VALUE(AR6)","v":3},{"$f":"AS6","v":"Schoonhoven E7"}]
[null,null,null,null,null,null,null,null,null,null,null,null,null,null,null,null,null,null,null,null,null,null,null,null,null,null,null,null,null,null,null,null,null,null,null,null,null,null,null,null,null,null,null,null,null,null,null,null,null,null,null,null,null,null,null,null,null,null,null,null,null,{"$f":"VALUE(A7)","v":1},{"$f":"B7","v":"Cabauw E1"},{"$f":"VALUE(O7)","v":1},{"$f":"P7","v":"Cabauw E2"},{"$f":"VALUE(AD7)","v":3},{"$f":"AE7","v":"Lekkerkerk E2"},{"$f":"VALUE(AR7)","v":4},{"$f":"AS7","v":"Stolwijk E2"}]
["Stand",null,null,null,null,null,null,null,null,null,"Gewonnen","Gelijk","Verloren","Saldo","Stand",null,null,null,null,null,null,null,null,null,null,"Gewonnen","Gelijk","Verloren","Saldo","Stand",null,null,null,null,null,null,null,null,null,"Gewonnen","Gelijk","Verloren","Saldo","Stand",null,null,null,null,null,null,null,null,null,"Gewonnen","Gelijk","Verloren","Saldo",null,null,null,null,{"$f":"VALUE(A8)","v":2},{"$f":"B8","v":"Jodan Boys E2"},{"$f":"VALUE(O8)","v":4},{"$f":"P8","v":"RKDEO E3"},{"$f":"VALUE(AD8)","v":1},{"$f":"AE8","v":"RKDEO E9"},{"$f":"VALUE(AR8)","v":1},{"$f":"AS8","v":"VFC Vlaardingen E8"}]
[null,null,null,null,null,null,null,null,null,null,null,null,null,null,null,null,null,null,null,null,null,null,null,null,null,null,null,null,null,null,null,null,null,null,null,null,null,null,null,null,null,null,null,null,null,null,null,null,null,null,null,null,null,null,null,null,null,null,null,null,null,{"$f":"VALUE(A9)","v":3},{"$f":"B9","v":"Alblasserdam E1"},{"$f":"VALUE(O9)","v":3},{"$f":"P9","v":"VV GZ E3"},{"$f":"VALUE(AD9)","v":2},{"$f":"AE9","v":"scVictorie'04 E3"},{"$f":"VALUE(AR9)","v":2},{"$f":"AS9","v":"Jodan Boys E8"}]
[null,"Groep 1",null,null,null,null,null,"V","T","P",null,null,null,null,null,"Groep 2",null,null,null,null,null,null,"V","T","P",null,null,null,null,null,"Groep 3",null,null,null,null,null,"V","T","P",null,null,null,null,null,"Groep 4",null,null,null,null,null,"V","T","P"]
[{"$f":"RANK(J6,$J$6:$J$9,0)","v":4},"Schoonhoven E1",null,null,null,null,null,{"$f":"SUMIF($G$12:$L$17,B6,$U$12:$U$17)+SUMIF($N$12:$S$17,B6,$W$12:$W$17)","v":4},{"$f":"SUMIF($G$12:$L$17,B6,$W$12:$W$17)+SUMIF($N$12:$S$17,B6,$U$12:$U$17)","v":5},{"$f":"(K6*3)+L6+(H6*0.001)-(I6*0.001)","v":2.9990000000000001},{"$f":"SUMPRODUCT(($G$12:$L$17=B6)*($Y$12:$Y$17=3))+SUMPRODUCT(($N$12:$S$17=B6)*($AA$12:$AA$17=3))","v":1},{"$f":"SUMPRODUCT(($G$12:$L$17=B6)*($Y$12:$Y$17=1))+SUMPRODUCT(($N$12:$S$17=B6)*($AA$12:$AA$17=1))","v":0},{"$f":"SUMPRODUCT(($G$12:$L$17=B6)*($Y$12:$Y$17=0))+SUMPRODUCT(($N$12:$S$17=B6)*($AA$12:$AA$17=0))","v":2},{"$f":"H6-I6","v":-1},{"$f":"RANK(Y6,$Y$6:$Y$9,0)","v":2},"Schoonhoven E3",null,null,null,null,null,null,{"$f":"SUMIF($AF$12:$AK$17,P6,$AT$12:$AT$17)+SUMIF($AM$12:$AR$17,P6,$AV$12:$AV$17)","v":4},{"$f":"SUMIF($AF$12:$AK$17,P6,$AV$12:$AV$17)+SUMIF($AM$12:$AR$17,P6,$AT$12:$AT$17)","v":5},{"$f":"(Z6*3)+AA6+(W6*0.001)-(X6*0.001)","v":3.9989999999999997},{"$f":"SUMPRODUCT(($AF$12:$AK$17=P6)*($AX$12:$AX$17=3))+SUMPRODUCT(($AM$12:$AR$17=P6)*($AZ$12:$AZ$17=3))","v":1},{"$f":"SUMPRODUCT(($AF$12:$AK$17=P6)*($AX$12:$AX$17=1))+SUMPRODUCT(($AM$12:$AR$17=P6)*($AZ$12:$AZ$17=1))","v":1},{"$f":"SUMPRODUCT(($AF$12:$AK$17=P6)*($AX$12:$AX$17=0))+SUMPRODUCT(($AM$12:$AR$17=P6)*($AZ$12:$AZ$17=0))","v":1},{"$f":"W6-X6","v":-1},{"$f":"RANK(AM6,$AM$6:$AM$9,0)","v":4},"Schoonhoven E5",null,null,null,null,null,{"$f":"SUMIF($G$20:$L$25,AE6,$U$20:$U$25)+SUMIF($N$20:$S$25,AE6,$W$20:$W$25)","v":1},{"$f":"SUMIF($G$20:$L$25,AE6,$W$20:$W$25)+SUMIF($N$20:$S$25,AE6,$U$20:$U$25)","v":7},{"$f":"(AN6*3)+AO6+(AK6*0.001)-(AL6*0.001)","v":0.99399999999999988},{"$f":"SUMPRODUCT(($G$20:$L$25=AE6)*($Y$20:$Y$25=3))+SUMPRODUCT(($N$20:$S$25=AE6)*($AA$20:$AA$25=3))","v":0},{"$f":"SUMPRODUCT(($G$20:$L$25=AE6)*($Y$20:$Y$25=1))+SUMPRODUCT(($N$20:$S$25=AE6)*($AA$20:$AA$25=1))","v":1},{"$f":"SUMPRODUCT(($G$20:$L$25=AE6)*($Y$20:$Y$25=0))+SUMPRODUCT(($N$20:$S$25=AE6)*($AA$20:$AA$25=0))","v":2},{"$f":"AK6-AL6","v":-6},{"$f":"RANK(BA6,$BA$6:$BA$9,0)","v":3},"Schoonhoven E7",null,null,null,null,null,{"$f":"SUMIF($AF$20:$AK$25,AS6,$AT$20:$AT$25)+SUMIF($AM$20:$AR$25,AS6,$AV$20:$AV$25)","v":3},{"$f":"SUMIF($AF$20:$AK$25,AS6,$AV$20:$AV$25)+SUMIF($AM$20:$AR$25,AS6,$AT$20:$AT$25)","v":4},{"$f":"(BB6*3)+BC6+(AY6*0.001)-(AZ6*0.001)","v":1.9990000000000001},{"$f":"SUMPRODUCT(($AF$20:$AK$25=AS6)*($AX$20:$AX$25=3))+SUMPRODUCT(($AM$20:$AR$25=AS6)*($AZ$20:$AZ$25=3))","v":0},{"$f":"SUMPRODUCT(($AF$20:$AK$25=AS6)*($AX$20:$AX$25=1))+SUMPRODUCT(($AM$20:$AR$25=AS6)*($AZ$20:$AZ$25=1))","v":2},{"$f":"SUMPRODUCT(($AF$20:$AK$25=AS6)*($AX$20:$AX$25=0))+SUMPRODUCT(($AM$20:$AR$25=AS6)*($AZ$20:$AZ$25=0))","v":1},{"$f":"AY6-AZ6","v":-1}]
[{"$f":"RANK(J7,$J$6:$J$9,0)","v":1},"Cabauw E1",null,null,null,null,null,{"$f":"SUMIF($G$12:$L$17,B7,$U$12:$U$17)+SUMIF($N$12:$S$17,B7,$W$12:$W$17)","v":9},{"$f":"SUMIF($G$12:$L$17,B7,$W$12:$W$17)+SUMIF($N$12:$S$17,B7,$U$12:$U$17)","v":8},{"$f":"(K7*3)+L7+(H7*0.001)-(I7*0.001)","v":6.0010000000000003},{"$f":"SUMPRODUCT(($G$12:$L$17=B7)*($Y$12:$Y$17=3))+SUMPRODUCT(($N$12:$S$17=B7)*($AA$12:$AA$17=3))","v":2},{"$f":"SUMPRODUCT(($G$12:$L$17=B7)*($Y$12:$Y$17=1))+SUMPRODUCT(($N$12:$S$17=B7)*($AA$12:$AA$17=1))","v":0},{"$f":"SUMPRODUCT(($G$12:$L$17=B7)*($Y$12:$Y$17=0))+SUMPRODUCT(($N$12:$S$17=B7)*($AA$12:$AA$17=0))","v":1},{"$f":"H7-I7","v":1},{"$f":"RANK(Y7,$Y$6:$Y$9,0)","v":1},"Cabauw E2",null,null,null,null,null,null,{"$f":"SUMIF($AF$12:$AK$17,P7,$AT$12:$AT$17)+SUMIF($AM$12:$AR$17,P7,$AV$12:$AV$17)","v":6},{"$f":"SUMIF($AF$12:$AK$17,P7,$AV$12:$AV$17)+SUMIF($AM$12:$AR$17,P7,$AT$12:$AT$17)","v":3},{"$f":"(Z7*3)+AA7+(W7*0.001)-(X7*0.001)","v":7.0030000000000001},{"$f":"SUMPRODUCT(($AF$12:$AK$17=P7)*($AX$12:$AX$17=3))+SUMPRODUCT(($AM$12:$AR$17=P7)*($AZ$12:$AZ$17=3))","v":2},{"$f":"SUMPRODUCT(($AF$12:$AK$17=P7)*($AX$12:$AX$17=1))+SUMPRODUCT(($AM$12:$AR$17=P7)*($AZ$12:$AZ$17=1))","v":1},{"$f":"SUMPRODUCT(($AF$12:$AK$17=P7)*($AX$12:$AX$17=0))+SUMPRODUCT(($AM$12:$AR$17=P7)*($AZ$12:$AZ$17=0))","v":0},{"$f":"W7-X7","v":3},{"$f":"RANK(AM7,$AM$6:$AM$9,0)","v":3},"Lekkerkerk E2",null,null,null,null,null,{"$f":"SUMIF($G$20:$L$25,AE7,$U$20:$U$25)+SUMIF($N$20:$S$25,AE7,$W$20:$W$25)","v":4},{"$f":"SUMIF($G$20:$L$25,AE7,$W$20:$W$25)+SUMIF($N$20:$S$25,AE7,$U$20:$U$25)","v":4},{"$f":"(AN7*3)+AO7+(AK7*0.001)-(AL7*0.001)","v":3},{"$f":"SUMPRODUCT(($G$20:$L$25=AE7)*($Y$20:$Y$25=3))+SUMPRODUCT(($N$20:$S$25=AE7)*($AA$20:$AA$25=3))","v":1},{"$f":"SUMPRODUCT(($G$20:$L$25=AE7)*($Y$20:$Y$25=1))+SUMPRODUCT(($N$20:$S$25=AE7)*($AA$20:$AA$25=1))","v":0},{"$f":"SUMPRODUCT(($G$20:$L$25=AE7)*($Y$20:$Y$25=0))+SUMPRODUCT(($N$20:$S$25=AE7)*($AA$20:$AA$25=0))","v":2},{"$f":"AK7-AL7","v":0},{"$f":"RANK(BA7,$BA$6:$BA$9,0)","v":4},"Stolwijk E2",null,null,null,null,null,{"$f":"SUMIF($AF$20:$AK$25,AS7,$AT$20:$AT$25)+SUMIF($AM$20:$AR$25,AS7,$AV$20:$AV$25)","v":2},{"$f":"SUMIF($AF$20:$AK$25,AS7,$AV$20:$AV$25)+SUMIF($AM$20:$AR$25,AS7,$AT$20:$AT$25)","v":5},{"$f":"(BB7*3)+BC7+(AY7*0.001)-(AZ7*0.001)","v":0.997},{"$f":"SUMPRODUCT(($AF$20:$AK$25=AS7)*($AX$20:$AX$25=3))+SUMPRODUCT(($AM$20:$AR$25=AS7)*($AZ$20:$AZ$25=3))","v":0},{"$f":"SUMPRODUCT(($AF$20:$AK$25=AS7)*($AX$20:$AX$25=1))+SUMPRODUCT(($AM$20:$AR$25=AS7)*($AZ$20:$AZ$25=1))","v":1},{"$f":"SUMPRODUCT(($AF$20:$AK$25=AS7)*($AX$20:$AX$25=0))+SUMPRODUCT(($AM$20:$AR$25=AS7)*($AZ$20:$AZ$25=0))","v":2},{"$f":"AY7-AZ7","v":-3}]
[{"$f":"RANK(J8,$J$6:$J$9,0)","v":2},"Jodan Boys E2",null,null,null,null,null,{"$f":"SUMIF($G$12:$L$17,B8,$U$12:$U$17)+SUMIF($N$12:$S$17,B8,$W$12:$W$17)","v":5},{"$f":"SUMIF($G$12:$L$17,B8,$W$12:$W$17)+SUMIF($N$12:$S$17,B8,$U$12:$U$17)","v":5},{"$f":"(K8*3)+L8+(H8*0.001)-(I8*0.001)","v":6},{"$f":"SUMPRODUCT(($G$12:$L$17=B8)*($Y$12:$Y$17=3))+SUMPRODUCT(($N$12:$S$17=B8)*($AA$12:$AA$17=3))","v":2},{"$f":"SUMPRODUCT(($G$12:$L$17=B8)*($Y$12:$Y$17=1))+SUMPRODUCT(($N$12:$S$17=B8)*($AA$12:$AA$17=1))","v":0},{"$f":"SUMPRODUCT(($G$12:$L$17=B8)*($Y$12:$Y$17=0))+SUMPRODUCT(($N$12:$S$17=B8)*($AA$12:$AA$17=0))","v":1},{"$f":"H8-I8","v":0},{"$f":"RANK(Y8,$Y$6:$Y$9,0)","v":4},"RKDEO E3",null,null,null,null,null,null,{"$f":"SUMIF($AF$12:$AK$17,P8,$AT$12:$AT$17)+SUMIF($AM$12:$AR$17,P8,$AV$12:$AV$17)","v":3},{"$f":"SUMIF($AF$12:$AK$17,P8,$AV$12:$AV$17)+SUMIF($AM$12:$AR$17,P8,$AT$12:$AT$17)","v":5},{"$f":"(Z8*3)+AA8+(W8*0.001)-(X8*0.001)","v":0.99799999999999989},{"$f":"SUMPRODUCT(($AF$12:$AK$17=P8)*($AX$12:$AX$17=3))+SUMPRODUCT(($AM$12:$AR$17=P8)*($AZ$12:$AZ$17=3))","v":0},{"$f":"SUMPRODUCT(($AF$12:$AK$17=P8)*($AX$12:$AX$17=1))+SUMPRODUCT(($AM$12:$AR$17=P8)*($AZ$12:$AZ$17=1))","v":1},{"$f":"SUMPRODUCT(($AF$12:$AK$17=P8)*($AX$12:$AX$17=0))+SUMPRODUCT(($AM$12:$AR$17=P8)*($AZ$12:$AZ$17=0))","v":2},{"$f":"W8-X8","v":-2},{"$f":"RANK(AM8,$AM$6:$AM$9,0)","v":1},"RKDEO E9",null,null,null,null,null,{"$f":"SUMIF($G$20:$L$25,AE8,$U$20:$U$25)+SUMIF($N$20:$S$25,AE8,$W$20:$W$25)","v":11},{"$f":"SUMIF($G$20:$L$25,AE8,$W$20:$W$25)+SUMIF($N$20:$S$25,AE8,$U$20:$U$25)","v":3},{"$f":"(AN8*3)+AO8+(AK8*0.001)-(AL8*0.001)","v":9.0079999999999991},{"$f":"SUMPRODUCT(($G$20:$L$25=AE8)*($Y$20:$Y$25=3))+SUMPRODUCT(($N$20:$S$25=AE8)*($AA$20:$AA$25=3))","v":3},{"$f":"SUMPRODUCT(($G$20:$L$25=AE8)*($Y$20:$Y$25=1))+SUMPRODUCT(($N$20:$S$25=AE8)*($AA$20:$AA$25=1))","v":0},{"$f":"SUMPRODUCT(($G$20:$L$25=AE8)*($Y$20:$Y$25=0))+SUMPRODUCT(($N$20:$S$25=AE8)*($AA$20:$AA$25=0))","v":0},{"$f":"AK8-AL8","v":8},{"$f":"RANK(BA8,$BA$6:$BA$9,0)","v":1},"VFC Vlaardingen E8",null,null,null,null,null,{"$f":"SUMIF($AF$20:$AK$25,AS8,$AT$20:$AT$25)+SUMIF($AM$20:$AR$25,AS8,$AV$20:$AV$25)","v":7},{"$f":"SUMIF($AF$20:$AK$25,AS8,$AV$20:$AV$25)+SUMIF($AM$20:$AR$25,AS8,$AT$20:$AT$25)","v":3},{"$f":"(BB8*3)+BC8+(AY8*0.001)-(AZ8*0.001)","v":9.0039999999999996},{"$f":"SUMPRODUCT(($AF$20:$AK$25=AS8)*($AX$20:$AX$25=3))+SUMPRODUCT(($AM$20:$AR$25=AS8)*($AZ$20:$AZ$25=3))","v":3},{"$f":"SUMPRODUCT(($AF$20:$AK$25=AS8)*($AX$20:$AX$25=1))+SUMPRODUCT(($AM$20:$AR$25=AS8)*($AZ$20:$AZ$25=1))","v":0},{"$f":"SUMPRODUCT(($AF$20:$AK$25=AS8)*($AX$20:$AX$25=0))+SUMPRODUCT(($AM$20:$AR$25=AS8)*($AZ$20:$AZ$25=0))","v":0},{"$f":"AY8-AZ8","v":4}]
[{"$f":"RANK(J9,$J$6:$J$9,0)","v":3},"Alblasserdam E1",null,null,null,null,null,{"$f":"SUMIF($G$12:$L$17,B9,$U$12:$U$17)+SUMIF($N$12:$S$17,B9,$W$12:$W$17)","v":8},{"$f":"SUMIF($G$12:$L$17,B9,$W$12:$W$17)+SUMIF($N$12:$S$17,B9,$U$12:$U$17)","v":8},{"$f":"(K9*3)+L9+(H9*0.001)-(I9*0.001)","v":3},{"$f":"SUMPRODUCT(($G$12:$L$17=B9)*($Y$12:$Y$17=3))+SUMPRODUCT(($N$12:$S$17=B9)*($AA$12:$AA$17=3))","v":1},{"$f":"SUMPRODUCT(($G$12:$L$17=B9)*($Y$12:$Y$17=1))+SUMPRODUCT(($N$12:$S$17=B9)*($AA$12:$AA$17=1))","v":0},{"$f":"SUMPRODUCT(($G$12:$L$17=B9)*($Y$12:$Y$17=0))+SUMPRODUCT(($N$12:$S$17=B9)*($AA$12:$AA$17=0))","v":2},{"$f":"H9-I9","v":0},{"$f":"RANK(Y9,$Y$6:$Y$9,0)","v":3},"VV GZ E3",null,null,null,null,null,null,{"$f":"SUMIF($AF$12:$AK$17,P9,$AT$12:$AT$17)+SUMIF($AM$12:$AR$17,P9,$AV$12:$AV$17)","v":3},{"$f":"SUMIF($AF$12:$AK$17,P9,$AV$12:$AV$17)+SUMIF($AM$12:$AR$17,P9,$AT$12:$AT$17)","v":3},{"$f":"(Z9*3)+AA9+(W9*0.001)-(X9*0.001)","v":3},{"$f":"SUMPRODUCT(($AF$12:$AK$17=P9)*($AX$12:$AX$17=3))+SUMPRODUCT(($AM$12:$AR$17=P9)*($AZ$12:$AZ$17=3))","v":0},{"$f":"SUMPRODUCT(($AF$12:$AK$17=P9)*($AX$12:$AX$17=1))+SUMPRODUCT(($AM$12:$AR$17=P9)*($AZ$12:$AZ$17=1))","v":3},{"$f":"SUMPRODUCT(($AF$12:$AK$17=P9)*($AX$12:$AX$17=0))+SUMPRODUCT(($AM$12:$AR$17=P9)*($AZ$12:$AZ$17=0))","v":0},{"$f":"W9-X9","v":0},{"$f":"RANK(AM9,$AM$6:$AM$9,0)","v":2},"scVictorie'04 E3",null,null,null,null,null,{"$f":"SUMIF($G$20:$L$25,AE9,$U$20:$U$25)+SUMIF($N$20:$S$25,AE9,$W$20:$W$25)","v":3},{"$f":"SUMIF($G$20:$L$25,AE9,$W$20:$W$25)+SUMIF($N$20:$S$25,AE9,$U$20:$U$25)","v":5},{"$f":"(AN9*3)+AO9+(AK9*0.001)-(AL9*0.001)","v":3.9980000000000002},{"$f":"SUMPRODUCT(($G$20:$L$25=AE9)*($Y$20:$Y$25=3))+SUMPRODUCT(($N$20:$S$25=AE9)*($AA$20:$AA$25=3))","v":1},{"$f":"SUMPRODUCT(($G$20:$L$25=AE9)*($Y$20:$Y$25=1))+SUMPRODUCT(($N$20:$S$25=AE9)*($AA$20:$AA$25=1))","v":1},{"$f":"SUMPRODUCT(($G$20:$L$25=AE9)*($Y$20:$Y$25=0))+SUMPRODUCT(($N$20:$S$25=AE9)*($AA$20:$AA$25=0))","v":1},{"$f":"AK9-AL9","v":-2},{"$f":"RANK(BA9,$BA$6:$BA$9,0)","v":2},"Jodan Boys E8",null,null,null,null,null,{"$f":"SUMIF($AF$20:$AK$25,AS9,$AT$20:$AT$25)+SUMIF($AM$20:$AR$25,AS9,$AV$20:$AV$25)","v":5},{"$f":"SUMIF($AF$20:$AK$25,AS9,$AV$20:$AV$25)+SUMIF($AM$20:$AR$25,AS9,$AT$20:$AT$25)","v":5},{"$f":"(BB9*3)+BC9+(AY9*0.001)-(AZ9*0.001)","v":4},{"$f":"SUMPRODUCT(($AF$20:$AK$25=AS9)*($AX$20:$AX$25=3))+SUMPRODUCT(($AM$20:$AR$25=AS9)*($AZ$20:$AZ$25=3))","v":1},{"$f":"SUMPRODUCT(($AF$20:$AK$25=AS9)*($AX$20:$AX$25=1))+SUMPRODUCT(($AM$20:$AR$25=AS9)*($AZ$20:$AZ$25=1))","v":1},{"$f":"SUMPRODUCT(($AF$20:$AK$25=AS9)*($AX$20:$AX$25=0))+SUMPRODUCT(($AM$20:$AR$25=AS9)*($AZ$20:$AZ$25=0))","v":1},{"$f":"AY9-AZ9","v":0}]
[]
[null,null,null,"Tijd",null,null,"VELD A",null,null,null,null,null,null,null,null,null,null,null,null,null,"Uitslag",null,null,null,"Punten",null,null,null,"Tijd",null,null,"VELD B",null,null,null,null,null,null,null,null,null,null,null,null,null,"Uitslag",null,null,null,"Punten"]
[null,null,null,"14:15:00",null,null,{"$f":"B6","v":"Schoonhoven E1"},null,null,null,null,null,"--",{"$f":"B7","v":"Cabauw E1"},null,null,null,null,null,null,1,"--",2,null,{"$f":"IF(U12=\"\",\"\",IF(U12>W12,3,IF(U12=W12,1,0)))","v":0},null,{"$f":"IF(W12=\"\",\"\",IF(W12>U12,3,IF(W12=U12,1,0)))","v":3},null,"14:15:00",null,null,{"$f":"P6","v":"Schoonhoven E3"},null,null,null,null,null,"--",{"$f":"P7","v":"Cabauw E2"},null,null,null,null,null,null,1,"--",3,null,{"$f":"IF(AT12=\"\",\"\",IF(AT12>AV12,3,IF(AT12=AV12,1,0)))","v":0},null,{"$f":"IF(AV12=\"\",\"\",IF(AV12>AT12,3,IF(AV12=AT12,1,0)))","v":3}]
[null,null,null,"14:28:00",null,null,{"$f":"B8","v":"Jodan Boys E2"},null,null,null,null,null,"--",{"$f":"B9","v":"Alblasserdam E1"},null,null,null,null,null,null,2,"--",1,null,{"$f":"IF(U13=\"\",\"\",IF(U13>W13,3,IF(U13=W13,1,0)))","v":3},null,{"$f":"IF(W13=\"\",\"\",IF(W13>U13,3,IF(W13=U13,1,0)))","v":0},null,"14:28:00",null,null,{"$f":"P8","v":"RKDEO E3"},null,null,null,null,null,"--",{"$f":"P9","v":"VV GZ E3"},null,null,null,null,null,null,1,"--",1,null,{"$f":"IF(AT13=\"\",\"\",IF(AT13>AV13,3,IF(AT13=AV13,1,0)))","v":1},null,{"$f":"IF(AV13=\"\",\"\",IF(AV13>AT13,3,IF(AV13=AT13,1,0)))","v":1}]
[null,null,null,"14:41:00",null,null,{"$f":"B9","v":"Alblasserdam E1"},null,null,null,null,null,"--",{"$f":"B6","v":"Schoonhoven E1"},null,null,null,null,null,null,1,"--",2,null,{"$f":"IF(U14=\"\",\"\",IF(U14>W14,3,IF(U14=W14,1,0)))","v":0},null,3,null,"14:41:00",null,null,{"$f":"P9","v":"VV GZ E3"},null,null,null,null,null,"--",{"$f":"P6","v":"Schoonhoven E3"},null,null,null,null,null,null,2,"--",2,null,{"$f":"IF(AT14=\"\",\"\",IF(AT14>AV14,3,IF(AT14=AV14,1,0)))","v":1},null,1]
[null,null,null,"14:54:00",null,null,{"$f":"B7","v":"Cabauw E1"},null,null,null,null,null,"--",{"$f":"B8","v":"Jodan Boys E2"},null,null,null,null,null,null,3,"--",1,null,3,null,0,null,"14:54:00",null,null,{"$f":"P7","v":"Cabauw E2"},null,null,null,null,null,"--",{"$f":"P8","v":"RKDEO E3"},null,null,null,null,null,null,3,"--",2,null,3,null,0]
[null,null,null,"15:07:00",null,null,{"$f":"B7","v":"Cabauw E1"},null,null,null,null,null,"--",{"$f":"B9","v":"Alblasserdam E1"},null,null,null,null,null,null,4,"--",6,null,0,null,3,null,"15:07:00",null,null,{"$f":"P6","v":"Schoonhoven E3"},null,null,null,null,null,"--",{"$f":"P8","v":"RKDEO E3"},null,null,null,null,null,null,1,"--",0,null,3,null,0]
[null,null,null,"15:20:00",null,null,{"$f":"B6","v":"Schoonhoven E1"},null,null,null,null,null,"--",{"$f":"B8","v":"Jodan Boys E2"},null,null,null,null,null,null,1,"--",2,null,0,null,3,null,"15:20:00",null,null,{"$f":"P7","v":"Cabauw E2"},null,null,null,null,null,"--",{"$f":"P9","v":"VV GZ E3"},null,null,null,null,null,null,0,"--",0,null,1,null,1]
[]
[null,null,null,"Tijd",null,null,"VELD C",null,null,null,null,null,null,null,null,null,null,null,null,null,"Uitslag",null,null,null,"Punten",null,null,null,"Tijd",null,null,"VELD D",null,null,null,null,null,null,null,null,null,null,null,null,null,"Uitslag",null,null,null,"Punten"]
[null,null,null,"14:15:00",null,null,{"$f":"AE6","v":"Schoonhoven E5"},null,null,null,null,null,"--",{"$f":"AE7","v":"Lekkerkerk E2"},null,null,null,null,null,null,0,"--",2,null,{"$f":"IF(U20=\"\",\"\",IF(U20>W20,3,IF(U20=W20,1,0)))","v":0},null,{"$f":"IF(W20=\"\",\"\",IF(W20>U20,3,IF(W20=U20,1,0)))","v":3},null,"14:15:00",null,null,{"$f":"AS6","v":"Schoonhoven E7"},null,null,null,null,null,"--",{"$f":"AS7","v":"Stolwijk E2"},null,null,null,null,null,null,1,"--",1,null,{"$f":"IF(AT20=\"\",\"\",IF(AT20>AV20,3,IF(AT20=AV20,1,0)))","v":1},null,{"$f":"IF(AV20=\"\",\"\",IF(AV20>AT20,3,IF(AV20=AT20,1,0)))","v":1}]
[null,null,null,"14:28:00",null,null,{"$f":"AE8","v":"RKDEO E9"},null,null,null,null,null,"--",{"$f":"AE9","v":"scVictorie'04 E3"},null,null,null,null,null,null,4,"--",1,null,{"$f":"IF(U21=\"\",\"\",IF(U21>W21,3,IF(U21=W21,1,0)))","v":3},null,{"$f":"IF(W21=\"\",\"\",IF(W21>U21,3,IF(W21=U21,1,0)))","v":0},null,"14:28:00",null,null,{"$f":"AS8","v":"VFC Vlaardingen E8"},null,null,null,null,null,"--",{"$f":"AS9","v":"Jodan Boys E8"},null,null,null,null,null,null,3,"--",2,null,{"$f":"IF(AT21=\"\",\"\",IF(AT21>AV21,3,IF(AT21=AV21,1,0)))","v":3},null,{"$f":"IF(AV21=\"\",\"\",IF(AV21>AT21,3,IF(AV21=AT21,1,0)))","v":0}]
[null,null,null,"14:41:00",null,null,{"$f":"AE9","v":"scVictorie'04 E3"},null,null,null,null,null,"--",{"$f":"AE6","v":"Schoonhoven E5"},null,null,null,null,null,null,1,"--",1,null,{"$f":"IF(U22=\"\",\"\",IF(U22>W22,3,IF(U22=W22,1,0)))","v":1},null,1,null,"14:41:00",null,null,{"$f":"AS9","v":"Jodan Boys E8"},null,null,null,null,null,"--",{"$f":"AS6","v":"Schoonhoven E7"},null,null,null,null,null,null,2,"--",2,null,{"$f":"IF(AT22=\"\",\"\",IF(AT22>AV22,3,IF(AT22=AV22,1,0)))","v":1},null,1]
[null,null,null,"14:54:00",null,null,{"$f":"AE7","v":"Lekkerkerk E2"},null,null,null,null,null,"--",{"$f":"AE8","v":"RKDEO E9"},null,null,null,null,null,null,2,"--",3,null,0,null,3,null,"14:54:00",null,null,{"$f":"AS7","v":"Stolwijk E2"},null,null,null,null,null,"--",{"$f":"AS8","v":"VFC Vlaardingen E8"},null,null,null,null,null,null,1,"--",3,null,0,null,3]
[null,null,null,"15:07:00",null,null,{"$f":"AE6","v":"Schoonhoven E5"},null,null,null,null,null,"--",{"$f":"AE8","v":"RKDEO E9"},null,null,null,null,null,null,0,"--",4,null,0,null,3,null,"15:07:00",null,null,{"$f":"AS7","v":"Stolwijk E2"},null,null,null,null,null,"--",{"$f":"AS9","v":"Jodan Boys E8"},null,null,null,null,null,null,0,"--",1,null,0,null,3]
[null,null,null,"15:20:00",null,null,{"$f":"AE9","v":"scVictorie'04 E3"},null,null,null,null,null,"--",{"$f":"AE7","v":"Lekkerkerk E2"},null,null,null,null,null,null,1,"--",0,null,3,null,0,null,"15:20:00",null,null,{"$f":"AS6","v":"Schoonhoven E7"},null,null,null,null,null,"--",{"$f":"AS8","v":"VFC Vlaardingen E8"},null,null,null,null,null,null,0,"--",1,null,0,null,3]
[]
[]
[]
[null,null,null,"Kwart finales / Halve finales /  Finales op het volgende blad!"]

{"sheet":"E jeugd finaleronde","index":1,"n_rows":21,"n_cols":57,"rows_kept":21,"cut":false,"hidden":false,"merged":[[20,12,22,18],[2,0,2,1],[2,3,2,6],[2,8,2,11],[5,0,5,1],[15,7,15,8],[5,16,5,17],[6,3,6,6],[6,8,6,11],[2,24,2,27],[3,3,3,6],[3,8,3,11],[3,24,3,27],[3,19,3,22],[0,3,0,27],[8,3,8,27],[10,0,10,1],[10,24,10,27],[10,19,10,22],[10,8,10,11],[10,3,10,6],[6,24,6,27],[5,24,5,27],[5,19,5,22],[10,16,10,17],[6,19,6,22],[5,3,5,6],[2,16,2,17],[2,19,2,22],[5,8,5,11],[11,24,11,27],[11,19,11,22],[11,8,11,11],[11,3,11,6],[18,12,18,18],[16,11,16,14],[16,16,16,19],[15,16,15,19],[15,11,15,14],[13,3,13,27]]}
[null,null,null,"Kwartfinale",null,null,null,null,null,null,null,null,null,null,null,null,null,null,null,null,null,null,null,null,null,null,null,null,null,null,null,null,null,null,null,null,null,null,null,null,null,null,null,null,null,null,null,null,{"$f":"'E jeugd voorronde'!AY1","v":18},{"$f":"'E jeugd voorronde'!BJ1","v":4},{"$f":"'E jeugd voorronde'!BK1","v":"Schoonhoven E1"},{"$f":"'E jeugd voorronde'!BL1","v":2},{"$f":"'E jeugd voorronde'!BM1","v":"Schoonhoven E3"},{"$f":"'E jeugd voorronde'!BN1","v":4},{"$f":"'E jeugd voorronde'!BO1","v":"Schoonhoven E5"},{"$f":"'E jeugd voorronde'!BP1","v":3},{"$f":"'E jeugd voorronde'!BQ1","v":"Schoonhoven E7"}]
[null,null,null,null,null,null,null,null,null,null,null,null,null,null,null,null,null,null,null,null,null,null,null,null,null,null,null,null,null,null,null,null,null,null,null,null,null,null,null,null,null,null,null,null,null,null,null,null,{"$f":"'E jeugd voorronde'!AZ1","v":18},{"$f":"'E jeugd voorronde'!BJ2","v":1},{"$f":"'E jeugd voorronde'!BK2","v":"Cabauw E1"},{"$f":"'E jeugd voorronde'!BL2","v":1},{"$f":"'E jeugd voorronde'!BM2","v":"Cabauw E2"},{"$f":"'E jeugd voorronde'!BN2","v":3},{"$f":"'E jeugd voorronde'!BO2","v":"Lekkerkerk E2"},{"$f":"'E jeugd voorronde'!BP2","v":4},{"$f":"'E jeugd voorronde'!BQ2","v":"Stolwijk E2"}]
["16:30:00",null,"A","Nr 1 groep 1",null,null,null,null,"Nr 2 groep 3",null,null,null,null,null,null,null,"16:30:00",null,"B","Nr 1 groep 2",null,null,null,null,"Nr 2 groep 4",null,null,null,null,null,null,null,null,null,null,null,null,null,null,null,null,null,null,null,null,null,null,null,{"$f":"'E jeugd voorronde'!BA1","v":18},{"$f":"'E jeugd voorronde'!BJ3","v":2},{"$f":"'E jeugd voorronde'!BK3","v":"Jodan Boys E2"},{"$f":"'E jeugd voorronde'!BL3","v":4},{"$f":"'E jeugd voorronde'!BM3","v":"RKDEO E3"},{"$f":"'E jeugd voorronde'!BN3","v":1},{"$f":"'E jeugd voorronde'!BO3","v":"RKDEO E9"},{"$f":"'E jeugd voorronde'!BP3","v":1},{"$f":"'E jeugd voorronde'!BQ3","v":"VFC Vlaardingen E8"}]
[null,null,null,{"$f":"IF(AW1=18,VLOOKUP(1,AX1:AY4,2,0),\"\")","v":"Cabauw E1"},null,null,null,"--",{"$f":"IF(AW3=18,VLOOKUP(2,BB1:BC4,2,0),\"\")","v":"scVictorie'04 E3"},null,null,null,null,null,"-",null,null,null,null,{"$f":"IF(AW2=18,VLOOKUP(1,AZ1:BA4,2,0),\"\")","v":"Cabauw E2"},null,null,null,"--",{"$f":"IF(AW4=18,VLOOKUP(2,BD1:BE4,2,0),\"\")","v":"Jodan Boys E8"},null,null,null,null,null,"-",null,null,null,null,null,null,null,null,null,null,null,null,null,null,null,null,null,{"$f":"'E jeugd voorronde'!BB1","v":18},{"$f":"'E jeugd voorronde'!BJ4","v":3},{"$f":"'E jeugd voorronde'!BK4","v":"Alblasserdam E1"},{"$f":"'E jeugd voorronde'!BL4","v":3},{"$f":"'E jeugd voorronde'!BM4","v":"VV GZ E3"},{"$f":"'E jeugd voorronde'!BN4","v":2},{"$f":"'E jeugd voorronde'!BO4","v":"scVictorie'04 E3"},{"$f":"'E jeugd voorronde'!BP4","v":2},{"$f":"'E jeugd voorronde'!BQ4","v":"Jodan Boys E8"}]
[]
["16:30:00",null,"C","Nr 2 groep 1",null,null,null,null,"Nr 1 groep 3",null,null,null,null,null,null,null,"16:30:00",null,"D","Nr 2 groep 2",null,null,null,null,"Nr 1 groep 4"]
[null,null,null,{"$f":"IF(AW3=18,VLOOKUP(2,AX1:AY4,2,0),\"\")","v":"Jodan Boys E2"},null,null,null,null,{"$f":"IF(AW2=18,VLOOKUP(1,BB1:BC4,2,0),\"\")","v":"RKDEO E9"},null,null,null,null,null,"-",null,null,null,null,{"$f":"IF(AW4=18,VLOOKUP(2,AZ1:BA4,2,0),\"\")","v":"Schoonhoven E3"},null,null,null,null,{"$f":"IF(AW1=18,VLOOKUP(1,BD1:BE4,2,0),\"\")","v":"VFC Vlaardingen E8"},null,null,null,null,null,"-"]
[]
[null,null,null,"Halve finale"]
[]
["16:45:00",null,"E","Winnaar A",null,null,null,null,"Winnaar B",null,null,null,null,null,null,null,"16:45:00",null,"F","Winnaar C",null,null,null,null,"Winnaar D"]
[null,null,null,{"$f":"IF(N4=\"\",\"\",IF(N4>P4,D4,I4))","v":""},null,null,null,null,{"$f":"IF(AD4=\"\",\"\",IF(AD4>AF4,T4,Y4))","v":""},null,null,null,null,null,"-",null,null,null,null,{"$f":"IF(N7=\"\",\"\",IF(N7>P7,D7,I7))","v":""},null,null,null,null,{"$f":"IF(AD7=\"\",\"\",IF(AD7>AF7,T7,Y7))","v":""},null,null,null,null,null,"-"]
[]
[null,null,null,"Finale"]
[]
[null,null,null,null,null,null,null,"17:05:00",null,null,null,"Winnaar E",null,null,null,null,"Winnaar F"]
[null,null,null,null,null,null,null,null,null,null,null,{"$f":"IF(N12=\"\",\"\",IF(N12>P12,D12,I12))","v":""},null,null,null,null,{"$f":"IF(AD12=\"\",\"\",IF(AD12>AF12,T12,Y12))","v":""},null,null,null,null,1,"-",2]
[]
[null,null,null,null,null,null,null,null,null,null,null,null,"Winnaar E-toernooi"]
[]
[null,null,null,null,null,null,null,null,null,null,null,null,{"$f":"IF(V17=\"\",\"\",IF(V17>X17,L17,Q17))","v":""}]

{"sheet":"E-GROEP-1","index":2,"n_rows":19,"n_cols":15,"rows_kept":19,"cut":false,"hidden":false,"merged":[[15,1,15,6],[12,10,14,10],[9,2,9,3],[9,5,9,6],[4,0,4,1],[5,0,5,1],[5,2,5,3],[4,2,4,3],[4,5,4,6],[5,5,5,6],[8,0,8,1],[9,0,9,1],[6,2,6,3],[6,5,6,6],[8,2,8,3],[8,5,8,6],[12,8,14,8],[12,9,14,9],[12,11,14,11],[12,12,14,12],[12,13,14,13],[0,14,2,15],[0,0,2,13],[16,1,16,6],[17,1,17,6],[18,1,18,6],[12,0,14,0],[3,0,3,1],[3,2,3,6],[3,7,3,9],[7,2,7,3],[7,5,7,6],[6,0,6,1],[7,0,7,1],[3,11,3,13],[12,1,14,6],[12,7,14,7]]}
["SCHOONHOVEN TOERNOOI",null,null,null,null,null,null,null,null,null,null,null,null,null,"Scores door:\nOnlineExcelCursus.NL"]
[]
[]
[{"$f":"'E jeugd voorronde'!D11","v":"Tijd"},{"$f":"'E jeugd voorronde'!E11","v":0},{"$f":"'E jeugd voorronde'!G11","v":"VELD A"},null,null,null,null,{"$f":"'E jeugd voorronde'!U11","v":"Uitslag"},null,null,null,{"$f":"'E jeugd voorronde'!Y11","v":"Punten"}]
[{"$f":"'E jeugd voorronde'!D12","v":"14:15:00"},{"$f":"'E jeugd voorronde'!E12","v":"00:00:00"},{"$f":"'E jeugd voorronde'!G12","v":"Schoonhoven E1"},{"$f":"'E jeugd voorronde'!H12","v":0},{"$f":"'E jeugd voorronde'!M12","v":"--"},{"$f":"'E jeugd voorronde'!N12","v":"Cabauw E1"},{"$f":"'E jeugd voorronde'!O12","v":0},{"$f":"'E jeugd voorronde'!U12","v":1},{"$f":"'E jeugd voorronde'!V12","v":"--"},{"$f":"'E jeugd voorronde'!W12","v":2},null,{"$f":"'E jeugd voorronde'!Y12","v":0},null,{"$f":"'E jeugd voorronde'!AA12","v":3}]
[{"$f":"'E jeugd voorronde'!D13","v":"14:28:00"},{"$f":"'E jeugd voorronde'!E13","v":"00:00:00"},{"$f":"'E jeugd voorronde'!G13","v":"Jodan Boys E2"},{"$f":"'E jeugd voorronde'!H13","v":0},{"$f":"'E jeugd voorronde'!M13","v":"--"},{"$f":"'E jeugd voorronde'!N13","v":"Alblasserdam E1"},{"$f":"'E jeugd voorronde'!O13","v":0},{"$f":"'E jeugd voorronde'!U13","v":2},{"$f":"'E jeugd voorronde'!V13","v":"--"},{"$f":"'E jeugd voorronde'!W13","v":1},null,{"$f":"'E jeugd voorronde'!Y13","v":3},null,{"$f":"'E jeugd voorronde'!AA13","v":0}]
[{"$f":"'E jeugd voorronde'!D14","v":"14:41:00"},{"$f":"'E jeugd voorronde'!E14","v":"00:00:00"},{"$f":"'E jeugd voorronde'!G14","v":"Alblasserdam E1"},{"$f":"'E jeugd voorronde'!H14","v":0},{"$f":"'E jeugd voorronde'!M14","v":"--"},{"$f":"'E jeugd voorronde'!N14","v":"Schoonhoven E1"},{"$f":"'E jeugd voorronde'!O14","v":0},{"$f":"'E jeugd voorronde'!U14","v":1},{"$f":"'E jeugd voorronde'!V14","v":"--"},{"$f":"'E jeugd voorronde'!W14","v":2},null,{"$f":"'E jeugd voorronde'!Y14","v":0},null,{"$f":"'E jeugd voorronde'!AA14","v":3}]
[{"$f":"'E jeugd voorronde'!D15","v":"14:54:00"},{"$f":"'E jeugd voorronde'!E15","v":"00:00:00"},{"$f":"'E jeugd voorronde'!G15","v":"Cabauw E1"},{"$f":"'E jeugd voorronde'!H15","v":0},{"$f":"'E jeugd voorronde'!M15","v":"--"},{"$f":"'E jeugd voorronde'!N15","v":"Jodan Boys E2"},{"$f":"'E jeugd voorronde'!O15","v":0},{"$f":"'E jeugd voorronde'!U15","v":3},{"$f":"'E jeugd voorronde'!V15","v":"--"},{"$f":"'E jeugd voorronde'!W15","v":1},null,{"$f":"'E jeugd voorronde'!Y15","v":3},null,{"$f":"'E jeugd voorronde'!AA15","v":0}]
[{"$f":"'E jeugd voorronde'!D16","v":"15:07:00"},{"$f":"'E jeugd voorronde'!E16","v":"00:00:00"},{"$f":"'E jeugd voorronde'!G16","v":"Cabauw E1"},{"$f":"'E jeugd voorronde'!H16","v":0},{"$f":"'E jeugd voorronde'!M16","v":"--"},{"$f":"'E jeugd voorronde'!N16","v":"Alblasserdam E1"},{"$f":"'E jeugd voorronde'!O16","v":0},{"$f":"'E jeugd voorronde'!U16","v":4},{"$f":"'E jeugd voorronde'!V16","v":"--"},{"$f":"'E jeugd voorronde'!W16","v":6},null,{"$f":"'E jeugd voorronde'!Y16","v":0},null,{"$f":"'E jeugd voorronde'!AA16","v":3}]
[{"$f":"'E jeugd voorronde'!D17","v":"15:20:00"},{"$f":"'E jeugd voorronde'!E17","v":"00:00:00"},{"$f":"'E jeugd voorronde'!G17","v":"Schoonhoven E1"},{"$f":"'E jeugd voorronde'!H17","v":0},{"$f":"'E jeugd voorronde'!M17","v":"--"},{"$f":"'E jeugd voorronde'!N17","v":"Jodan Boys E2"},{"$f":"'E jeugd voorronde'!O17","v":0},{"$f":"'E jeugd voorronde'!U17","v":1},{"$f":"'E jeugd voorronde'!V17","v":"--"},{"$f":"'E jeugd voorronde'!W17","v":2},null,{"$f":"'E jeugd voorronde'!Y17","v":0},null,{"$f":"'E jeugd voorronde'!AA17","v":3}]
[]
[]
[{"$f":"'E jeugd voorronde'!A3","v":"Stand"},{"$f":"'E jeugd voorronde'!B5","v":"Groep 1"},null,null,null,null,null,{"$f":"'E jeugd voorronde'!H5","v":"V"},{"$f":"'E jeugd voorronde'!I5","v":"T"},{"$f":"'E jeugd voorronde'!J5","v":"P"},{"$f":"'E jeugd voorronde'!K3","v":"Gewonnen"},{"$f":"'E jeugd voorronde'!L3","v":"Gelijk"},{"$f":"'E jeugd voorronde'!M3","v":"Verloren"},{"$f":"'E jeugd voorronde'!N3","v":"Saldo"}]
[{"$f":"'E jeugd voorronde'!A4","v":0},null,null,null,null,null,null,null,null,null,{"$f":"'E jeugd voorronde'!K4","v":0},{"$f":"'E jeugd voorronde'!L4","v":0},{"$f":"'E jeugd voorronde'!M4","v":0},{"$f":"'E jeugd voorronde'!N4","v":0}]
[{"$f":"'E jeugd voorronde'!A5","v":0},null,null,null,null,null,null,null,null,null,{"$f":"'E jeugd voorronde'!K5","v":0},{"$f":"'E jeugd voorronde'!L5","v":0},{"$f":"'E jeugd voorronde'!M5","v":0},{"$f":"'E jeugd voorronde'!N5","v":0}]
[{"$f":"'E jeugd voorronde'!A6","v":4},{"$f":"'E jeugd voorronde'!B6","v":"Schoonhoven E1"},{"$f":"'E jeugd voorronde'!C6","v":0},{"$f":"'E jeugd voorronde'!D6","v":0},{"$f":"'E jeugd voorronde'!E6","v":0},{"$f":"'E jeugd voorronde'!F6","v":0},{"$f":"'E jeugd voorronde'!G6","v":0},{"$f":"'E jeugd voorronde'!H6","v":4},{"$f":"'E jeugd voorronde'!I6","v":5},{"$f":"'E jeugd voorronde'!J6","v":2.9990000000000001},{"$f":"'E jeugd voorronde'!K6","v":1},{"$f":"'E jeugd voorronde'!L6","v":0},{"$f":"'E jeugd voorronde'!M6","v":2},{"$f":"'E jeugd voorronde'!N6","v":-1}]
[{"$f":"'E jeugd voorronde'!A7","v":1},{"$f":"'E jeugd voorronde'!B7","v":"Cabauw E1"},{"$f":"'E jeugd voorronde'!C7","v":0},{"$f":"'E jeugd voorronde'!D7","v":0},{"$f":"'E jeugd voorronde'!E7","v":0},{"$f":"'E jeugd voorronde'!F7","v":0},{"$f":"'E jeugd voorronde'!G7","v":0},{"$f":"'E jeugd voorronde'!H7","v":9},{"$f":"'E jeugd voorronde'!I7","v":8},{"$f":"'E jeugd voorronde'!J7","v":6.0010000000000003},{"$f":"'E jeugd voorronde'!K7","v":2},{"$f":"'E jeugd voorronde'!L7","v":0},{"$f":"'E jeugd voorronde'!M7","v":1},{"$f":"'E jeugd voorronde'!N7","v":1}]
[{"$f":"'E jeugd voorronde'!A8","v":2},{"$f":"'E jeugd voorronde'!B8","v":"Jodan Boys E2"},{"$f":"'E jeugd voorronde'!C8","v":0},{"$f":"'E jeugd voorronde'!D8","v":0},{"$f":"'E jeugd voorronde'!E8","v":0},{"$f":"'E jeugd voorronde'!F8","v":0},{"$f":"'E jeugd voorronde'!G8","v":0},{"$f":"'E jeugd voorronde'!H8","v":5},{"$f":"'E jeugd voorronde'!I8","v":5},{"$f":"'E jeugd voorronde'!J8","v":6},{"$f":"'E jeugd voorronde'!K8","v":2},{"$f":"'E jeugd voorronde'!L8","v":0},{"$f":"'E jeugd voorronde'!M8","v":1},{"$f":"'E jeugd voorronde'!N8","v":0}]
[{"$f":"'E jeugd voorronde'!A9","v":3},{"$f":"'E jeugd voorronde'!B9","v":"Alblasserdam E1"},{"$f":"'E jeugd voorronde'!C9","v":0},{"$f":"'E jeugd voorronde'!D9","v":0},{"$f":"'E jeugd voorronde'!E9","v":0},{"$f":"'E jeugd voorronde'!F9","v":0},{"$f":"'E jeugd voorronde'!G9","v":0},{"$f":"'E jeugd voorronde'!H9","v":8},{"$f":"'E jeugd voorronde'!I9","v":8},{"$f":"'E jeugd voorronde'!J9","v":3},{"$f":"'E jeugd voorronde'!K9","v":1},{"$f":"'E jeugd voorronde'!L9","v":0},{"$f":"'E jeugd voorronde'!M9","v":2},{"$f":"'E jeugd voorronde'!N9","v":0}]

{"sheet":"E-GROEP-2","index":3,"n_rows":20,"n_cols":13,"rows_kept":20,"cut":false,"hidden":false,"merged":[[19,1,19,4],[7,0,7,1],[8,0,8,1],[13,11,15,11],[4,0,4,1],[5,0,5,1],[13,0,15,0],[13,1,15,4],[13,5,15,5],[0,12,2,13],[16,1,16,4],[17,1,17,4],[18,1,18,4],[0,0,2,11],[3,5,3,7],[3,9,3,11],[3,0,3,1],[3,2,3,4],[9,0,9,1],[6,0,6,1],[13,8,15,8],[13,9,15,9],[13,10,15,10],[13,7,15,7],[13,6,15,6]]}
["SCHOONHOVEN TOERNOOI",null,null,null,null,null,null,null,null,null,null,null,"Scores door:\nOnlineExcelCursus.NL"]
[]
[]
[{"$f":"'E jeugd voorronde'!AC11","v":"Tijd"},null,{"$f":"'E jeugd voorronde'!AF11","v":"VELD B"},null,null,{"$f":"'E jeugd voorronde'!AT11","v":"Uitslag"},null,null,null,{"$f":"'E jeugd voorronde'!AX11","v":"Punten"}]
[{"$f":"'E jeugd voorronde'!AC12","v":"14:15:00"},{"$f":"'E jeugd voorronde'!AD12","v":"00:00:00"},{"$f":"'E jeugd voorronde'!AF12","v":"Schoonhoven E3"},{"$f":"'E jeugd voorronde'!AL12","v":"--"},{"$f":"'E jeugd voorronde'!AM12","v":"Cabauw E2"},{"$f":"'E jeugd voorronde'!AT12","v":1},{"$f":"'E jeugd voorronde'!AU12","v":"--"},{"$f":"'E jeugd voorronde'!AV12","v":3},null,{"$f":"'E jeugd voorronde'!AX12","v":0},null,{"$f":"'E jeugd voorronde'!AZ12","v":3}]
[{"$f":"'E jeugd voorronde'!AC13","v":"14:28:00"},{"$f":"'E jeugd voorronde'!AD13","v":"00:00:00"},{"$f":"'E jeugd voorronde'!AF13","v":"RKDEO E3"},{"$f":"'E jeugd voorronde'!AL13","v":"--"},{"$f":"'E jeugd voorronde'!AM13","v":"VV GZ E3"},{"$f":"'E jeugd voorronde'!AT13","v":1},{"$f":"'E jeugd voorronde'!AU13","v":"--"},{"$f":"'E jeugd voorronde'!AV13","v":1},null,{"$f":"'E jeugd voorronde'!AX13","v":1},null,{"$f":"'E jeugd voorronde'!AZ13","v":1}]
[{"$f":"'E jeugd voorronde'!AC14","v":"14:41:00"},{"$f":"'E jeugd voorronde'!AD14","v":"00:00:00"},{"$f":"'E jeugd voorronde'!AF14","v":"VV GZ E3"},{"$f":"'E jeugd voorronde'!AL14","v":"--"},{"$f":"'E jeugd voorronde'!AM14","v":"Schoonhoven E3"},{"$f":"'E jeugd voorronde'!AT14","v":2},{"$f":"'E jeugd voorronde'!AU14","v":"--"},{"$f":"'E jeugd voorronde'!AV14","v":2},null,{"$f":"'E jeugd voorronde'!AX14","v":1},null,{"$f":"'E jeugd voorronde'!AZ14","v":1}]
[{"$f":"'E jeugd voorronde'!AC15","v":"14:54:00"},{"$f":"'E jeugd voorronde'!AD15","v":"00:00:00"},{"$f":"'E jeugd voorronde'!AF15","v":"Cabauw E2"},{"$f":"'E jeugd voorronde'!AL15","v":"--"},{"$f":"'E jeugd voorronde'!AM15","v":"RKDEO E3"},{"$f":"'E jeugd voorronde'!AT15","v":3},{"$f":"'E jeugd voorronde'!AU15","v":"--"},{"$f":"'E jeugd voorronde'!AV15","v":2},null,{"$f":"'E jeugd voorronde'!AX15","v":3},null,{"$f":"'E jeugd voorronde'!AZ15","v":0}]
[{"$f":"'E jeugd voorronde'!AC16","v":"15:07:00"},{"$f":"'E jeugd voorronde'!AD16","v":"00:00:00"},{"$f":"'E jeugd voorronde'!AF16","v":"Schoonhoven E3"},{"$f":"'E jeugd voorronde'!AL16","v":"--"},{"$f":"'E jeugd voorronde'!AM16","v":"RKDEO E3"},{"$f":"'E jeugd voorronde'!AT16","v":1},{"$f":"'E jeugd voorronde'!AU16","v":"--"},{"$f":"'E jeugd voorronde'!AV16","v":0},null,{"$f":"'E jeugd voorronde'!AX16","v":3},null,{"$f":"'E jeugd voorronde'!AZ16","v":0}]
[{"$f":"'E jeugd voorronde'!AC17","v":"15:20:00"},{"$f":"'E jeugd voorronde'!AD17","v":"00:00:00"},{"$f":"'E jeugd voorronde'!AF17","v":"Cabauw E2"},{"$f":"'E jeugd voorronde'!AL17","v":"--"},{"$f":"'E jeugd voorronde'!AM17","v":"VV GZ E3"},{"$f":"'E jeugd voorronde'!AT17","v":0},{"$f":"'E jeugd voorronde'!AU17","v":"--"},{"$f":"'E jeugd voorronde'!AV17","v":0},null,{"$f":"'E jeugd voorronde'!AX17","v":1},null,{"$f":"'E jeugd voorronde'!AZ17","v":1}]
[]
[]
[]
[{"$f":"'E jeugd voorronde'!O3","v":"Stand"},{"$f":"'E jeugd voorronde'!P5","v":"Groep 2"},null,null,null,{"$f":"'E jeugd voorronde'!W5","v":"V"},{"$f":"'E jeugd voorronde'!X5","v":"T"},{"$f":"'E jeugd voorronde'!Y5","v":"P"},{"$f":"'E jeugd voorronde'!Z3","v":"Gewonnen"},{"$f":"'E jeugd voorronde'!AA3","v":"Gelijk"},{"$f":"'E jeugd voorronde'!AB3","v":"Verloren"},{"$f":"'E jeugd voorronde'!AC3","v":"Saldo"}]
[{"$f":"'E jeugd voorronde'!O4","v":0},null,null,null,null,null,null,null,{"$f":"'E jeugd voorronde'!Z4","v":0},{"$f":"'E jeugd voorronde'!AA4","v":0},{"$f":"'E jeugd voorronde'!AB4","v":0},{"$f":"'E jeugd voorronde'!AC4","v":0}]
[{"$f":"'E jeugd voorronde'!O5","v":0},null,null,null,null,null,null,null,{"$f":"'E jeugd voorronde'!Z5","v":0},{"$f":"'E jeugd voorronde'!AA5","v":0},{"$f":"'E jeugd voorronde'!AB5","v":0},{"$f":"'E jeugd voorronde'!AC5","v":0}]
[{"$f":"'E jeugd voorronde'!O6","v":2},{"$f":"'E jeugd voorronde'!P6","v":"Schoonhoven E3"},null,null,null,{"$f":"'E jeugd voorronde'!W6","v":4},{"$f":"'E jeugd voorronde'!X6","v":5},{"$f":"'E jeugd voorronde'!Y6","v":3.9989999999999997},{"$f":"'E jeugd voorronde'!Z6","v":1},{"$f":"'E jeugd voorronde'!AA6","v":1},{"$f":"'E jeugd voorronde'!AB6","v":1},{"$f":"'E jeugd voorronde'!AC6","v":-1}]
[{"$f":"'E jeugd voorronde'!O7","v":1},{"$f":"'E jeugd voorronde'!P7","v":"Cabauw E2"},null,null,null,{"$f":"'E jeugd voorronde'!W7","v":6},{"$f":"'E jeugd voorronde'!X7","v":3},{"$f":"'E jeugd voorronde'!Y7","v":7.0030000000000001},{"$f":"'E jeugd voorronde'!Z7","v":2},{"$f":"'E jeugd voorronde'!AA7","v":1},{"$f":"'E jeugd voorronde'!AB7","v":0},{"$f":"'E jeugd voorronde'!AC7","v":3}]
[{"$f":"'E jeugd voorronde'!O8","v":4},{"$f":"'E jeugd voorronde'!P8","v":"RKDEO E3"},null,null,null,{"$f":"'E jeugd voorronde'!W8","v":3},{"$f":"'E jeugd voorronde'!X8","v":5},{"$f":"'E jeugd voorronde'!Y8","v":0.99799999999999989},{"$f":"'E jeugd voorronde'!Z8","v":0},{"$f":"'E jeugd voorronde'!AA8","v":1},{"$f":"'E jeugd voorronde'!AB8","v":2},{"$f":"'E jeugd voorronde'!AC8","v":-2}]
[{"$f":"'E jeugd voorronde'!O9","v":3},{"$f":"'E jeugd voorronde'!P9","v":"VV GZ E3"},null,null,null,{"$f":"'E jeugd voorronde'!W9","v":3},{"$f":"'E jeugd voorronde'!X9","v":3},{"$f":"'E jeugd voorronde'!Y9","v":3},{"$f":"'E jeugd voorronde'!Z9","v":0},{"$f":"'E jeugd voorronde'!AA9","v":3},{"$f":"'E jeugd voorronde'!AB9","v":0},{"$f":"'E jeugd voorronde'!AC9","v":0}]

{"sheet":"E-GROEP-3","index":4,"n_rows":19,"n_cols":13,"rows_kept":19,"cut":false,"hidden":false,"merged":[[17,1,17,4],[18,1,18,4],[15,1,15,4],[12,0,14,0],[5,0,5,1],[6,0,6,1],[16,1,16,4],[12,1,14,4],[8,0,8,1],[12,8,14,8],[12,9,14,9],[0,12,2,13],[12,5,14,5],[12,6,14,6],[12,7,14,7],[0,0,2,11],[12,10,14,10],[12,11,14,11],[9,0,9,1],[7,0,7,1],[3,9,3,11],[4,0,4,1],[3,0,3,1],[3,5,3,7],[3,2,3,4]]}
["SCHOONHOVEN TOERNOOI",null,null,null,null,null,null,null,null,null,null,null,"Scores door:\nOnlineExcelCursus.NL"]
[]
[]
[{"$f":"'E jeugd voorronde'!D19","v":"Tijd"},{"$f":"'E jeugd voorronde'!E19","v":0},{"$f":"'E jeugd voorronde'!G19","v":"VELD C"},null,null,{"$f":"'E jeugd voorronde'!U19","v":"Uitslag"},{"$f":"'E jeugd voorronde'!V19","v":0},{"$f":"'E jeugd voorronde'!W19","v":0},null,{"$f":"'E jeugd voorronde'!Y19","v":"Punten"}]
[{"$f":"'E jeugd voorronde'!D20","v":"14:15:00"},{"$f":"'E jeugd voorronde'!E20","v":"00:00:00"},{"$f":"'E jeugd voorronde'!G20","v":"Schoonhoven E5"},{"$f":"'E jeugd voorronde'!M20","v":"--"},{"$f":"'E jeugd voorronde'!N20","v":"Lekkerkerk E2"},{"$f":"'E jeugd voorronde'!U20","v":0},{"$f":"'E jeugd voorronde'!V20","v":"--"},{"$f":"'E jeugd voorronde'!W20","v":2},null,{"$f":"'E jeugd voorronde'!Y20","v":0},null,{"$f":"'E jeugd voorronde'!AA20","v":3}]
[{"$f":"'E jeugd voorronde'!D21","v":"14:28:00"},{"$f":"'E jeugd voorronde'!E21","v":"00:00:00"},{"$f":"'E jeugd voorronde'!G21","v":"RKDEO E9"},{"$f":"'E jeugd voorronde'!M21","v":"--"},{"$f":"'E jeugd voorronde'!N21","v":"scVictorie'04 E3"},{"$f":"'E jeugd voorronde'!U21","v":4},{"$f":"'E jeugd voorronde'!V21","v":"--"},{"$f":"'E jeugd voorronde'!W21","v":1},null,{"$f":"'E jeugd voorronde'!Y21","v":3},null,{"$f":"'E jeugd voorronde'!AA21","v":0}]
[{"$f":"'E jeugd voorronde'!D22","v":"14:41:00"},{"$f":"'E jeugd voorronde'!E22","v":"00:00:00"},{"$f":"'E jeugd voorronde'!G22","v":"scVictorie'04 E3"},{"$f":"'E jeugd voorronde'!M22","v":"--"},{"$f":"'E jeugd voorronde'!N22","v":"Schoonhoven E5"},{"$f":"'E jeugd voorronde'!U22","v":1},{"$f":"'E jeugd voorronde'!V22","v":"--"},{"$f":"'E jeugd voorronde'!W22","v":1},null,{"$f":"'E jeugd voorronde'!Y22","v":1},null,{"$f":"'E jeugd voorronde'!AA22","v":1}]
[{"$f":"'E jeugd voorronde'!D23","v":"14:54:00"},{"$f":"'E jeugd voorronde'!E23","v":"00:00:00"},{"$f":"'E jeugd voorronde'!G23","v":"Lekkerkerk E2"},{"$f":"'E jeugd voorronde'!M23","v":"--"},{"$f":"'E jeugd voorronde'!N23","v":"RKDEO E9"},{"$f":"'E jeugd voorronde'!U23","v":2},{"$f":"'E jeugd voorronde'!V23","v":"--"},{"$f":"'E jeugd voorronde'!W23","v":3},null,{"$f":"'E jeugd voorronde'!Y23","v":0},null,{"$f":"'E jeugd voorronde'!AA23","v":3}]
[{"$f":"'E jeugd voorronde'!D24","v":"15:07:00"},{"$f":"'E jeugd voorronde'!E24","v":"00:00:00"},{"$f":"'E jeugd voorronde'!G24","v":"Schoonhoven E5"},{"$f":"'E jeugd voorronde'!M24","v":"--"},{"$f":"'E jeugd voorronde'!N24","v":"RKDEO E9"},{"$f":"'E jeugd voorronde'!U24","v":0},{"$f":"'E jeugd voorronde'!V24","v":"--"},{"$f":"'E jeugd voorronde'!W24","v":4},null,{"$f":"'E jeugd voorronde'!Y24","v":0},null,{"$f":"'E jeugd voorronde'!AA24","v":3}]
[{"$f":"'E jeugd voorronde'!D25","v":"15:20:00"},{"$f":"'E jeugd voorronde'!E25","v":"00:00:00"},{"$f":"'E jeugd voorronde'!G25","v":"scVictorie'04 E3"},{"$f":"'E jeugd voorronde'!M25","v":"--"},{"$f":"'E jeugd voorronde'!N25","v":"Lekkerkerk E2"},{"$f":"'E jeugd voorronde'!U25","v":1},{"$f":"'E jeugd voorronde'!V25","v":"--"},{"$f":"'E jeugd voorronde'!W25","v":0},null,{"$f":"'E jeugd voorronde'!Y25","v":3},null,{"$f":"'E jeugd voorronde'!AA25","v":0}]
[]
[]
[{"$f":"'E jeugd voorronde'!AD3","v":"Stand"},{"$f":"'E jeugd voorronde'!AE5","v":"Groep 3"},null,null,null,{"$f":"'E jeugd voorronde'!AK5","v":"V"},{"$f":"'E jeugd voorronde'!AL5","v":"T"},{"$f":"'E jeugd voorronde'!AM5","v":"P"},{"$f":"'E jeugd voorronde'!AN3","v":"Gewonnen"},{"$f":"'E jeugd voorronde'!AO3","v":"Gelijk"},{"$f":"'E jeugd voorronde'!AP3","v":"Verloren"},{"$f":"'E jeugd voorronde'!AQ3","v":"Saldo"}]
[{"$f":"'E jeugd voorronde'!AD4","v":0},null,null,null,null,null,null,null,{"$f":"'E jeugd voorronde'!AN4","v":0},{"$f":"'E jeugd voorronde'!AO4","v":0},{"$f":"'E jeugd voorronde'!AP4","v":0},{"$f":"'E jeugd voorronde'!AQ4","v":0}]
[{"$f":"'E jeugd voorronde'!AD5","v":0},null,null,null,null,null,null,null,{"$f":"'E jeugd voorronde'!AN5","v":0},{"$f":"'E jeugd voorronde'!AO5","v":0},{"$f":"'E jeugd voorronde'!AP5","v":0},{"$f":"'E jeugd voorronde'!AQ5","v":0}]
[{"$f":"'E jeugd voorronde'!AD6","v":4},{"$f":"'E jeugd voorronde'!AE6","v":"Schoonhoven E5"},null,null,null,{"$f":"'E jeugd voorronde'!AK6","v":1},{"$f":"'E jeugd voorronde'!AL6","v":7},{"$f":"'E jeugd voorronde'!AM6","v":0.99399999999999988},{"$f":"'E jeugd voorronde'!AN6","v":0},{"$f":"'E jeugd voorronde'!AO6","v":1},{"$f":"'E jeugd voorronde'!AP6","v":2},{"$f":"'E jeugd voorronde'!AQ6","v":-6}]
[{"$f":"'E jeugd voorronde'!AD7","v":3},{"$f":"'E jeugd voorronde'!AE7","v":"Lekkerkerk E2"},null,null,null,{"$f":"'E jeugd voorronde'!AK7","v":4},{"$f":"'E jeugd voorronde'!AL7","v":4},{"$f":"'E jeugd voorronde'!AM7","v":3},{"$f":"'E jeugd voorronde'!AN7","v":1},{"$f":"'E jeugd voorronde'!AO7","v":0},{"$f":"'E jeugd voorronde'!AP7","v":2},{"$f":"'E jeugd voorronde'!AQ7","v":0}]
[{"$f":"'E jeugd voorronde'!AD8","v":1},{"$f":"'E jeugd voorronde'!AE8","v":"RKDEO E9"},null,null,null,{"$f":"'E jeugd voorronde'!AK8","v":11},{"$f":"'E jeugd voorronde'!AL8","v":3},{"$f":"'E jeugd voorronde'!AM8","v":9.0079999999999991},{"$f":"'E jeugd voorronde'!AN8","v":3},{"$f":"'E jeugd voorronde'!AO8","v":0},{"$f":"'E jeugd voorronde'!AP8","v":0},{"$f":"'E jeugd voorronde'!AQ8","v":8}]
[{"$f":"'E jeugd voorronde'!AD9","v":2},{"$f":"'E jeugd voorronde'!AE9","v":"scVictorie'04 E3"},null,null,null,{"$f":"'E jeugd voorronde'!AK9","v":3},{"$f":"'E jeugd voorronde'!AL9","v":5},{"$f":"'E jeugd voorronde'!AM9","v":3.9980000000000002},{"$f":"'E jeugd voorronde'!AN9","v":1},{"$f":"'E jeugd voorronde'!AO9","v":1},{"$f":"'E jeugd voorronde'!AP9","v":1},{"$f":"'E jeugd voorronde'!AQ9","v":-2}]

{"sheet":"E-GROEP-4","index":5,"n_rows":19,"n_cols":13,"rows_kept":19,"cut":false,"hidden":false,"merged":[[17,1,17,4],[18,1,18,4],[12,1,14,4],[3,2,3,4],[12,0,14,0],[9,0,9,1],[4,0,4,1],[7,0,7,1],[8,0,8,1],[5,0,5,1],[6,0,6,1],[0,12,2,13],[12,6,14,6],[12,7,14,7],[15,1,15,4],[16,1,16,4],[0,0,2,11],[12,8,14,8],[12,9,14,9],[12,10,14,10],[12,11,14,11],[12,5,14,5],[3,5,3,7],[3,9,3,11],[3,0,3,1]]}
["SCHOONHOVEN TOERNOOI",null,null,null,null,null,null,null,null,null,null,null,"Scores door:\nOnlineExcelCursus.NL"]
[]
[]
[{"$f":"'E jeugd voorronde'!AC19","v":"Tijd"},{"$f":"'E jeugd voorronde'!AD19","v":0},{"$f":"'E jeugd voorronde'!AF19","v":"VELD D"},null,null,{"$f":"'E jeugd voorronde'!AT19","v":"Uitslag"},{"$f":"'E jeugd voorronde'!AU19","v":0},{"$f":"'E jeugd voorronde'!AV19","v":0},null,{"$f":"'E jeugd voorronde'!AX19","v":"Punten"},{"$f":"'E jeugd voorronde'!AY19","v":0},{"$f":"'E jeugd voorronde'!AZ19","v":0}]
[{"$f":"'E jeugd voorronde'!AC20","v":"14:15:00"},{"$f":"'E jeugd voorronde'!AD20","v":"00:00:00"},{"$f":"'E jeugd voorronde'!AF20","v":"Schoonhoven E7"},{"$f":"'E jeugd voorronde'!AL20","v":"--"},{"$f":"'E jeugd voorronde'!AM20","v":"Stolwijk E2"},{"$f":"'E jeugd voorronde'!AT20","v":1},{"$f":"'E jeugd voorronde'!AU20","v":"--"},{"$f":"'E jeugd voorronde'!AV20","v":1},null,{"$f":"'E jeugd voorronde'!Y20","v":0},null,{"$f":"'E jeugd voorronde'!AA20","v":3}]
[{"$f":"'E jeugd voorronde'!AC21","v":"14:28:00"},{"$f":"'E jeugd voorronde'!AD21","v":"00:00:00"},{"$f":"'E jeugd voorronde'!AF21","v":"VFC Vlaardingen E8"},{"$f":"'E jeugd voorronde'!AL21","v":"--"},{"$f":"'E jeugd voorronde'!AM21","v":"Jodan Boys E8"},{"$f":"'E jeugd voorronde'!AT21","v":3},{"$f":"'E jeugd voorronde'!AU21","v":"--"},{"$f":"'E jeugd voorronde'!AV21","v":2},null,{"$f":"'E jeugd voorronde'!Y21","v":3},null,{"$f":"'E jeugd voorronde'!AA21","v":0}]
[{"$f":"'E jeugd voorronde'!AC22","v":"14:41:00"},{"$f":"'E jeugd voorronde'!AD22","v":"00:00:00"},{"$f":"'E jeugd voorronde'!AF22","v":"Jodan Boys E8"},{"$f":"'E jeugd voorronde'!AL22","v":"--"},{"$f":"'E jeugd voorronde'!AM22","v":"Schoonhoven E7"},{"$f":"'E jeugd voorronde'!AT22","v":2},{"$f":"'E jeugd voorronde'!AU22","v":"--"},{"$f":"'E jeugd voorronde'!AV22","v":2},null,{"$f":"'E jeugd voorronde'!Y22","v":1},null,{"$f":"'E jeugd voorronde'!AA22","v":1}]
[{"$f":"'E jeugd voorronde'!AC23","v":"14:54:00"},{"$f":"'E jeugd voorronde'!AD23","v":"00:00:00"},{"$f":"'E jeugd voorronde'!AF23","v":"Stolwijk E2"},{"$f":"'E jeugd voorronde'!AL23","v":"--"},{"$f":"'E jeugd voorronde'!AM23","v":"VFC Vlaardingen E8"},{"$f":"'E jeugd voorronde'!AT23","v":1},{"$f":"'E jeugd voorronde'!AU23","v":"--"},{"$f":"'E jeugd voorronde'!AV23","v":3},null,{"$f":"'E jeugd voorronde'!Y23","v":0},null,{"$f":"'E jeugd voorronde'!AA23","v":3}]
[{"$f":"'E jeugd voorronde'!AC24","v":"15:07:00"},{"$f":"'E jeugd voorronde'!AD24","v":"00:00:00"},{"$f":"'E jeugd voorronde'!AF24","v":"Stolwijk E2"},{"$f":"'E jeugd voorronde'!AL24","v":"--"},{"$f":"'E jeugd voorronde'!AM24","v":"Jodan Boys E8"},{"$f":"'E jeugd voorronde'!AT24","v":0},{"$f":"'E jeugd voorronde'!AU24","v":"--"},{"$f":"'E jeugd voorronde'!AV24","v":1},null,{"$f":"'E jeugd voorronde'!Y24","v":0},null,{"$f":"'E jeugd voorronde'!AA24","v":3}]
[{"$f":"'E jeugd voorronde'!AC25","v":"15:20:00"},{"$f":"'E jeugd voorronde'!AD25","v":"00:00:00"},{"$f":"'E jeugd voorronde'!AF25","v":"Schoonhoven E7"},{"$f":"'E jeugd voorronde'!AL25","v":"--"},{"$f":"'E jeugd voorronde'!AM25","v":"VFC Vlaardingen E8"},{"$f":"'E jeugd voorronde'!AT25","v":0},{"$f":"'E jeugd voorronde'!AU25","v":"--"},{"$f":"'E jeugd voorronde'!AV25","v":1},null,{"$f":"'E jeugd voorronde'!Y25","v":3},null,{"$f":"'E jeugd voorronde'!AA25","v":0}]
[]
[]
[{"$f":"'E jeugd voorronde'!AR3","v":"Stand"},{"$f":"'E jeugd voorronde'!AS5","v":"Groep 4"},null,null,null,{"$f":"'E jeugd voorronde'!AY5","v":"V"},{"$f":"'E jeugd voorronde'!AZ5","v":"T"},{"$f":"'E jeugd voorronde'!BA5","v":"P"},{"$f":"'E jeugd voorronde'!BB3","v":"Gewonnen"},{"$f":"'E jeugd voorronde'!BC3","v":"Gelijk"},{"$f":"'E jeugd voorronde'!BD3","v":"Verloren"},{"$f":"'E jeugd voorronde'!BE3","v":"Saldo"}]
[{"$f":"'E jeugd voorronde'!AR4","v":0},null,null,null,null,null,null,null,{"$f":"'E jeugd voorronde'!BB4","v":0},{"$f":"'E jeugd voorronde'!BC4","v":0},{"$f":"'E jeugd voorronde'!BD4","v":0},{"$f":"'E jeugd voorronde'!BE4","v":0}]
[{"$f":"'E jeugd voorronde'!AR5","v":0},null,null,null,null,null,null,null,{"$f":"'E jeugd voorronde'!BB5","v":0},{"$f":"'E jeugd voorronde'!BC5","v":0},{"$f":"'E jeugd voorronde'!BD5","v":0},{"$f":"'E jeugd voorronde'!BE5","v":0}]
[{"$f":"'E jeugd voorronde'!AR6","v":3},{"$f":"'E jeugd voorronde'!AS6","v":"Schoonhoven E7"},null,null,null,{"$f":"'E jeugd voorronde'!AY6","v":3},{"$f":"'E jeugd voorronde'!AZ6","v":4},{"$f":"'E jeugd voorronde'!BA6","v":1.9990000000000001},{"$f":"'E jeugd voorronde'!BB6","v":0},{"$f":"'E jeugd voorronde'!BC6","v":2},{"$f":"'E jeugd voorronde'!BD6","v":1},{"$f":"'E jeugd voorronde'!BE6","v":-1}]
[{"$f":"'E jeugd voorronde'!AR7","v":4},{"$f":"'E jeugd voorronde'!AS7","v":"Stolwijk E2"},null,null,null,{"$f":"'E jeugd voorronde'!AY7","v":2},{"$f":"'E jeugd voorronde'!AZ7","v":5},{"$f":"'E jeugd voorronde'!BA7","v":0.997},{"$f":"'E jeugd voorronde'!BB7","v":0},{"$f":"'E jeugd voorronde'!BC7","v":1},{"$f":"'E jeugd voorronde'!BD7","v":2},{"$f":"'E jeugd voorronde'!BE7","v":-3}]
[{"$f":"'E jeugd voorronde'!AR8","v":1},{"$f":"'E jeugd voorronde'!AS8","v":"VFC Vlaardingen E8"},null,null,null,{"$f":"'E jeugd voorronde'!AY8","v":7},{"$f":"'E jeugd voorronde'!AZ8","v":3},{"$f":"'E jeugd voorronde'!BA8","v":9.0039999999999996},{"$f":"'E jeugd voorronde'!BB8","v":3},{"$f":"'E jeugd voorronde'!BC8","v":0},{"$f":"'E jeugd voorronde'!BD8","v":0},{"$f":"'E jeugd voorronde'!BE8","v":4}]
[{"$f":"'E jeugd voorronde'!AR9","v":2},{"$f":"'E jeugd voorronde'!AS9","v":"Jodan Boys E8"},null,null,null,{"$f":"'E jeugd voorronde'!AY9","v":5},{"$f":"'E jeugd voorronde'!AZ9","v":5},{"$f":"'E jeugd voorronde'!BA9","v":4},{"$f":"'E jeugd voorronde'!BB9","v":1},{"$f":"'E jeugd voorronde'!BC9","v":1},{"$f":"'E jeugd voorronde'!BD9","v":1},{"$f":"'E jeugd voorronde'!BE9","v":0}]

{"sheet":"Blad1","index":6,"n_rows":0,"n_cols":0,"rows_kept":0,"cut":false,"hidden":false,"merged":[]}