{"text_format":"1","workbook":"xlsx","n_sheets":6,"sheets":["E jeugd voorronde","E jeugd finaleronde","E-GROEP-1","E-GROEP-2","E-GROEP-3","E-GROEP-4"],"not_rendered":{"charts":0,"images":4,"macros":1,"external_links":0,"defined_names":0,"comments":0,"pivot_tables":0},"unopened":[],"bounds":{"document_bytes":16777216,"sheet_cells":100000,"rows_first":2000,"rows_last":500,"rows_between":2000,"halvings":0,"cell_chars":16384,"cell_head_chars":4096},"cells_cut":0,"cells_raw":0,"read":"whole","date_system":"1900"}

{"sheet":"E jeugd voorronde","index":0,"n_rows":45,"n_cols":69,"rows_kept":45,"cut":false,"hidden":false,"merged":[[38,28,38,29],[39,28,39,29],[30,28,30,29],[36,28,36,29],[31,28,31,29],[29,45,29,47],[21,38,21,43],[20,38,20,43],[19,38,19,43],[39,38,39,43],[38,38,38,43],[39,31,39,36],[38,31,38,36],[32,31,32,36],[31,31,31,36],[22,31,22,36],[37,28,37,29],[32,28,32,29],[33,28,33,29],[21,28,21,29],[19,28,19,29],[20,28,20,29],[22,3,22,4],[20,3,20,4],[19,3,19,4],[21,3,21,4],[30,31,30,36],[37,38,37,43],[36,38,36,43],[35,38,35,43],[34,38,34,43],[33,38,33,43],[32,38,32,43],[31,38,31,43],[30,38,30,43],[37,31,37,36],[36,31,36,36],[35,31,35,36],[34,31,34,36],[33,31,33,36],[21,31,21,36],[20,31,20,36],[19,31,19,36],[36,6,36,11],[37,13,37,18],[36,13,36,18],[6,15,6,21],[14,31,14,36],[13,31,13,36],[12,20,12,22],[7,15,7,21],[7,30,7,35],[8,15,8,21],[12,31,12,43],[14,28,14,29],[10,30,10,35],[0,0,1,49],[5,1,5,6],[6,1,6,6],[7,1,7,6],[4,1,4,6],[2,0,4,0],[2,12,4,12],[2,11,4,11],[2,10,4,10],[2,27,4,27],[5,44,5,49],[7,44,7,49],[2,14,4,14],[2,29,4,29],[2,43,4,43],[4,15,4,21],[4,30,4,35],[6,30,6,35],[2,13,4,13],[2,25,4,25],[2,26,4,26],[6,44,6,49],[5,15,5,21],[5,30,5,35],[17,3,17,4],[20,13,20,18],[19,13,19,18],[18,13,18,18],[16,13,16,18],[20,6,20,11],[19,6,19,11],[8,1,8,6],[9,1,9,6],[12,3,12,4],[12,6,12,18],[13,3,13,4],[16,3,16,4],[15,3,15,4],[14,3,14,4],[9,15,9,21],[15,13,15,18],[14,6,14,11],[13,6,13,11],[14,13,14,18],[13,13,13,18],[10,15,10,21],[16,6,16,11],[15,6,15,11],[17,13,17,18],[15,28,15,29],[16,28,16,29],[17,28,17,29],[18,28,18,29],[35,28,35,29],[34,28,34,29],[29,24,29,26],[22,13,22,18],[21,6,21,11],[21,13,21,18],[39,6,39,11],[38,6,38,11],[37,6,37,11],[31,6,31,11],[30,6,30,11],[33,13,33,18],[32,13,32,18],[35,6,35,11],[34,6,34,11],[33,6,33,11],[32,6,32,11],[35,13,35,18],[34,13,34,18],[31,13,31,18],[30,13,30,18],[29,31,29,43],[29,6,29,18],[29,28,29,29],[29,20,29,22],[8,44,8,49],[12,45,12,47],[9,30,9,35],[9,44,9,49],[12,49,12,51],[8,30,8,35],[22,28,22,29],[22,38,22,43],[13,28,13,29],[18,31,18,36],[18,38,18,43],[17,38,17,43],[29,49,29,51],[12,24,12,26],[16,38,16,43],[12,28,12,29],[10,1,10,6],[22,6,22,11],[29,3,29,4],[18,3,18,4],[2,56,4,56],[2,42,4,42],[2,53,4,53],[2,54,4,54],[2,55,4,55],[2,28,4,28],[2,39,4,39],[2,40,4,40],[2,41,4,41],[4,44,4,49],[26,28,26,29],[26,31,26,36],[26,38,26,43],[27,28,27,29],[27,31,27,36],[27,38,27,43],[10,44,10,49],[23,3,23,4],[23,6,23,11],[23,13,23,18],[24,3,24,4],[24,6,24,11],[24,13,24,18],[25,3,25,4],[25,6,25,11],[25,13,25,18],[15,38,15,43],[14,38,14,43],[13,38,13,43],[17,31,17,36],[16,31,16,36],[15,31,15,36],[18,6,18,11],[17,6,17,11],[23,28,23,29],[23,31,23,36],[23,38,23,43],[24,28,24,29],[24,31,24,36],[24,38,24,43],[25,28,25,29],[25,31,25,36],[25,38,25,43],[41,3,41,4],[41,6,41,11],[41,13,41,18],[42,3,42,4],[42,6,42,11],[42,13,42,18],[26,3,26,4],[26,6,26,11],[26,13,26,18],[27,3,27,4],[27,6,27,11],[27,13,27,18],[39,3,39,4],[39,13,39,18],[38,13,38,18],[32,3,32,4],[30,3,30,4],[31,3,31,4],[37,3,37,4],[38,3,38,4],[33,3,33,4],[34,3,34,4],[35,3,35,4],[36,3,36,4],[43,3,43,4],[43,6,43,11],[43,13,43,18],[44,3,44,4],[44,6,44,11],[44,13,44,18],[40,28,40,29],[40,31,40,36],[40,38,40,43],[41,28,41,29],[41,31,41,36],[41,38,41,43],[42,28,42,29],[42,31,42,36],[42,38,42,43],[43,28,43,29],[43,31,43,36],[43,38,43,43],[44,28,44,29],[44,31,44,36],[44,38,44,43],[40,3,40,4],[40,6,40,11],[40,13,40,18]]}
["Schoonhoven E TOERNOOI 2014",null,null,null,null,null,null,null,null,null,null,null,null,null,null,null,null,null,null,null,null,null,null,null,null,null,null,null,null,null,null,null,null,null,null,null,null,null,null,null,null,null,null,null,null,null,null,null,null,null,{"$f":"COUNTA(U14:W23)","v":30},{"$f":"COUNTA(AT14:AV23)","v":30},{"$f":"COUNTA(U31:W40)","v":30},{"$f":"COUNTA(AT31:AV40)","v":30},null,null,null,null,null,null,null,{"$f":"VALUE(A6)","v":1},{"$f":"B6","v":"Schoonhoven E1"},{"$f":"VALUE(O6)","v":1},{"$f":"P6","v":"Schoonhoven E3"},{"$f":"VALUE(AD6)","v":1},{"$f":"AE6","v":"Schoonhoven E5"},{"$f":"VALUE(AR6)","v":1},{"$f":"AS6","v":"Schoonhoven E7"}]
[null,null,null,null,null,null,null,null,null,null,null,null,null,null,null,null,null,null,null,null,null,null,null,null,null,null,null,null,null,null,null,null,null,null,null,null,null,null,null,null,null,null,null,null,null,null,null,null,null,null,null,null,null,null,null,null,null,null,null,null,null,{"$f":"VALUE(A7)","v":5},{"$f":"B7","v":"Schoonhoven E2"},{"$f":"VALUE(O7)","v":5},{"$f":"P7","v":"Schoonhoven E4"},{"$f":"VALUE(AD7)","v":5},{"$f":"AE7","v":"Schoonhoven E6"},{"$f":"VALUE(AR7)","v":5},{"$f":"AS7","v":"Schoonhoven E8"}]
["Stand",null,null,null,null,null,null,null,null,null,"Gewonnen","Gelijk","Verloren","Saldo","Stand",null,null,null,null,null,null,null,null,null,null,"Gewonnen","Gelijk","Verloren","Saldo","Stand",null,null,null,null,null,null,null,null,null,"Gewonnen","Gelijk","Verloren","Saldo","Stand",null,null,null,null,null,null,null,null,null,"Gewonnen","Gelijk","Verloren","Saldo",null,null,null,null,{"$f":"VALUE(A8)","v":2},{"$f":"B8","v":"Jodan Boys E2"},{"$f":"VALUE(O8)","v":2},{"$f":"P8","v":"RKDEO E3"},{"$f":"VALUE(AD8)","v":2},{"$f":"AE8","v":"RKDEO E9"},{"$f":"VALUE(AR8)","v":2},{"$f":"AS8","v":"VFC Vlaardingen E8"}]
[null,null,null,null,null,null,null,null,null,null,null,null,null,null,null,null,null,null,null,null,null,null,null,null,null,null,null,null,null,null,null,null,null,null,null,null,null,null,null,null,null,null,null,null,null,null,null,null,null,null,null,null,null,null,null,null,null,null,null,null,null,{"$f":"VALUE(A9)","v":4},{"$f":"B9","v":"Alblasserdam E1"},{"$f":"VALUE(O9)","v":4},{"$f":"P9","v":"VV GZ E3"},{"$f":"VALUE(AD9)","v":4},{"$f":"AE9","v":"scVictorie'04 E3"},{"$f":"VALUE(AR9)","v":4},{"$f":"AS9","v":"Jodan Boys E8"}]
[null,"Groep 1",null,null,null,null,null,"V","T","P",null,null,null,null,null,"Groep 2",null,null,null,null,null,null,"V","T","P",null,null,null,null,null,"Groep 3",null,null,null,null,null,"V","T","P",null,null,null,null,null,"Groep 4",null,null,null,null,null,"V","T","P",null,null,null,null,null,null,null,null,{"$f":"VALUE(A10)","v":3},{"$f":"B10","v":"Excelcior ??"},{"$f":"VALUE(O10)","v":3},{"$f":"P10","v":"Alblasserdam E3"},{"$f":"VALUE(AD10)","v":3},{"$f":"AE10","v":"Jodan Boys E6"},{"$f":"VALUE(AR10)","v":3},{"$f":"AS10","v":"Smitshoek E10"}]
[{"$f":"RANK(J6,$J$6:$J$10,0)","v":1},"Schoonhoven E1",null,null,null,null,null,{"$f":"SUMIF($G$14:$L$28,B6,$U$14:$U$28)+SUMIF($N$14:$S$28,B6,$W$14:$W$28)","v":16},{"$f":"SUMIF($G$14:$L$28,B6,$W$14:$W$28)+SUMIF($N$14:$S$28,B6,$U$14:$U$28)","v":5},{"$f":"(K6*3)+L6+(H6*0.001)-(I6*0.001)","v":15.010999999999999},{"$f":"SUMPRODUCT(($G$14:$L$28=B6)*($Y$14:$Y$28=3))+SUMPRODUCT(($N$14:$S$28=B6)*($AA$14:$AA$28=3))","v":5},{"$f":"SUMPRODUCT(($G$14:$L$28=B6)*($Y$14:$Y$28=1))+SUMPRODUCT(($N$14:$S$28=B6)*($AA$14:$AA$28=1))","v":0},{"$f":"SUMPRODUCT(($G$14:$L$28=B6)*($Y$14:$Y$28=0))+SUMPRODUCT(($N$14:$S$28=B6)*($AA$14:$AA$28=0))","v":0},{"$f":"H6-I6","v":11},{"$f":"RANK(Y6,$Y$6:$Y$10,0)","v":1},"Schoonhoven E3",null,null,null,null,null,null,{"$f":"SUMIF($AF$14:$AK$28,P6,$AT$14:$AT$28)+SUMIF($AM$14:$AR$28,P6,$AV$14:$AV$28)","v":16},{"$f":"SUMIF($AF$14:$AK$28,P6,$AV$14:$AV$28)+SUMIF($AM$14:$AR$28,P6,$AT$14:$AT$28)","v":5},{"$f":"(Z6*3)+AA6+(W6*0.001)-(X6*0.001)","v":15.010999999999999},{"$f":"SUMPRODUCT(($AF$14:$AK$28=P6)*($AX$14:$AX$28=3))+SUMPRODUCT(($AM$14:$AR$28=P6)*($AZ$14:$AZ$28=3))","v":5},{"$f":"SUMPRODUCT(($AF$14:$AK$28=P6)*($AX$14:$AX$28=1))+SUMPRODUCT(($AM$14:$AR$28=P6)*($AZ$14:$AZ$28=1))","v":0},{"$f":"SUMPRODUCT(($AF$14:$AK$28=P6)*($AX$14:$AX$28=0))+SUMPRODUCT(($AM$14:$AR$28=P6)*($AZ$14:$AZ$28=0))","v":0},{"$f":"W6-X6","v":11},{"$f":"RANK(AM6,$AM$6:$AM$10,0)","v":1},"Schoonhoven E5",null,null,null,null,null,{"$f":"SUMIF($G$31:$L$45,AE6,$U$31:$U$45)+SUMIF($N$31:$S$45,AE6,$W$31:$W$45)","v":16},{"$f":"SUMIF($G$31:$L$45,AE6,$W$31:$W$45)+SUMIF($N$31:$S$45,AE6,$U$31:$U$45)","v":5},{"$f":"(AN6*3)+AO6+(AK6*0.001)-(AL6*0.001)","v":15.010999999999999},{"$f":"SUMPRODUCT(($G$31:$L$45=AE6)*($Y$31:$Y$45=3))+SUMPRODUCT(($N$31:$S$45=AE6)*($AA$31:$AA$45=3))","v":5},{"$f":"SUMPRODUCT(($G$31:$L$45=AE6)*($Y$31:$Y$45=1))+SUMPRODUCT(($N$31:$S$45=AE6)*($AA$31:$AA$45=1))","v":0},{"$f":"SUMPRODUCT(($G$31:$L$45=AE6)*($Y$31:$Y$45=0))+SUMPRODUCT(($N$31:$S$45=AE6)*($AA$31:$AA$45=0))","v":0},{"$f":"AK6-AL6","v":11},{"$f":"RANK(BA6,$BA$6:$BA$10,0)","v":1},"Schoonhoven E7",null,null,null,null,null,{"$f":"SUMIF($AF$31:$AK$45,AS6,$AT$31:$AT$45)+SUMIF($AM$31:$AR$45,AS6,$AV$31:$AV$45)","v":16},{"$f":"SUMIF($AF$31:$AK$45,AS6,$AV$31:$AV$45)+SUMIF($AM$31:$AR$45,AS6,$AT$31:$AT$45)","v":5},{"$f":"(BB6*3)+BC6+(AY6*0.001)-(AZ6*0.001)","v":15.010999999999999},{"$f":"SUMPRODUCT(($AF$31:$AK$45=AS6)*($AX$31:$AX$45=3))+SUMPRODUCT(($AM$31:$AR$45=AS6)*($AZ$31:$AZ$45=3))","v":5},{"$f":"SUMPRODUCT(($AF$31:$AK$45=AS6)*($AX$31:$AX$45=1))+SUMPRODUCT(($AM$31:$AR$45=AS6)*($AZ$31:$AZ$45=1))","v":0},{"$f":"SUMPRODUCT(($AF$31:$AK$45=AS6)*($AX$31:$AX$45=0))+SUMPRODUCT(($AM$31:$AR$45=AS6)*($AZ$31:$AZ$45=0))","v":0},{"$f":"AY6-AZ6","v":11}]
[{"$f":"RANK(J7,$J$6:$J$10,0)","v":5},"Schoonhoven E2",null,null,null,null,null,6,11,1.9949999999999999,0,2,3,-5,{"$f":"RANK(Y7,$Y$6:$Y$10,0)","v":5},"Schoonhoven E4",null,null,null,null,null,null,6,11,1.9949999999999999,0,2,3,-5,{"$f":"RANK(AM7,$AM$6:$AM$10,0)","v":5},"Schoonhoven E6",null,null,null,null,null,6,11,1.9949999999999999,0,2,3,-5,{"$f":"RANK(BA7,$BA$6:$BA$10,0)","v":5},"Schoonhoven E8",null,null,null,null,null,6,11,1.9949999999999999,0,2,3,-5]
[{"$f":"RANK(J8,$J$6:$J$10,0)","v":2},"Jodan Boys E2",null,null,null,null,null,8,8,9,3,0,2,0,{"$f":"RANK(Y8,$Y$6:$Y$10,0)","v":2},"RKDEO E3",null,null,null,null,null,null,8,8,9,3,0,2,0,{"$f":"RANK(AM8,$AM$6:$AM$10,0)","v":2},"RKDEO E9",null,null,null,null,null,8,8,9,3,0,2,0,{"$f":"RANK(BA8,$BA$6:$BA$10,0)","v":2},"VFC Vlaardingen E8",null,null,null,null,null,8,8,9,3,0,2,0]
[{"$f":"RANK(J9,$J$6:$J$10,0)","v":4},"Alblasserdam E1",null,null,null,null,null,6,11,3.9950000000000001,1,1,3,-5,{"$f":"RANK(Y9,$Y$6:$Y$10,0)","v":4},"VV GZ E3",null,null,null,null,null,null,6,11,3.9950000000000001,1,1,3,-5,{"$f":"RANK(AM9,$AM$6:$AM$10,0)","v":4},"scVictorie'04 E3",null,null,null,null,null,6,11,3.9950000000000001,1,1,3,-5,{"$f":"RANK(BA9,$BA$6:$BA$10,0)","v":4},"Jodan Boys E8",null,null,null,null,null,6,11,3.9950000000000001,1,1,3,-5]
[{"$f":"RANK(J10,$J$6:$J$10,0)","v":3},"Excelcior ??",null,null,null,null,null,8,9,3.9990000000000001,1,1,3,-1,{"$f":"RANK(Y10,$Y$6:$Y$10,0)","v":3},"Alblasserdam E3",null,null,null,null,null,null,8,9,3.9990000000000001,1,1,3,-1,{"$f":"RANK(AM10,$AM$6:$AM$10,0)","v":3},"Jodan Boys E6",null,null,null,null,null,8,9,3.9990000000000001,1,1,3,-1,{"$f":"RANK(BA10,$BA$6:$BA$10,0)","v":3},"Smitshoek E10",null,null,null,null,null,8,9,3.9990000000000001,1,1,3,-1]
[{"$f":"RANK(J11,$J$6:$J$11,0)","v":3},"Bergambacht E1",null,null,null,null,null,7,7,8,2,2,1,0,{"$f":"RANK(Y11,$Y$6:$Y$11,0)","v":3},"Bergambacht E3",null,null,null,null,null,null,7,7,8,2,2,1,0,{"$f":"RANK(AM11,$AM$6:$AM$11,0)","v":3},"Bergambacht E5",null,null,null,null,null,7,7,8,2,2,1,0,{"$f":"RANK(BA11,$BA$6:$BA$11,0)","v":3},"Bergambacht E7",null,null,null,null,null,7,7,8,2,2,1,0]
[]
[null,null,null,"Tijd",null,null,"VELD A",null,null,null,null,null,null,null,null,null,null,null,null,null,"Uitslag",null,null,null,"Punten",null,null,null,"Tijd",null,null,"VELD B",null,null,null,null,null,null,null,null,null,null,null,null,null,"Uitslag",null,null,null,"Punten"]
[null,null,null,"12:30:00",null,null,{"$f":"$B$10","v":"Excelcior ??"},null,null,null,null,null,"--",{"$f":"$B$11","v":"Bergambacht E1"},null,null,null,null,null,null,1,"--",2,null,{"$f":"IF(U14=\"\",\"\",IF(U14>W14,3,IF(U14=W14,1,0)))","v":0},null,{"$f":"IF(W14=\"\",\"\",IF(W14>U14,3,IF(W14=U14,1,0)))","v":3},null,"12:30:00",null,null,{"$f":"$P$10","v":"Alblasserdam E3"},null,null,null,null,null,"--",{"$f":"$P$11","v":"Bergambacht E3"},null,null,null,null,null,null,1,"--",2,null,{"$f":"IF(AT14=\"\",\"\",IF(AT14>AV14,3,IF(AT14=AV14,1,0)))","v":0},null,{"$f":"IF(AV14=\"\",\"\",IF(AV14>AT14,3,IF(AV14=AT14,1,0)))","v":3}]
[null,null,null,"12:55:00",null,null,{"$f":"$B$6","v":"Schoonhoven E1"},null,null,null,null,null,"--",{"$f":"$B$9","v":"Alblasserdam E1"},null,null,null,null,null,null,2,"--",1,null,{"$f":"IF(U15=\"\",\"\",IF(U15>W15,3,IF(U15=W15,1,0)))","v":3},null,{"$f":"IF(W15=\"\",\"\",IF(W15>U15,3,IF(W15=U15,1,0)))","v":0},null,"12:55:00",null,null,{"$f":"$P$6","v":"Schoonhoven E3"},null,null,null,null,null,"--",{"$f":"$P$9","v":"VV GZ E3"},null,null,null,null,null,null,2,"--",1,null,{"$f":"IF(AT15=\"\",\"\",IF(AT15>AV15,3,IF(AT15=AV15,1,0)))","v":3},null,{"$f":"IF(AV15=\"\",\"\",IF(AV15>AT15,3,IF(AV15=AT15,1,0)))","v":0}]
[null,null,null,"13:20:00",null,null,{"$f":"$B$7","v":"Schoonhoven E2"},null,null,null,null,null,"--",{"$f":"$B$8","v":"Jodan Boys E2"},null,null,null,null,null,null,1,"--",2,null,{"$f":"IF(U16=\"\",\"\",IF(U16>W16,3,IF(U16=W16,1,0)))","v":0},null,3,null,"13:20:00",null,null,{"$f":"$P$7","v":"Schoonhoven E4"},null,null,null,null,null,"--",{"$f":"$P$8","v":"RKDEO E3"},null,null,null,null,null,null,1,"--",2,null,{"$f":"IF(AT16=\"\",\"\",IF(AT16>AV16,3,IF(AT16=AV16,1,0)))","v":0},null,3]
[null,null,null,"13:45:00",null,null,{"$f":"$B$10","v":"Excelcior ??"},null,null,null,null,null,"--",{"$f":"$B$9","v":"Alblasserdam E1"},null,null,null,null,null,null,3,"--",1,null,3,null,0,null,"13:45:00",null,null,{"$f":"$P$10","v":"Alblasserdam E3"},null,null,null,null,null,"--",{"$f":"$P$9","v":"VV GZ E3"},null,null,null,null,null,null,3,"--",1,null,3,null,0]
[null,null,null,"14:10:00",null,null,{"$f":"$B$8","v":"Jodan Boys E2"},null,null,null,null,null,"--",{"$f":"$B$6","v":"Schoonhoven E1"},null,null,null,null,null,null,1,"--",6,null,0,null,3,null,"14:10:00",null,null,{"$f":"$P$8","v":"RKDEO E3"},null,null,null,null,null,"--",{"$f":"$P$6","v":"Schoonhoven E3"},null,null,null,null,null,null,1,"--",6,null,0,null,3]
[null,null,null,"14:35:00",null,null,{"$f":"$B$9","v":"Alblasserdam E1"},null,null,null,null,null,"--",{"$f":"$B$11","v":"Bergambacht E1"},null,null,null,null,null,null,2,"--",2,null,1,null,1,null,"14:35:00",null,null,{"$f":"$P$9","v":"VV GZ E3"},null,null,null,null,null,"--",{"$f":"$P$11","v":"Bergambacht E3"},null,null,null,null,null,null,2,"--",2,null,1,null,1]
[null,null,null,"15:00:00",null,null,{"$f":"$B$6","v":"Schoonhoven E1"},null,null,null,null,null,"--",{"$f":"$B$7","v":"Schoonhoven E2"},null,null,null,null,null,null,3,"--",1,null,3,null,0,null,"15:00:00",null,null,{"$f":"$P$6","v":"Schoonhoven E3"},null,null,null,null,null,"--",{"$f":"$P$7","v":"Schoonhoven E4"},null,null,null,null,null,null,3,"--",1,null,3,null,0]
[null,null,null,"15:25:00",null,null,{"$f":"$B$11","v":"Bergambacht E1"},null,null,null,null,null,"--",{"$f":"$B$7","v":"Schoonhoven E2"},null,null,null,null,null,null,1,"--",1,null,1,null,1,null,"15:25:00",null,null,{"$f":"$P$11","v":"Bergambacht E3"},null,null,null,null,null,"--",{"$f":"$P$7","v":"Schoonhoven E4"},null,null,null,null,null,null,1,"--",1,null,1,null,1]
[null,null,null,"15:50:00",null,null,{"$f":"$B$8","v":"Jodan Boys E2"},null,null,null,null,null,"--",{"$f":"$B$10","v":"Excelcior ??"},null,null,null,null,null,null,1,"--",0,null,3,null,0,null,"15:50:00",null,null,{"$f":"$P$8","v":"RKDEO E3"},null,null,null,null,null,"--",{"$f":"$P$10","v":"Alblasserdam E3"},null,null,null,null,null,null,1,"--",0,null,3,null,0]
[null,null,null,"16:15:00",null,null,{"$f":"$B$7","v":"Schoonhoven E2"},null,null,null,null,null,"--",{"$f":"$B$9","v":"Alblasserdam E1"},null,null,null,null,null,null,0,"--",2,null,0,null,3,null,"16:15:00",null,null,{"$f":"$P$7","v":"Schoonhoven E4"},null,null,null,null,null,"--",{"$f":"$P$9","v":"VV GZ E3"},null,null,null,null,null,null,0,"--",2,null,0,null,3]
[null,null,null,"16:40:00",null,null,{"$f":"$B$8","v":"Jodan Boys E2"},null,null,null,null,null,"--",{"$f":"$B$11","v":"Bergambacht E1"},null,null,null,null,null,null,0,"--",1,null,0,null,3,null,"16:40:00",null,null,{"$f":"$P$8","v":"RKDEO E3"},null,null,null,null,null,"--",{"$f":"$P$11","v":"Bergambacht E3"},null,null,null,null,null,null,0,"--",1,null,0,null,3]
[null,null,null,"17:05:00",null,null,{"$f":"$B$11","v":"Bergambacht E1"},null,null,null,null,null,"--",{"$f":"$B$6","v":"Schoonhoven E1"},null,null,null,null,null,null,1,"--",3,null,0,null,3,null,"17:05:00",null,null,{"$f":"$P$11","v":"Bergambacht E3"},null,null,null,null,null,"--",{"$f":"$P$6","v":"Schoonhoven E3"},null,null,null,null,null,null,1,"--",3,null,0,null,3]
[null,null,null,"17:30:00",null,null,{"$f":"$B$10","v":"Excelcior ??"},null,null,null,null,null,"--",{"$f":"$B$7","v":"Schoonhoven E2"},null,null,null,null,null,null,3,"--",3,null,1,null,1,null,"17:30:00",null,null,{"$f":"$P$10","v":"Alblasserdam E3"},null,null,null,null,null,"--",{"$f":"$P$7","v":"Schoonhoven E4"},null,null,null,null,null,null,3,"--",3,null,1,null,1]
[null,null,null,"17:55:00",null,null,{"$f":"$B$6","v":"Schoonhoven E1"},null,null,null,null,null,"--",{"$f":"$B$10","v":"Excelcior ??"},null,null,null,null,null,null,2,"--",1,null,3,null,0,null,"17:55:00",null,null,{"$f":"$P$6","v":"Schoonhoven E3"},null,null,null,null,null,"--",{"$f":"$P$10","v":"Alblasserdam E3"},null,null,null,null,null,null,2,"--",1,null,3,null,0]
[null,null,null,"18:20:00",null,null,{"$f":"$B$9","v":"Alblasserdam E1"},null,null,null,null,null,"--",{"$f":"$B$8","v":"Jodan Boys E2"},null,null,null,null,null,null,0,"--",4,null,0,null,3,null,"18:20:00",null,null,{"$f":"$P$9","v":"VV GZ E3"},null,null,null,null,null,"--",{"$f":"$P$8","v":"RKDEO E3"},null,null,null,null,null,null,0,"--",4,null,0,null,3]
[]
[null,null,null,"Tijd",null,null,"VELD C",null,null,null,null,null,null,null,null,null,null,null,null,null,"Uitslag",null,null,null,"Punten",null,null,null,"Tijd",null,null,"VELD D",null,null,null,null,null,null,null,null,null,null,null,null,null,"Uitslag",null,null,null,"Punten"]
[null,null,null,"12:30:00",null,null,{"$f":"$AE$10","v":"Jodan Boys E6"},null,null,null,null,null,"--",{"$f":"$AE$11","v":"Bergambacht E5"},null,null,null,null,null,null,1,"--",2,null,{"$f":"IF(U31=\"\",\"\",IF(U31>W31,3,IF(U31=W31,1,0)))","v":0},null,{"$f":"IF(W31=\"\",\"\",IF(W31>U31,3,IF(W31=U31,1,0)))","v":3},null,"12:30:00",null,null,{"$f":"$AS$10","v":"Smitshoek E10"},null,null,null,null,null,"--",{"$f":"$AS$11","v":"Bergambacht E7"},null,null,null,null,null,null,1,"--",2,null,{"$f":"IF(AT31=\"\",\"\",IF(AT31>AV31,3,IF(AT31=AV31,1,0)))","v":0},null,{"$f":"IF(AV31=\"\",\"\",IF(AV31>AT31,3,IF(AV31=AT31,1,0)))","v":3}]
[null,null,null,"12:55:00",null,null,{"$f":"$AE$6","v":"Schoonhoven E5"},null,null,null,null,null,"--",{"$f":"$AE$9","v":"scVictorie'04 E3"},null,null,null,null,null,null,2,"--",1,null,{"$f":"IF(U32=\"\",\"\",IF(U32>W32,3,IF(U32=W32,1,0)))","v":3},null,{"$f":"IF(W32=\"\",\"\",IF(W32>U32,3,IF(W32=U32,1,0)))","v":0},null,"12:55:00",null,null,{"$f":"$AS$6","v":"Schoonhoven E7"},null,null,null,null,null,"--",{"$f":"$AS$9","v":"Jodan Boys E8"},null,null,null,null,null,null,2,"--",1,null,{"$f":"IF(AT32=\"\",\"\",IF(AT32>AV32,3,IF(AT32=AV32,1,0)))","v":3},null,{"$f":"IF(AV32=\"\",\"\",IF(AV32>AT32,3,IF(AV32=AT32,1,0)))","v":0}]
[null,null,null,"13:20:00",null,null,{"$f":"$AE$7","v":"Schoonhoven E6"},null,null,null,null,null,"--",{"$f":"$AE$8","v":"RKDEO E9"},null,null,null,null,null,null,1,"--",2,null,{"$f":"IF(U33=\"\",\"\",IF(U33>W33,3,IF(U33=W33,1,0)))","v":0},null,3,null,"13:20:00",null,null,{"$f":"$AS$7","v":"Schoonhoven E8"},null,null,null,null,null,"--",{"$f":"$AS$8","v":"VFC Vlaardingen E8"},null,null,null,null,null,null,1,"--",2,null,{"$f":"IF(AT33=\"\",\"\",IF(AT33>AV33,3,IF(AT33=AV33,1,0)))","v":0},null,3]
[null,null,null,"13:45:00",null,null,{"$f":"$AE$10","v":"Jodan Boys E6"},null,null,null,null,null,"--",{"$f":"$AE$9","v":"scVictorie'04 E3"},null,null,null,null,null,null,3,"--",1,null,3,null,0,null,"13:45:00",null,null,{"$f":"$AS$10","v":"Smitshoek E10"},null,null,null,null,null,"--",{"$f":"$AS$9","v":"Jodan Boys E8"},null,null,null,null,null,null,3,"--",1,null,3,null,0]
[null,null,null,"14:10:00",null,null,{"$f":"$AE$8","v":"RKDEO E9"},null,null,null,null,null,"--",{"$f":"$AE$6","v":"Schoonhoven E5"},null,null,null,null,null,null,1,"--",6,null,0,null,3,null,"14:10:00",null,null,{"$f":"$AS$8","v":"VFC Vlaardingen E8"},null,null,null,null,null,"--",{"$f":"$AS$6","v":"Schoonhoven E7"},null,null,null,null,null,null,1,"--",6,null,0,null,3]
[null,null,null,"14:35:00",null,null,{"$f":"$AE$9","v":"scVictorie'04 E3"},null,null,null,null,null,"--",{"$f":"$AE$11","v":"Bergambacht E5"},null,null,null,null,null,null,2,"--",2,null,1,null,1,null,"14:35:00",null,null,{"$f":"$AS$9","v":"Jodan Boys E8"},null,null,null,null,null,"--",{"$f":"$AS$11","v":"Bergambacht E7"},null,null,null,null,null,null,2,"--",2,null,1,null,1]
[null,null,null,"15:00:00",null,null,{"$f":"$AE$6","v":"Schoonhoven E5"},null,null,null,null,null,"--",{"$f":"$AE$7","v":"Schoonhoven E6"},null,null,null,null,null,null,3,"--",1,null,3,null,0,null,"15:00:00",null,null,{"$f":"$AS$6","v":"Schoonhoven E7"},null,null,null,null,null,"--",{"$f":"$AS$7","v":"Schoonhoven E8"},null,null,null,null,null,null,3,"--",1,null,3,null,0]
[null,null,null,"15:25:00",null,null,{"$f":"$AE$11","v":"Bergambacht E5"},null,null,null,null,null,"--",{"$f":"$AE$7","v":"Schoonhoven E6"},null,null,null,null,null,null,1,"--",1,null,1,null,1,null,"15:25:00",null,null,{"$f":"$AS$11","v":"Bergambacht E7"},null,null,null,null,null,"--",{"$f":"$AS$7","v":"Schoonhoven E8"},null,null,null,null,null,null,1,"--",1,null,1,null,1]
[null,null,null,"15:50:00",null,null,{"$f":"$AE$8","v":"RKDEO E9"},null,null,null,null,null,"--",{"$f":"$AE$10","v":"Jodan Boys E6"},null,null,null,null,null,null,1,"--",0,null,3,null,0,null,"15:50:00",null,null,{"$f":"$AS$8","v":"VFC Vlaardingen E8"},null,null,null,null,null,"--",{"$f":"$AS$10","v":"Smitshoek E10"},null,null,null,null,null,null,1,"--",0,null,3,null,0]
[null,null,null,"16:15:00",null,null,{"$f":"$AE$7","v":"Schoonhoven E6"},null,null,null,null,null,"--",{"$f":"$AE$9","v":"scVictorie'04 E3"},null,null,null,null,null,null,0,"--",2,null,0,null,3,null,"16:15:00",null,null,{"$f":"$AS$7","v":"Schoonhoven E8"},null,null,null,null,null,"--",{"$f":"$AS$9","v":"Jodan Boys E8"},null,null,null,null,null,null,0,"--",2,null,0,null,3]
[null,null,null,"16:40:00",null,null,{"$f":"$AE$8","v":"RKDEO E9"},null,null,null,null,null,"--",{"$f":"$AE$11","v":"Bergambacht E5"},null,null,null,null,null,null,0,"--",1,null,0,null,3,null,"16:40:00",null,null,{"$f":"$AS$8","v":"VFC Vlaardingen E8"},null,null,null,null,null,"--",{"$f":"$AS$11","v":"Bergambacht E7"},null,null,null,null,null,null,0,"--",1,null,0,null,3]
[null,null,null,"17:05:00",null,null,{"$f":"$AE$11","v":"Bergambacht E5"},null,null,null,null,null,"--",{"$f":"$AE$6","v":"Schoonhoven E5"},null,null,null,null,null,null,1,"--",3,null,0,null,3,null,"17:05:00",null,null,{"$f":"$AS$11","v":"Bergambacht E7"},null,null,null,null,null,"--",{"$f":"$AS$6","v":"Schoonhoven E7"},null,null,null,null,null,null,1,"--",3,null,0,null,3]
[null,null,null,"17:30:00",null,null,{"$f":"$AE$10","v":"Jodan Boys E6"},null,null,null,null,null,"--",{"$f":"$AE$7","v":"Schoonhoven E6"},null,null,null,null,null,null,3,"--",3,null,1,null,1,null,"17:30:00",null,null,{"$f":"$AS$10","v":"Smitshoek E10"},null,null,null,null,null,"--",{"$f":"$AS$7","v":"Schoonhoven E8"},null,null,null,null,null,null,3,"--",3,null,1,null,1]
[null,null,null,"17:55:00",null,null,{"$f":"$AE$6","v":"Schoonhoven E5"},null,null,null,null,null,"--",{"$f":"$AE$10","v":"Jodan Boys E6"},null,null,null,null,null,null,2,"--",1,null,3,null,0,null,"17:55:00",null,null,{"$f":"$AS$6","v":"Schoonhoven E7"},null,null,null,null,null,"--",{"$f":"$AS$10","v":"Smitshoek E10"},null,null,null,null,null,null,2,"--",1,null,3,null,0]
[null,null,null,"18:20:00",null,null,{"$f":"$AE$9","v":"scVictorie'04 E3"},null,null,null,null,null,"--",{"$f":"$AE$8","v":"RKDEO E9"},null,null,null,null,null,null,0,"--",4,null,0,null,3,null,"18:20:00",null,null,{"$f":"$AS$9","v":"Jodan Boys E8"},null,null,null,null,null,"--",{"$f":"$AS$8","v":"VFC Vlaardingen E8"},null,null,null,null,null,null,0,"--",4,null,0,null,3]

{"sheet":"E jeugd finaleronde","index":1,"n_rows":21,"n_cols":57,"rows_kept":21,"cut":false,"hidden":false,"merged":[[11,24,11,27],[11,19,11,22],[11,8,11,11],[11,3,11,6],[18,12,18,18],[16,11,16,14],[16,16,16,19],[15,16,15,19],[15,11,15,14],[13,3,13,27],[0,3,0,27],[8,3,8,27],[10,0,10,1],[10,24,10,27],[10,19,10,22],[10,8,10,11],[10,3,10,6],[6,24,6,27],[5,24,5,27],[5,19,5,22],[10,16,10,17],[6,19,6,22],[5,3,5,6],[2,16,2,17],[2,19,2,22],[5,8,5,11],[2,24,2,27],[3,3,3,6],[3,8,3,11],[3,24,3,27],[3,19,3,22],[20,12,22,18],[2,0,2,1],[2,3,2,6],[2,8,2,11],[5,0,5,1],[15,7,15,8],[5,16,5,17],[6,3,6,6],[6,8,6,11]]}
[null,null,null,"Kwartfinale",null,null,null,null,null,null,null,null,null,null,null,null,null,null,null,null,null,null,null,null,null,null,null,null,null,null,null,null,null,null,null,null,null,null,null,null,null,null,null,null,null,null,null,null,{"$f":"'E jeugd voorronde'!AY1","v":30},{"$f":"'E jeugd voorronde'!BJ1","v":1},{"$f":"'E jeugd voorronde'!BK1","v":"Schoonhoven E1"},{"$f":"'E jeugd voorronde'!BL1","v":1},{"$f":"'E jeugd voorronde'!BM1","v":"Schoonhoven E3"},{"$f":"'E jeugd voorronde'!BN1","v":1},{"$f":"'E jeugd voorronde'!BO1","v":"Schoonhoven E5"},{"$f":"'E jeugd voorronde'!BP1","v":1},{"$f":"'E jeugd voorronde'!BQ1","v":"Schoonhoven E7"}]
[null,null,null,null,null,null,null,null,null,null,null,null,null,null,null,null,null,null,null,null,null,null,null,null,null,null,null,null,null,null,null,null,null,null,null,null,null,null,null,null,null,null,null,null,null,null,null,null,{"$f":"'E jeugd voorronde'!AZ1","v":30},{"$f":"'E jeugd voorronde'!BJ2","v":5},{"$f":"'E jeugd voorronde'!BK2","v":"Schoonhoven E2"},{"$f":"'E jeugd voorronde'!BL2","v":5},{"$f":"'E jeugd voorronde'!BM2","v":"Schoonhoven E4"},{"$f":"'E jeugd voorronde'!BN2","v":5},{"$f":"'E jeugd voorronde'!BO2","v":"Schoonhoven E6"},{"$f":"'E jeugd voorronde'!BP2","v":5},{"$f":"'E jeugd voorronde'!BQ2","v":"Schoonhoven E8"}]
["16:30:00",null,"A","Nr 1 groep 1",null,null,null,null,"Nr 2 groep 3",null,null,null,null,null,null,null,"16:30:00",null,"B","Nr 1 groep 2",null,null,null,null,"Nr 2 groep 4",null,null,null,null,null,null,null,null,null,null,null,null,null,null,null,null,null,null,null,null,null,null,null,{"$f":"'E jeugd voorronde'!BA1","v":30},{"$f":"'E jeugd voorronde'!BJ3","v":2},{"$f":"'E jeugd voorronde'!BK3","v":"Jodan Boys E2"},{"$f":"'E jeugd voorronde'!BL3","v":2},{"$f":"'E jeugd voorronde'!BM3","v":"RKDEO E3"},{"$f":"'E jeugd voorronde'!BN3","v":2},{"$f":"'E jeugd voorronde'!BO3","v":"RKDEO E9"},{"$f":"'E jeugd voorronde'!BP3","v":2},{"$f":"'E jeugd voorronde'!BQ3","v":"VFC Vlaardingen E8"}]
[null,null,null,{"$f":"IF(AW1=30,VLOOKUP(1,AX1:AY5,2,0),\"\")","v":"Schoonhoven E1"},null,null,null,"--",{"$f":"IF(AW3=30,VLOOKUP(2,BB1:BC5,2,0),\"\")","v":"RKDEO E9"},null,null,null,null,null,"-",null,null,null,null,{"$f":"IF(AW2=30,VLOOKUP(1,AZ1:BA5,2,0),\"\")","v":"Schoonhoven E3"},null,null,null,"--",{"$f":"IF(AW4=30,VLOOKUP(2,BD1:BE5,2,0),\"\")","v":"VFC Vlaardingen E8"},null,null,null,null,null,"-",null,null,null,null,null,null,null,null,null,null,null,null,null,null,null,null,null,{"$f":"'E jeugd voorronde'!BB1","v":30},{"$f":"'E jeugd voorronde'!BJ4","v":4},{"$f":"'E jeugd voorronde'!BK4","v":"Alblasserdam E1"},{"$f":"'E jeugd voorronde'!BL4","v":4},{"$f":"'E jeugd voorronde'!BM4","v":"VV GZ E3"},{"$f":"'E jeugd voorronde'!BN4","v":4},{"$f":"'E jeugd voorronde'!BO4","v":"scVictorie'04 E3"},{"$f":"'E jeugd voorronde'!BP4","v":4},{"$f":"'E jeugd voorronde'!BQ4","v":"Jodan Boys E8"}]
[null,null,null,null,null,null,null,null,null,null,null,null,null,null,null,null,null,null,null,null,null,null,null,null,null,null,null,null,null,null,null,null,null,null,null,null,null,null,null,null,null,null,null,null,null,null,null,null,null,{"$f":"'E jeugd voorronde'!BJ5","v":3},{"$f":"'E jeugd voorronde'!BK5","v":"Excelcior ??"},{"$f":"'E jeugd voorronde'!BL5","v":3},{"$f":"'E jeugd voorronde'!BM5","v":"Alblasserdam E3"},{"$f":"'E jeugd voorronde'!BN5","v":3},{"$f":"'E jeugd voorronde'!BO5","v":"Jodan Boys E6"},{"$f":"'E jeugd voorronde'!BP5","v":3},{"$f":"'E jeugd voorronde'!BQ5","v":"Smitshoek E10"}]
["16:30:00",null,"C","Nr 1 groep 3",null,null,null,null,"Nr 2 groep 2",null,null,null,null,null,null,null,"16:30:00",null,"D","Nr 1 groep 4 ",null,null,null,null,"Nr 2 groep 1"]
[null,null,null,{"$f":"IF(AW3=30,VLOOKUP(1,BB1:BC5,2,0),\"\")","v":"Schoonhoven E5"},null,null,null,null,{"$f":"IF(AW2=30,VLOOKUP(2,AZ1:BA5,2,0),\"\")","v":"RKDEO E3"},null,null,null,null,null,"-",null,null,null,null,{"$f":"IF(AW4=30,VLOOKUP(1,BD1:BE5,2,0),\"\")","v":"Schoonhoven E7"},null,null,null,null,{"$f":"IF(AW1=30,VLOOKUP(2,AX1:AY5,2,0),\"\")","v":"Jodan Boys E2"},null,null,null,null,null,"-"]
[]
[null,null,null,"Halve finale"]
[]
["16:45:00",null,"E","Winnaar A",null,null,null,null,"Winnaar B",null,null,null,null,null,null,null,"16:45:00",null,"F","Winnaar C",null,null,null,null,"Winnaar D"]
[null,null,null,{"$f":"IF(N4=\"\",\"\",IF(N4>P4,D4,I4))","v":""},null,null,null,null,{"$f":"IF(AD4=\"\",\"\",IF(AD4>AF4,T4,Y4))","v":""},null,null,null,null,null,"-",null,null,null,null,{"$f":"IF(N7=\"\",\"\",IF(N7>P7,D7,I7))","v":""},null,null,null,null,{"$f":"IF(AD7=\"\",\"\",IF(AD7>AF7,T7,Y7))","v":""},null,null,null,null,null,"-"]
[]
[null,null,null,"Finale"]
[]
[null,null,null,null,null,null,null,"17:05:00",null,null,null,"Winnaar E",null,null,null,null,"Winnaar F"]
[null,null,null,null,null,null,null,null,null,null,null,{"$f":"IF(N12=\"\",\"\",IF(N12>P12,D12,I12))","v":""},null,null,null,null,{"$f":"IF(AD12=\"\",\"\",IF(AD12>AF12,T12,Y12))","v":""},null,null,null,null,1,"-",2]
[]
[null,null,null,null,null,null,null,null,null,null,null,null,"Winnaar E-toernooi"]
[]
[null,null,null,null,null,null,null,null,null,null,null,null,{"$f":"IF(V17=\"\",\"\",IF(V17>X17,L17,Q17))","v":""}]

{"sheet":"E-GROEP-1","index":2,"n_rows":30,"n_cols":15,"rows_kept":30,"cut":false,"hidden":false,"merged":[[0,14,2,15],[0,0,2,13],[25,1,25,6],[26,1,26,6],[27,1,27,6],[21,0,23,0],[10,5,10,6],[11,2,11,3],[11,5,11,6],[3,0,3,1],[3,2,3,6],[3,7,3,9],[7,2,7,3],[7,5,7,6],[6,0,6,1],[7,0,7,1],[28,1,28,6],[3,11,3,13],[21,1,23,6],[21,7,23,7],[21,8,23,8],[21,9,23,9],[21,11,23,11],[21,12,23,12],[21,13,23,13],[24,1,24,6],[12,2,12,3],[12,5,12,6],[21,10,23,10],[9,2,9,3],[9,5,9,6],[10,2,10,3],[4,0,4,1],[5,0,5,1],[5,2,5,3],[4,2,4,3],[4,5,4,6],[5,5,5,6],[8,0,8,1],[9,0,9,1],[6,2,6,3],[6,5,6,6],[8,2,8,3],[8,5,8,6],[13,2,13,3],[13,5,13,6],[13,0,13,1],[10,0,10,1],[11,0,11,1],[12,0,12,1],[29,1,29,6],[14,0,14,1],[14,2,14,3],[14,5,14,6],[15,0,15,1],[15,2,15,3],[15,5,15,6],[16,0,16,1],[16,2,16,3],[16,5,16,6],[17,0,17,1],[17,2,17,3],[17,5,17,6],[18,0,18,1],[18,2,18,3],[18,5,18,6]]}
["SCHOONHOVEN TOERNOOI",null,null,null,null,null,null,null,null,null,null,null,null,null,"SCORES BY:\nOnlineExcelCursus.NL\nMichael van den Dool"]
[]
[]
[{"$f":"'E jeugd voorronde'!D13","v":"Tijd"},{"$f":"'E jeugd voorronde'!E13","v":0},{"$f":"'E jeugd voorronde'!G13","v":"VELD A"},null,null,null,null,{"$f":"'E jeugd voorronde'!U13","v":"Uitslag"},null,null,null,{"$f":"'E jeugd voorronde'!Y13","v":"Punten"}]
[{"$f":"'E jeugd voorronde'!D14","v":"12:30:00"},{"$f":"'E jeugd voorronde'!E14","v":"00:00:00"},{"$f":"'E jeugd voorronde'!G14","v":"Excelcior ??"},{"$f":"'E jeugd voorronde'!H14","v":0},{"$f":"'E jeugd voorronde'!M14","v":"--"},{"$f":"'E jeugd voorronde'!N14","v":"Bergambacht E1"},{"$f":"'E jeugd voorronde'!O14","v":0},{"$f":"'E jeugd voorronde'!U14","v":1},{"$f":"'E jeugd voorronde'!V14","v":"--"},{"$f":"'E jeugd voorronde'!W14","v":2},null,{"$f":"'E jeugd voorronde'!Y14","v":0},null,{"$f":"'E jeugd voorronde'!AA14","v":3}]
[{"$f":"'E jeugd voorronde'!D15","v":"12:55:00"},{"$f":"'E jeugd voorronde'!E15","v":"00:00:00"},{"$f":"'E jeugd voorronde'!G15","v":"Schoonhoven E1"},{"$f":"'E jeugd voorronde'!H15","v":0},{"$f":"'E jeugd voorronde'!M15","v":"--"},{"$f":"'E jeugd voorronde'!N15","v":"Alblasserdam E1"},{"$f":"'E jeugd voorronde'!O15","v":0},{"$f":"'E jeugd voorronde'!U15","v":2},{"$f":"'E jeugd voorronde'!V15","v":"--"},{"$f":"'E jeugd voorronde'!W15","v":1},null,{"$f":"'E jeugd voorronde'!Y15","v":3},null,{"$f":"'E jeugd voorronde'!AA15","v":0}]
[{"$f":"'E jeugd voorronde'!D16","v":"13:20:00"},{"$f":"'E jeugd voorronde'!E16","v":"00:00:00"},{"$f":"'E jeugd voorronde'!G16","v":"Schoonhoven E2"},{"$f":"'E jeugd voorronde'!H16","v":0},{"$f":"'E jeugd voorronde'!M16","v":"--"},{"$f":"'E jeugd voorronde'!N16","v":"Jodan Boys E2"},{"$f":"'E jeugd voorronde'!O16","v":0},{"$f":"'E jeugd voorronde'!U16","v":1},{"$f":"'E jeugd voorronde'!V16","v":"--"},{"$f":"'E jeugd voorronde'!W16","v":2},null,{"$f":"'E jeugd voorronde'!Y16","v":0},null,{"$f":"'E jeugd voorronde'!AA16","v":3}]
[{"$f":"'E jeugd voorronde'!D17","v":"13:45:00"},{"$f":"'E jeugd voorronde'!E17","v":"00:00:00"},{"$f":"'E jeugd voorronde'!G17","v":"Excelcior ??"},{"$f":"'E jeugd voorronde'!H17","v":0},{"$f":"'E jeugd voorronde'!M17","v":"--"},{"$f":"'E jeugd voorronde'!N17","v":"Alblasserdam E1"},{"$f":"'E jeugd voorronde'!O17","v":0},{"$f":"'E jeugd voorronde'!U17","v":3},{"$f":"'E jeugd voorronde'!V17","v":"--"},{"$f":"'E jeugd voorronde'!W17","v":1},null,{"$f":"'E jeugd voorronde'!Y17","v":3},null,{"$f":"'E jeugd voorronde'!AA17","v":0}]
[{"$f":"'E jeugd voorronde'!D18","v":"14:10:00"},{"$f":"'E jeugd voorronde'!E18","v":"00:00:00"},{"$f":"'E jeugd voorronde'!G18","v":"Jodan Boys E2"},{"$f":"'E jeugd voorronde'!H18","v":0},{"$f":"'E jeugd voorronde'!M18","v":"--"},{"$f":"'E jeugd voorronde'!N18","v":"Schoonhoven E1"},{"$f":"'E jeugd voorronde'!O18","v":0},{"$f":"'E jeugd voorronde'!U18","v":1},{"$f":"'E jeugd voorronde'!V18","v":"--"},{"$f":"'E jeugd voorronde'!W18","v":6},null,{"$f":"'E jeugd voorronde'!Y18","v":0},null,{"$f":"'E jeugd voorronde'!AA18","v":3}]
[{"$f":"'E jeugd voorronde'!D19","v":"14:35:00"},{"$f":"'E jeugd voorronde'!E19","v":"00:00:00"},{"$f":"'E jeugd voorronde'!G19","v":"Alblasserdam E1"},{"$f":"'E jeugd voorronde'!H19","v":0},{"$f":"'E jeugd voorronde'!M19","v":"--"},{"$f":"'E jeugd voorronde'!N19","v":"Bergambacht E1"},{"$f":"'E jeugd voorronde'!O19","v":0},{"$f":"'E jeugd voorronde'!U19","v":2},{"$f":"'E jeugd voorronde'!V19","v":"--"},{"$f":"'E jeugd voorronde'!W19","v":2},null,{"$f":"'E jeugd voorronde'!Y19","v":1},null,{"$f":"'E jeugd voorronde'!AA19","v":1}]
[{"$f":"'E jeugd voorronde'!D20","v":"15:00:00"},{"$f":"'E jeugd voorronde'!E20","v":"00:00:00"},{"$f":"'E jeugd voorronde'!G20","v":"Schoonhoven E1"},{"$f":"'E jeugd voorronde'!H20","v":0},{"$f":"'E jeugd voorronde'!M20","v":"--"},{"$f":"'E jeugd voorronde'!N20","v":"Schoonhoven E2"},{"$f":"'E jeugd voorronde'!O20","v":0},{"$f":"'E jeugd voorronde'!U20","v":3},{"$f":"'E jeugd voorronde'!V20","v":"--"},{"$f":"'E jeugd voorronde'!W20","v":1},null,{"$f":"'E jeugd voorronde'!Y20","v":3},null,{"$f":"'E jeugd voorronde'!AA20","v":0}]
[{"$f":"'E jeugd voorronde'!D21","v":"15:25:00"},{"$f":"'E jeugd voorronde'!E21","v":"00:00:00"},{"$f":"'E jeugd voorronde'!G21","v":"Bergambacht E1"},{"$f":"'E jeugd voorronde'!H21","v":0},{"$f":"'E jeugd voorronde'!M21","v":"--"},{"$f":"'E jeugd voorronde'!N21","v":"Schoonhoven E2"},{"$f":"'E jeugd voorronde'!O21","v":0},{"$f":"'E jeugd voorronde'!U21","v":1},{"$f":"'E jeugd voorronde'!V21","v":"--"},{"$f":"'E jeugd voorronde'!W21","v":1},null,{"$f":"'E jeugd voorronde'!Y21","v":1},null,{"$f":"'E jeugd voorronde'!AA21","v":1}]
[{"$f":"'E jeugd voorronde'!D22","v":"15:50:00"},{"$f":"'E jeugd voorronde'!E22","v":"00:00:00"},{"$f":"'E jeugd voorronde'!G22","v":"Jodan Boys E2"},{"$f":"'E jeugd voorronde'!H22","v":0},{"$f":"'E jeugd voorronde'!M22","v":"--"},{"$f":"'E jeugd voorronde'!N22","v":"Excelcior ??"},{"$f":"'E jeugd voorronde'!O22","v":0},{"$f":"'E jeugd voorronde'!U22","v":1},{"$f":"'E jeugd voorronde'!V22","v":"--"},{"$f":"'E jeugd voorronde'!W22","v":0},null,{"$f":"'E jeugd voorronde'!Y22","v":3},null,{"$f":"'E jeugd voorronde'!AA22","v":0}]
[{"$f":"'E jeugd voorronde'!D23","v":"16:15:00"},{"$f":"'E jeugd voorronde'!E23","v":"00:00:00"},{"$f":"'E jeugd voorronde'!G23","v":"Schoonhoven E2"},{"$f":"'E jeugd voorronde'!H23","v":0},{"$f":"'E jeugd voorronde'!M23","v":"--"},{"$f":"'E jeugd voorronde'!N23","v":"Alblasserdam E1"},{"$f":"'E jeugd voorronde'!O23","v":0},{"$f":"'E jeugd voorronde'!U23","v":0},{"$f":"'E jeugd voorronde'!V23","v":"--"},{"$f":"'E jeugd voorronde'!W23","v":2},null,{"$f":"'E jeugd voorronde'!Y23","v":0},null,{"$f":"'E jeugd voorronde'!AA23","v":3}]
[{"$f":"'E jeugd voorronde'!D24","v":"16:40:00"},{"$f":"'E jeugd voorronde'!E24","v":"00:00:00"},{"$f":"'E jeugd voorronde'!G24","v":"Jodan Boys E2"},{"$f":"'E jeugd voorronde'!H24","v":0},{"$f":"'E jeugd voorronde'!M24","v":"--"},{"$f":"'E jeugd voorronde'!N24","v":"Bergambacht E1"},{"$f":"'E jeugd voorronde'!O24","v":0},{"$f":"'E jeugd voorronde'!U24","v":0},{"$f":"'E jeugd voorronde'!V24","v":"--"},{"$f":"'E jeugd voorronde'!W24","v":1},null,{"$f":"'E jeugd voorronde'!Y24","v":0},null,{"$f":"'E jeugd voorronde'!AA24","v":3}]
[{"$f":"'E jeugd voorronde'!D25","v":"17:05:00"},{"$f":"'E jeugd voorronde'!E25","v":"00:00:00"},{"$f":"'E jeugd voorronde'!G25","v":"Bergambacht E1"},{"$f":"'E jeugd voorronde'!H25","v":0},{"$f":"'E jeugd voorronde'!M25","v":"--"},{"$f":"'E jeugd voorronde'!N25","v":"Schoonhoven E1"},{"$f":"'E jeugd voorronde'!O25","v":0},{"$f":"'E jeugd voorronde'!U25","v":1},{"$f":"'E jeugd voorronde'!V25","v":"--"},{"$f":"'E jeugd voorronde'!W25","v":3},null,{"$f":"'E jeugd voorronde'!Y25","v":0},null,{"$f":"'E jeugd voorronde'!AA25","v":3}]
[{"$f":"'E jeugd voorronde'!D26","v":"17:30:00"},{"$f":"'E jeugd voorronde'!E26","v":"00:00:00"},{"$f":"'E jeugd voorronde'!G26","v":"Excelcior ??"},{"$f":"'E jeugd voorronde'!H26","v":0},{"$f":"'E jeugd voorronde'!M26","v":"--"},{"$f":"'E jeugd voorronde'!N26","v":"Schoonhoven E2"},{"$f":"'E jeugd voorronde'!O26","v":0},{"$f":"'E jeugd voorronde'!U26","v":3},{"$f":"'E jeugd voorronde'!V26","v":"--"},{"$f":"'E jeugd voorronde'!W26","v":3},null,{"$f":"'E jeugd voorronde'!Y26","v":1},null,{"$f":"'E jeugd voorronde'!AA26","v":1}]
[{"$f":"'E jeugd voorronde'!D27","v":"17:55:00"},{"$f":"'E jeugd voorronde'!E27","v":"00:00:00"},{"$f":"'E jeugd voorronde'!G27","v":"Schoonhoven E1"},{"$f":"'E jeugd voorronde'!H27","v":0},{"$f":"'E jeugd voorronde'!M27","v":"--"},{"$f":"'E jeugd voorronde'!N27","v":"Excelcior ??"},{"$f":"'E jeugd voorronde'!O27","v":0},{"$f":"'E jeugd voorronde'!U27","v":2},{"$f":"'E jeugd voorronde'!V27","v":"--"},{"$f":"'E jeugd voorronde'!W27","v":1},null,{"$f":"'E jeugd voorronde'!Y27","v":3},null,{"$f":"'E jeugd voorronde'!AA27","v":0}]
[{"$f":"'E jeugd voorronde'!D28","v":"18:20:00"},{"$f":"'E jeugd voorronde'!E28","v":"00:00:00"},{"$f":"'E jeugd voorronde'!G28","v":"Alblasserdam E1"},{"$f":"'E jeugd voorronde'!H28","v":0},{"$f":"'E jeugd voorronde'!M28","v":"--"},{"$f":"'E jeugd voorronde'!N28","v":"Jodan Boys E2"},{"$f":"'E jeugd voorronde'!O28","v":0},{"$f":"'E jeugd voorronde'!U28","v":0},{"$f":"'E jeugd voorronde'!V28","v":"--"},{"$f":"'E jeugd voorronde'!W28","v":4},null,{"$f":"'E jeugd voorronde'!Y28","v":0},null,{"$f":"'E jeugd voorronde'!AA28","v":3}]
[]
[]
[{"$f":"'E jeugd voorronde'!A3","v":"Stand"},{"$f":"'E jeugd voorronde'!B5","v":"Groep 1"},null,null,null,null,null,{"$f":"'E jeugd voorronde'!H5","v":"V"},{"$f":"'E jeugd voorronde'!I5","v":"T"},{"$f":"'E jeugd voorronde'!J5","v":"P"},{"$f":"'E jeugd voorronde'!K3","v":"Gewonnen"},{"$f":"'E jeugd voorronde'!L3","v":"Gelijk"},{"$f":"'E jeugd voorronde'!M3","v":"Verloren"},{"$f":"'E jeugd voorronde'!N3","v":"Saldo"}]
[{"$f":"'E jeugd voorronde'!A4","v":0},null,null,null,null,null,null,null,null,null,{"$f":"'E jeugd voorronde'!K4","v":0},{"$f":"'E jeugd voorronde'!L4","v":0},{"$f":"'E jeugd voorronde'!M4","v":0},{"$f":"'E jeugd voorronde'!N4","v":0}]
[{"$f":"'E jeugd voorronde'!A5","v":0},null,null,null,null,null,null,null,null,null,{"$f":"'E jeugd voorronde'!K5","v":0},{"$f":"'E jeugd voorronde'!L5","v":0},{"$f":"'E jeugd voorronde'!M5","v":0},{"$f":"'E jeugd voorronde'!N5","v":0}]
[{"$f":"'E jeugd voorronde'!A6","v":1},{"$f":"'E jeugd voorronde'!B6","v":"Schoonhoven E1"},{"$f":"'E jeugd voorronde'!C6","v":0},{"$f":"'E jeugd voorronde'!D6","v":0},{"$f":"'E jeugd voorronde'!E6","v":0},{"$f":"'E jeugd voorronde'!F6","v":0},{"$f":"'E jeugd voorronde'!G6","v":0},{"$f":"'E jeugd voorronde'!H6","v":16},{"$f":"'E jeugd voorronde'!I6","v":5},{"$f":"'E jeugd voorronde'!J6","v":15.010999999999999},{"$f":"'E jeugd voorronde'!K6","v":5},{"$f":"'E jeugd voorronde'!L6","v":0},{"$f":"'E jeugd voorronde'!M6","v":0},{"$f":"'E jeugd voorronde'!N6","v":11}]
[{"$f":"'E jeugd voorronde'!A7","v":5},{"$f":"'E jeugd voorronde'!B7","v":"Schoonhoven E2"},{"$f":"'E jeugd voorronde'!C7","v":0},{"$f":"'E jeugd voorronde'!D7","v":0},{"$f":"'E jeugd voorronde'!E7","v":0},{"$f":"'E jeugd voorronde'!F7","v":0},{"$f":"'E jeugd voorronde'!G7","v":0},{"$f":"'E jeugd voorronde'!H7","v":6},{"$f":"'E jeugd voorronde'!I7","v":11},{"$f":"'E jeugd voorronde'!J7","v":1.9949999999999999},{"$f":"'E jeugd voorronde'!K7","v":0},{"$f":"'E jeugd voorronde'!L7","v":2},{"$f":"'E jeugd voorronde'!M7","v":3},{"$f":"'E jeugd voorronde'!N7","v":-5}]
[{"$f":"'E jeugd voorronde'!A8","v":2},{"$f":"'E jeugd voorronde'!B8","v":"Jodan Boys E2"},{"$f":"'E jeugd voorronde'!C8","v":0},{"$f":"'E jeugd voorronde'!D8","v":0},{"$f":"'E jeugd voorronde'!E8","v":0},{"$f":"'E jeugd voorronde'!F8","v":0},{"$f":"'E jeugd voorronde'!G8","v":0},{"$f":"'E jeugd voorronde'!H8","v":8},{"$f":"'E jeugd voorronde'!I8","v":8},{"$f":"'E jeugd voorronde'!J8","v":9},{"$f":"'E jeugd voorronde'!K8","v":3},{"$f":"'E jeugd voorronde'!L8","v":0},{"$f":"'E jeugd voorronde'!M8","v":2},{"$f":"'E jeugd voorronde'!N8","v":0}]
[{"$f":"'E jeugd voorronde'!A9","v":4},{"$f":"'E jeugd voorronde'!B9","v":"Alblasserdam E1"},{"$f":"'E jeugd voorronde'!C9","v":0},{"$f":"'E jeugd voorronde'!D9","v":0},{"$f":"'E jeugd voorronde'!E9","v":0},{"$f":"'E jeugd voorronde'!F9","v":0},{"$f":"'E jeugd voorronde'!G9","v":0},{"$f":"'E jeugd voorronde'!H9","v":6},{"$f":"'E jeugd voorronde'!I9","v":11},{"$f":"'E jeugd voorronde'!J9","v":3.9950000000000001},{"$f":"'E jeugd voorronde'!K9","v":1},{"$f":"'E jeugd voorronde'!L9","v":1},{"$f":"'E jeugd voorronde'!M9","v":3},{"$f":"'E jeugd voorronde'!N9","v":-5}]
[{"$f":"'E jeugd voorronde'!A10","v":3},{"$f":"'E jeugd voorronde'!B10","v":"Excelcior ??"},{"$f":"'E jeugd voorronde'!C10","v":0},{"$f":"'E jeugd voorronde'!D10","v":0},{"$f":"'E jeugd voorronde'!E10","v":0},{"$f":"'E jeugd voorronde'!F10","v":0},{"$f":"'E jeugd voorronde'!G10","v":0},{"$f":"'E jeugd voorronde'!H10","v":8},{"$f":"'E jeugd voorronde'!I10","v":9},{"$f":"'E jeugd voorronde'!J10","v":3.9990000000000001},{"$f":"'E jeugd voorronde'!K10","v":1},{"$f":"'E jeugd voorronde'!L10","v":1},{"$f":"'E jeugd voorronde'!M10","v":3},{"$f":"'E jeugd voorronde'!N10","v":-1}]
[{"$f":"'E jeugd voorronde'!A11","v":3},{"$f":"'E jeugd voorronde'!B11","v":"Bergambacht E1"},{"$f":"'E jeugd voorronde'!C11","v":0},{"$f":"'E jeugd voorronde'!D11","v":0},{"$f":"'E jeugd voorronde'!E11","v":0},{"$f":"'E jeugd voorronde'!F11","v":0},{"$f":"'E jeugd voorronde'!G11","v":0},{"$f":"'E jeugd voorronde'!H11","v":7},{"$f":"'E jeugd voorronde'!I11","v":7},{"$f":"'E jeugd voorronde'!J11","v":8},{"$f":"'E jeugd voorronde'!K11","v":2},{"$f":"'E jeugd voorronde'!L11","v":2},{"$f":"'E jeugd voorronde'!M11","v":1},{"$f":"'E jeugd voorronde'!N11","v":0}]

{"sheet":"E-GROEP-2","index":3,"n_rows":30,"n_cols":13,"rows_kept":30,"cut":false,"hidden":false,"merged":[[21,11,23,11],[0,12,2,13],[24,1,24,4],[25,1,25,4],[26,1,26,4],[0,0,2,11],[3,5,3,7],[3,9,3,11],[12,0,12,1],[13,0,13,1],[3,0,3,1],[3,2,3,4],[9,0,9,1],[10,0,10,1],[11,0,11,1],[6,0,6,1],[21,8,23,8],[21,9,23,9],[21,10,23,10],[21,7,23,7],[28,1,28,4],[21,1,23,4],[21,5,23,5],[21,6,23,6],[27,1,27,4],[7,0,7,1],[8,0,8,1],[4,0,4,1],[5,0,5,1],[21,0,23,0],[29,1,29,4],[14,0,14,1],[15,0,15,1],[16,0,16,1],[17,0,17,1],[18,0,18,1]]}
["SCHOONHOVEN TOERNOOI",null,null,null,null,null,null,null,null,null,null,null,"SCORES BY:\nOnlineExcelCursus.NL\nMichael van den Dool"]
[]
[]
[{"$f":"'E jeugd voorronde'!AC13","v":"Tijd"},null,{"$f":"'E jeugd voorronde'!AF13","v":"VELD B"},null,null,{"$f":"'E jeugd voorronde'!AT13","v":"Uitslag"},null,null,null,{"$f":"'E jeugd voorronde'!AX13","v":"Punten"}]
[{"$f":"'E jeugd voorronde'!AC14","v":"12:30:00"},{"$f":"'E jeugd voorronde'!AD14","v":"00:00:00"},{"$f":"'E jeugd voorronde'!AF14","v":"Alblasserdam E3"},{"$f":"'E jeugd voorronde'!AL14","v":"--"},{"$f":"'E jeugd voorronde'!AM14","v":"Bergambacht E3"},{"$f":"'E jeugd voorronde'!AT14","v":1},{"$f":"'E jeugd voorronde'!AU14","v":"--"},{"$f":"'E jeugd voorronde'!AV14","v":2},null,{"$f":"'E jeugd voorronde'!AX14","v":0},null,{"$f":"'E jeugd voorronde'!AZ14","v":3}]
[{"$f":"'E jeugd voorronde'!AC15","v":"12:55:00"},{"$f":"'E jeugd voorronde'!AD15","v":"00:00:00"},{"$f":"'E jeugd voorronde'!AF15","v":"Schoonhoven E3"},{"$f":"'E jeugd voorronde'!AL15","v":"--"},{"$f":"'E jeugd voorronde'!AM15","v":"VV GZ E3"},{"$f":"'E jeugd voorronde'!AT15","v":2},{"$f":"'E jeugd voorronde'!AU15","v":"--"},{"$f":"'E jeugd voorronde'!AV15","v":1},null,{"$f":"'E jeugd voorronde'!AX15","v":3},null,{"$f":"'E jeugd voorronde'!AZ15","v":0}]
[{"$f":"'E jeugd voorronde'!AC16","v":"13:20:00"},{"$f":"'E jeugd voorronde'!AD16","v":"00:00:00"},{"$f":"'E jeugd voorronde'!AF16","v":"Schoonhoven E4"},{"$f":"'E jeugd voorronde'!AL16","v":"--"},{"$f":"'E jeugd voorronde'!AM16","v":"RKDEO E3"},{"$f":"'E jeugd voorronde'!AT16","v":1},{"$f":"'E jeugd voorronde'!AU16","v":"--"},{"$f":"'E jeugd voorronde'!AV16","v":2},null,{"$f":"'E jeugd voorronde'!AX16","v":0},null,{"$f":"'E jeugd voorronde'!AZ16","v":3}]
[{"$f":"'E jeugd voorronde'!AC17","v":"13:45:00"},{"$f":"'E jeugd voorronde'!AD17","v":"00:00:00"},{"$f":"'E jeugd voorronde'!AF17","v":"Alblasserdam E3"},{"$f":"'E jeugd voorronde'!AL17","v":"--"},{"$f":"'E jeugd voorronde'!AM17","v":"VV GZ E3"},{"$f":"'E jeugd voorronde'!AT17","v":3},{"$f":"'E jeugd voorronde'!AU17","v":"--"},{"$f":"'E jeugd voorronde'!AV17","v":1},null,{"$f":"'E jeugd voorronde'!AX17","v":3},null,{"$f":"'E jeugd voorronde'!AZ17","v":0}]
[{"$f":"'E jeugd voorronde'!AC18","v":"14:10:00"},{"$f":"'E jeugd voorronde'!AD18","v":"00:00:00"},{"$f":"'E jeugd voorronde'!AF18","v":"RKDEO E3"},{"$f":"'E jeugd voorronde'!AL18","v":"--"},{"$f":"'E jeugd voorronde'!AM18","v":"Schoonhoven E3"},{"$f":"'E jeugd voorronde'!AT18","v":1},{"$f":"'E jeugd voorronde'!AU18","v":"--"},{"$f":"'E jeugd voorronde'!AV18","v":6},null,{"$f":"'E jeugd voorronde'!AX18","v":0},null,{"$f":"'E jeugd voorronde'!AZ18","v":3}]
[{"$f":"'E jeugd voorronde'!AC19","v":"14:35:00"},{"$f":"'E jeugd voorronde'!AD19","v":"00:00:00"},{"$f":"'E jeugd voorronde'!AF19","v":"VV GZ E3"},{"$f":"'E jeugd voorronde'!AL19","v":"--"},{"$f":"'E jeugd voorronde'!AM19","v":"Bergambacht E3"},{"$f":"'E jeugd voorronde'!AT19","v":2},{"$f":"'E jeugd voorronde'!AU19","v":"--"},{"$f":"'E jeugd voorronde'!AV19","v":2},null,{"$f":"'E jeugd voorronde'!AX19","v":1},null,{"$f":"'E jeugd voorronde'!AZ19","v":1}]
[{"$f":"'E jeugd voorronde'!AC20","v":"15:00:00"},{"$f":"'E jeugd voorronde'!AD20","v":"00:00:00"},{"$f":"'E jeugd voorronde'!AF20","v":"Schoonhoven E3"},{"$f":"'E jeugd voorronde'!AL20","v":"--"},{"$f":"'E jeugd voorronde'!AM20","v":"Schoonhoven E4"},{"$f":"'E jeugd voorronde'!AT20","v":3},{"$f":"'E jeugd voorronde'!AU20","v":"--"},{"$f":"'E jeugd voorronde'!AV20","v":1},null,{"$f":"'E jeugd voorronde'!AX20","v":3},null,{"$f":"'E jeugd voorronde'!AZ20","v":0}]
[{"$f":"'E jeugd voorronde'!AC21","v":"15:25:00"},{"$f":"'E jeugd voorronde'!AD21","v":"00:00:00"},{"$f":"'E jeugd voorronde'!AF21","v":"Bergambacht E3"},{"$f":"'E jeugd voorronde'!AL21","v":"--"},{"$f":"'E jeugd voorronde'!AM21","v":"Schoonhoven E4"},{"$f":"'E jeugd voorronde'!AT21","v":1},{"$f":"'E jeugd voorronde'!AU21","v":"--"},{"$f":"'E jeugd voorronde'!AV21","v":1},null,{"$f":"'E jeugd voorronde'!AX21","v":1},null,{"$f":"'E jeugd voorronde'!AZ21","v":1}]
[{"$f":"'E jeugd voorronde'!AC22","v":"15:50:00"},{"$f":"'E jeugd voorronde'!AD22","v":"00:00:00"},{"$f":"'E jeugd voorronde'!AF22","v":"RKDEO E3"},{"$f":"'E jeugd voorronde'!AL22","v":"--"},{"$f":"'E jeugd voorronde'!AM22","v":"Alblasserdam E3"},{"$f":"'E jeugd voorronde'!AT22","v":1},{"$f":"'E jeugd voorronde'!AU22","v":"--"},{"$f":"'E jeugd voorronde'!AV22","v":0},null,{"$f":"'E jeugd voorronde'!AX22","v":3},null,{"$f":"'E jeugd voorronde'!AZ22","v":0}]
[{"$f":"'E jeugd voorronde'!AC23","v":"16:15:00"},{"$f":"'E jeugd voorronde'!AD23","v":"00:00:00"},{"$f":"'E jeugd voorronde'!AF23","v":"Schoonhoven E4"},{"$f":"'E jeugd voorronde'!AL23","v":"--"},{"$f":"'E jeugd voorronde'!AM23","v":"VV GZ E3"},{"$f":"'E jeugd voorronde'!AT23","v":0},{"$f":"'E jeugd voorronde'!AU23","v":"--"},{"$f":"'E jeugd voorronde'!AV23","v":2},null,{"$f":"'E jeugd voorronde'!AX23","v":0},null,{"$f":"'E jeugd voorronde'!AZ23","v":3}]
[{"$f":"'E jeugd voorronde'!AC24","v":"16:40:00"},{"$f":"'E jeugd voorronde'!AD24","v":"00:00:00"},{"$f":"'E jeugd voorronde'!AF24","v":"RKDEO E3"},{"$f":"'E jeugd voorronde'!AL24","v":"--"},{"$f":"'E jeugd voorronde'!AM24","v":"Bergambacht E3"},{"$f":"'E jeugd voorronde'!AT24","v":0},{"$f":"'E jeugd voorronde'!AU24","v":"--"},{"$f":"'E jeugd voorronde'!AV24","v":1},null,{"$f":"'E jeugd voorronde'!AX24","v":0},null,{"$f":"'E jeugd voorronde'!AZ24","v":3}]
[{"$f":"'E jeugd voorronde'!AC25","v":"17:05:00"},{"$f":"'E jeugd voorronde'!AD25","v":"00:00:00"},{"$f":"'E jeugd voorronde'!AF25","v":"Bergambacht E3"},{"$f":"'E jeugd voorronde'!AL25","v":"--"},{"$f":"'E jeugd voorronde'!AM25","v":"Schoonhoven E3"},{"$f":"'E jeugd voorronde'!AT25","v":1},{"$f":"'E jeugd voorronde'!AU25","v":"--"},{"$f":"'E jeugd voorronde'!AV25","v":3},null,{"$f":"'E jeugd voorronde'!AX25","v":0},null,{"$f":"'E jeugd voorronde'!AZ25","v":3}]
[{"$f":"'E jeugd voorronde'!AC26","v":"17:30:00"},{"$f":"'E jeugd voorronde'!AD26","v":"00:00:00"},{"$f":"'E jeugd voorronde'!AF26","v":"Alblasserdam E3"},{"$f":"'E jeugd voorronde'!AL26","v":"--"},{"$f":"'E jeugd voorronde'!AM26","v":"Schoonhoven E4"},{"$f":"'E jeugd voorronde'!AT26","v":3},{"$f":"'E jeugd voorronde'!AU26","v":"--"},{"$f":"'E jeugd voorronde'!AV26","v":3},null,{"$f":"'E jeugd voorronde'!AX26","v":1},null,{"$f":"'E jeugd voorronde'!AZ26","v":1}]
[{"$f":"'E jeugd voorronde'!AC27","v":"17:55:00"},{"$f":"'E jeugd voorronde'!AD27","v":"00:00:00"},{"$f":"'E jeugd voorronde'!AF27","v":"Schoonhoven E3"},{"$f":"'E jeugd voorronde'!AL27","v":"--"},{"$f":"'E jeugd voorronde'!AM27","v":"Alblasserdam E3"},{"$f":"'E jeugd voorronde'!AT27","v":2},{"$f":"'E jeugd voorronde'!AU27","v":"--"},{"$f":"'E jeugd voorronde'!AV27","v":1},null,{"$f":"'E jeugd voorronde'!AX27","v":3},null,{"$f":"'E jeugd voorronde'!AZ27","v":0}]
[{"$f":"'E jeugd voorronde'!AC28","v":"18:20:00"},{"$f":"'E jeugd voorronde'!AD28","v":"00:00:00"},{"$f":"'E jeugd voorronde'!AF28","v":"VV GZ E3"},{"$f":"'E jeugd voorronde'!AL28","v":"--"},{"$f":"'E jeugd voorronde'!AM28","v":"RKDEO E3"},{"$f":"'E jeugd voorronde'!AT28","v":0},{"$f":"'E jeugd voorronde'!AU28","v":"--"},{"$f":"'E jeugd voorronde'!AV28","v":4},null,{"$f":"'E jeugd voorronde'!AX28","v":0},null,{"$f":"'E jeugd voorronde'!AZ28","v":3}]
[]
[]
[{"$f":"'E jeugd voorronde'!O3","v":"Stand"},{"$f":"'E jeugd voorronde'!P5","v":"Groep 2"},null,null,null,{"$f":"'E jeugd voorronde'!W5","v":"V"},{"$f":"'E jeugd voorronde'!X5","v":"T"},{"$f":"'E jeugd voorronde'!Y5","v":"P"},{"$f":"'E jeugd voorronde'!Z3","v":"Gewonnen"},{"$f":"'E jeugd voorronde'!AA3","v":"Gelijk"},{"$f":"'E jeugd voorronde'!AB3","v":"Verloren"},{"$f":"'E jeugd voorronde'!AC3","v":"Saldo"}]
[{"$f":"'E jeugd voorronde'!O4","v":0},null,null,null,null,null,null,null,{"$f":"'E jeugd voorronde'!Z4","v":0},{"$f":"'E jeugd voorronde'!AA4","v":0},{"$f":"'E jeugd voorronde'!AB4","v":0},{"$f":"'E jeugd voorronde'!AC4","v":0}]
[{"$f":"'E jeugd voorronde'!O5","v":0},null,null,null,null,null,null,null,{"$f":"'E jeugd voorronde'!Z5","v":0},{"$f":"'E jeugd voorronde'!AA5","v":0},{"$f":"'E jeugd voorronde'!AB5","v":0},{"$f":"'E jeugd voorronde'!AC5","v":0}]
[{"$f":"'E jeugd voorronde'!O6","v":1},{"$f":"'E jeugd voorronde'!P6","v":"Schoonhoven E3"},null,null,null,{"$f":"'E jeugd voorronde'!W6","v":16},{"$f":"'E jeugd voorronde'!X6","v":5},{"$f":"'E jeugd voorronde'!Y6","v":15.010999999999999},{"$f":"'E jeugd voorronde'!Z6","v":5},{"$f":"'E jeugd voorronde'!AA6","v":0},{"$f":"'E jeugd voorronde'!AB6","v":0},{"$f":"'E jeugd voorronde'!AC6","v":11}]
[{"$f":"'E jeugd voorronde'!O7","v":5},{"$f":"'E jeugd voorronde'!P7","v":"Schoonhoven E4"},null,null,null,{"$f":"'E jeugd voorronde'!W7","v":6},{"$f":"'E jeugd voorronde'!X7","v":11},{"$f":"'E jeugd voorronde'!Y7","v":1.9949999999999999},{"$f":"'E jeugd voorronde'!Z7","v":0},{"$f":"'E jeugd voorronde'!AA7","v":2},{"$f":"'E jeugd voorronde'!AB7","v":3},{"$f":"'E jeugd voorronde'!AC7","v":-5}]
[{"$f":"'E jeugd voorronde'!O8","v":2},{"$f":"'E jeugd voorronde'!P8","v":"RKDEO E3"},null,null,null,{"$f":"'E jeugd voorronde'!W8","v":8},{"$f":"'E jeugd voorronde'!X8","v":8},{"$f":"'E jeugd voorronde'!Y8","v":9},{"$f":"'E jeugd voorronde'!Z8","v":3},{"$f":"'E jeugd voorronde'!AA8","v":0},{"$f":"'E jeugd voorronde'!AB8","v":2},{"$f":"'E jeugd voorronde'!AC8","v":0}]
[{"$f":"'E jeugd voorronde'!O9","v":4},{"$f":"'E jeugd voorronde'!P9","v":"VV GZ E3"},null,null,null,{"$f":"'E jeugd voorronde'!W9","v":6},{"$f":"'E jeugd voorronde'!X9","v":11},{"$f":"'E jeugd voorronde'!Y9","v":3.9950000000000001},{"$f":"'E jeugd voorronde'!Z9","v":1},{"$f":"'E jeugd voorronde'!AA9","v":1},{"$f":"'E jeugd voorronde'!AB9","v":3},{"$f":"'E jeugd voorronde'!AC9","v":-5}]
[{"$f":"'E jeugd voorronde'!O10","v":3},{"$f":"'E jeugd voorronde'!P10","v":"Alblasserdam E3"},null,null,null,{"$f":"'E jeugd voorronde'!W10","v":8},{"$f":"'E jeugd voorronde'!X10","v":9},{"$f":"'E jeugd voorronde'!Y10","v":3.9990000000000001},{"$f":"'E jeugd voorronde'!Z10","v":1},{"$f":"'E jeugd voorronde'!AA10","v":1},{"$f":"'E jeugd voorronde'!AB10","v":3},{"$f":"'E jeugd voorronde'!AC10","v":-1}]
[{"$f":"'E jeugd voorronde'!O11","v":3},{"$f":"'E jeugd voorronde'!P11","v":"Bergambacht E3"},null,null,null,{"$f":"'E jeugd voorronde'!W11","v":7},{"$f":"'E jeugd voorronde'!X11","v":7},{"$f":"'E jeugd voorronde'!Y11","v":8},{"$f":"'E jeugd voorronde'!Z11","v":2},{"$f":"'E jeugd voorronde'!AA11","v":2},{"$f":"'E jeugd voorronde'!AB11","v":1},{"$f":"'E jeugd voorronde'!AC11","v":0}]

{"sheet":"E-GROEP-3","index":4,"n_rows":29,"n_cols":13,"rows_kept":29,"cut":false,"hidden":false,"merged":[[20,8,22,8],[20,9,22,9],[0,12,2,13],[20,5,22,5],[20,6,22,6],[20,7,22,7],[0,0,2,11],[20,10,22,10],[20,11,22,11],[11,0,11,1],[12,0,12,1],[9,0,9,1],[10,0,10,1],[7,0,7,1],[3,9,3,11],[4,0,4,1],[5,0,5,1],[6,0,6,1],[3,0,3,1],[3,5,3,7],[24,1,24,4],[20,1,22,4],[3,2,3,4],[8,0,8,1],[23,1,23,4],[13,0,13,1],[20,0,22,0],[28,1,28,4],[14,0,14,1],[15,0,15,1],[16,0,16,1],[17,0,17,1],[18,0,18,1],[25,1,25,4],[26,1,26,4],[27,1,27,4]]}
["SCHOONHOVEN TOERNOOI",null,null,null,null,null,null,null,null,null,null,null,"SCORES BY:\nOnlineExcelCursus.NL\nMichael van den Dool"]
[]
[]
[{"$f":"'E jeugd voorronde'!D30","v":"Tijd"},{"$f":"'E jeugd voorronde'!E30","v":0},{"$f":"'E jeugd voorronde'!G30","v":"VELD C"},null,null,{"$f":"'E jeugd voorronde'!U30","v":"Uitslag"},{"$f":"'E jeugd voorronde'!V30","v":0},{"$f":"'E jeugd voorronde'!W30","v":0},null,{"$f":"'E jeugd voorronde'!Y30","v":"Punten"}]
[{"$f":"'E jeugd voorronde'!D31","v":"12:30:00"},{"$f":"'E jeugd voorronde'!E31","v":"00:00:00"},{"$f":"'E jeugd voorronde'!G31","v":"Jodan Boys E6"},{"$f":"'E jeugd voorronde'!M31","v":"--"},{"$f":"'E jeugd voorronde'!N31","v":"Bergambacht E5"},{"$f":"'E jeugd voorronde'!U31","v":1},{"$f":"'E jeugd voorronde'!V31","v":"--"},{"$f":"'E jeugd voorronde'!W31","v":2},null,{"$f":"'E jeugd voorronde'!Y31","v":0},null,{"$f":"'E jeugd voorronde'!AA31","v":3}]
[{"$f":"'E jeugd voorronde'!D32","v":"12:55:00"},{"$f":"'E jeugd voorronde'!E32","v":"00:00:00"},{"$f":"'E jeugd voorronde'!G32","v":"Schoonhoven E5"},{"$f":"'E jeugd voorronde'!M32","v":"--"},{"$f":"'E jeugd voorronde'!N32","v":"scVictorie'04 E3"},{"$f":"'E jeugd voorronde'!U32","v":2},{"$f":"'E jeugd voorronde'!V32","v":"--"},{"$f":"'E jeugd voorronde'!W32","v":1},null,{"$f":"'E jeugd voorronde'!Y32","v":3},null,{"$f":"'E jeugd voorronde'!AA32","v":0}]
[{"$f":"'E jeugd voorronde'!D33","v":"13:20:00"},{"$f":"'E jeugd voorronde'!E33","v":"00:00:00"},{"$f":"'E jeugd voorronde'!G33","v":"Schoonhoven E6"},{"$f":"'E jeugd voorronde'!M33","v":"--"},{"$f":"'E jeugd voorronde'!N33","v":"RKDEO E9"},{"$f":"'E jeugd voorronde'!U33","v":1},{"$f":"'E jeugd voorronde'!V33","v":"--"},{"$f":"'E jeugd voorronde'!W33","v":2},null,{"$f":"'E jeugd voorronde'!Y33","v":0},null,{"$f":"'E jeugd voorronde'!AA33","v":3}]
[{"$f":"'E jeugd voorronde'!D34","v":"13:45:00"},{"$f":"'E jeugd voorronde'!E34","v":"00:00:00"},{"$f":"'E jeugd voorronde'!G34","v":"Jodan Boys E6"},{"$f":"'E jeugd voorronde'!M34","v":"--"},{"$f":"'E jeugd voorronde'!N34","v":"scVictorie'04 E3"},{"$f":"'E jeugd voorronde'!U34","v":3},{"$f":"'E jeugd voorronde'!V34","v":"--"},{"$f":"'E jeugd voorronde'!W34","v":1},null,{"$f":"'E jeugd voorronde'!Y34","v":3},null,{"$f":"'E jeugd voorronde'!AA34","v":0}]
[{"$f":"'E jeugd voorronde'!D35","v":"14:10:00"},{"$f":"'E jeugd voorronde'!E35","v":"00:00:00"},{"$f":"'E jeugd voorronde'!G35","v":"RKDEO E9"},{"$f":"'E jeugd voorronde'!M35","v":"--"},{"$f":"'E jeugd voorronde'!N35","v":"Schoonhoven E5"},{"$f":"'E jeugd voorronde'!U35","v":1},{"$f":"'E jeugd voorronde'!V35","v":"--"},{"$f":"'E jeugd voorronde'!W35","v":6},null,{"$f":"'E jeugd voorronde'!Y35","v":0},null,{"$f":"'E jeugd voorronde'!AA35","v":3}]
[{"$f":"'E jeugd voorronde'!D36","v":"14:35:00"},{"$f":"'E jeugd voorronde'!E36","v":"00:00:00"},{"$f":"'E jeugd voorronde'!G36","v":"scVictorie'04 E3"},{"$f":"'E jeugd voorronde'!M36","v":"--"},{"$f":"'E jeugd voorronde'!N36","v":"Bergambacht E5"},{"$f":"'E jeugd voorronde'!U36","v":2},{"$f":"'E jeugd voorronde'!V36","v":"--"},{"$f":"'E jeugd voorronde'!W36","v":2},null,{"$f":"'E jeugd voorronde'!Y36","v":1},null,{"$f":"'E jeugd voorronde'!AA36","v":1}]
[{"$f":"'E jeugd voorronde'!D37","v":"15:00:00"},{"$f":"'E jeugd voorronde'!E37","v":"00:00:00"},{"$f":"'E jeugd voorronde'!G37","v":"Schoonhoven E5"},{"$f":"'E jeugd voorronde'!M37","v":"--"},{"$f":"'E jeugd voorronde'!N37","v":"Schoonhoven E6"},{"$f":"'E jeugd voorronde'!U37","v":3},{"$f":"'E jeugd voorronde'!V37","v":"--"},{"$f":"'E jeugd voorronde'!W37","v":1},null,{"$f":"'E jeugd voorronde'!Y37","v":3},null,{"$f":"'E jeugd voorronde'!AA37","v":0}]
[{"$f":"'E jeugd voorronde'!D38","v":"15:25:00"},{"$f":"'E jeugd voorronde'!E38","v":"00:00:00"},{"$f":"'E jeugd voorronde'!G38","v":"Bergambacht E5"},{"$f":"'E jeugd voorronde'!M38","v":"--"},{"$f":"'E jeugd voorronde'!N38","v":"Schoonhoven E6"},{"$f":"'E jeugd voorronde'!U38","v":1},{"$f":"'E jeugd voorronde'!V38","v":"--"},{"$f":"'E jeugd voorronde'!W38","v":1},null,{"$f":"'E jeugd voorronde'!Y38","v":1},null,{"$f":"'E jeugd voorronde'!AA38","v":1}]
[{"$f":"'E jeugd voorronde'!D39","v":"15:50:00"},{"$f":"'E jeugd voorronde'!E39","v":"00:00:00"},{"$f":"'E jeugd voorronde'!G39","v":"RKDEO E9"},{"$f":"'E jeugd voorronde'!M39","v":"--"},{"$f":"'E jeugd voorronde'!N39","v":"Jodan Boys E6"},{"$f":"'E jeugd voorronde'!U39","v":1},{"$f":"'E jeugd voorronde'!V39","v":"--"},{"$f":"'E jeugd voorronde'!W39","v":0},null,{"$f":"'E jeugd voorronde'!Y39","v":3},null,{"$f":"'E jeugd voorronde'!AA39","v":0}]
[{"$f":"'E jeugd voorronde'!D40","v":"16:15:00"},{"$f":"'E jeugd voorronde'!E40","v":"00:00:00"},{"$f":"'E jeugd voorronde'!G40","v":"Schoonhoven E6"},{"$f":"'E jeugd voorronde'!M40","v":"--"},{"$f":"'E jeugd voorronde'!N40","v":"scVictorie'04 E3"},{"$f":"'E jeugd voorronde'!U40","v":0},{"$f":"'E jeugd voorronde'!V40","v":"--"},{"$f":"'E jeugd voorronde'!W40","v":2},null,{"$f":"'E jeugd voorronde'!Y40","v":0},null,{"$f":"'E jeugd voorronde'!AA40","v":3}]
[{"$f":"'E jeugd voorronde'!D41","v":"16:40:00"},{"$f":"'E jeugd voorronde'!E41","v":"00:00:00"},{"$f":"'E jeugd voorronde'!G41","v":"RKDEO E9"},{"$f":"'E jeugd voorronde'!M41","v":"--"},{"$f":"'E jeugd voorronde'!N41","v":"Bergambacht E5"},{"$f":"'E jeugd voorronde'!U41","v":0},{"$f":"'E jeugd voorronde'!V41","v":"--"},{"$f":"'E jeugd voorronde'!W41","v":1},null,{"$f":"'E jeugd voorronde'!Y41","v":0},null,{"$f":"'E jeugd voorronde'!AA41","v":3}]
[{"$f":"'E jeugd voorronde'!D42","v":"17:05:00"},{"$f":"'E jeugd voorronde'!E42","v":"00:00:00"},{"$f":"'E jeugd voorronde'!G42","v":"Bergambacht E5"},{"$f":"'E jeugd voorronde'!M42","v":"--"},{"$f":"'E jeugd voorronde'!N42","v":"Schoonhoven E5"},{"$f":"'E jeugd voorronde'!U42","v":1},{"$f":"'E jeugd voorronde'!V42","v":"--"},{"$f":"'E jeugd voorronde'!W42","v":3},null,{"$f":"'E jeugd voorronde'!Y42","v":0},null,{"$f":"'E jeugd voorronde'!AA42","v":3}]
[{"$f":"'E jeugd voorronde'!D43","v":"17:30:00"},{"$f":"'E jeugd voorronde'!E43","v":"00:00:00"},{"$f":"'E jeugd voorronde'!G43","v":"Jodan Boys E6"},{"$f":"'E jeugd voorronde'!M43","v":"--"},{"$f":"'E jeugd voorronde'!N43","v":"Schoonhoven E6"},{"$f":"'E jeugd voorronde'!U43","v":3},{"$f":"'E jeugd voorronde'!V43","v":"--"},{"$f":"'E jeugd voorronde'!W43","v":3},null,{"$f":"'E jeugd voorronde'!Y43","v":1},null,{"$f":"'E jeugd voorronde'!AA43","v":1}]
[{"$f":"'E jeugd voorronde'!D44","v":"17:55:00"},{"$f":"'E jeugd voorronde'!E44","v":"00:00:00"},{"$f":"'E jeugd voorronde'!G44","v":"Schoonhoven E5"},{"$f":"'E jeugd voorronde'!M44","v":"--"},{"$f":"'E jeugd voorronde'!N44","v":"Jodan Boys E6"},{"$f":"'E jeugd voorronde'!U44","v":2},{"$f":"'E jeugd voorronde'!V44","v":"--"},{"$f":"'E jeugd voorronde'!W44","v":1},null,{"$f":"'E jeugd voorronde'!Y44","v":3},null,{"$f":"'E jeugd voorronde'!AA44","v":0}]
[{"$f":"'E jeugd voorronde'!D45","v":"18:20:00"},{"$f":"'E jeugd voorronde'!E45","v":"00:00:00"},{"$f":"'E jeugd voorronde'!G45","v":"scVictorie'04 E3"},{"$f":"'E jeugd voorronde'!M45","v":"--"},{"$f":"'E jeugd voorronde'!N45","v":"RKDEO E9"},{"$f":"'E jeugd voorronde'!U45","v":0},{"$f":"'E jeugd voorronde'!V45","v":"--"},{"$f":"'E jeugd voorronde'!W45","v":4},null,{"$f":"'E jeugd voorronde'!Y45","v":0},null,{"$f":"'E jeugd voorronde'!AA45","v":3}]
[]
[{"$f":"'E jeugd voorronde'!AD3","v":"Stand"},{"$f":"'E jeugd voorronde'!AE5","v":"Groep 3"},null,null,null,{"$f":"'E jeugd voorronde'!AK5","v":"V"},{"$f":"'E jeugd voorronde'!AL5","v":"T"},{"$f":"'E jeugd voorronde'!AM5","v":"P"},{"$f":"'E jeugd voorronde'!AN3","v":"Gewonnen"},{"$f":"'E jeugd voorronde'!AO3","v":"Gelijk"},{"$f":"'E jeugd voorronde'!AP3","v":"Verloren"},{"$f":"'E jeugd voorronde'!AQ3","v":"Saldo"}]
[{"$f":"'E jeugd voorronde'!AD4","v":0},null,null,null,null,null,null,null,{"$f":"'E jeugd voorronde'!AN4","v":0},{"$f":"'E jeugd voorronde'!AO4","v":0},{"$f":"'E jeugd voorronde'!AP4","v":0},{"$f":"'E jeugd voorronde'!AQ4","v":0}]
[{"$f":"'E jeugd voorronde'!AD5","v":0},null,null,null,null,null,null,null,{"$f":"'E jeugd voorronde'!AN5","v":0},{"$f":"'E jeugd voorronde'!AO5","v":0},{"$f":"'E jeugd voorronde'!AP5","v":0},{"$f":"'E jeugd voorronde'!AQ5","v":0}]
[{"$f":"'E jeugd voorronde'!AD6","v":1},{"$f":"'E jeugd voorronde'!AE6","v":"Schoonhoven E5"},null,null,null,{"$f":"'E jeugd voorronde'!AK6","v":16},{"$f":"'E jeugd voorronde'!AL6","v":5},{"$f":"'E jeugd voorronde'!AM6","v":15.010999999999999},{"$f":"'E jeugd voorronde'!AN6","v":5},{"$f":"'E jeugd voorronde'!AO6","v":0},{"$f":"'E jeugd voorronde'!AP6","v":0},{"$f":"'E jeugd voorronde'!AQ6","v":11}]
[{"$f":"'E jeugd voorronde'!AD7","v":5},{"$f":"'E jeugd voorronde'!AE7","v":"Schoonhoven E6"},null,null,null,{"$f":"'E jeugd voorronde'!AK7","v":6},{"$f":"'E jeugd voorronde'!AL7","v":11},{"$f":"'E jeugd voorronde'!AM7","v":1.9949999999999999},{"$f":"'E jeugd voorronde'!AN7","v":0},{"$f":"'E jeugd voorronde'!AO7","v":2},{"$f":"'E jeugd voorronde'!AP7","v":3},{"$f":"'E jeugd voorronde'!AQ7","v":-5}]
[{"$f":"'E jeugd voorronde'!AD8","v":2},{"$f":"'E jeugd voorronde'!AE8","v":"RKDEO E9"},null,null,null,{"$f":"'E jeugd voorronde'!AK8","v":8},{"$f":"'E jeugd voorronde'!AL8","v":8},{"$f":"'E jeugd voorronde'!AM8","v":9},{"$f":"'E jeugd voorronde'!AN8","v":3},{"$f":"'E jeugd voorronde'!AO8","v":0},{"$f":"'E jeugd voorronde'!AP8","v":2},{"$f":"'E jeugd voorronde'!AQ8","v":0}]
[{"$f":"'E jeugd voorronde'!AD9","v":4},{"$f":"'E jeugd voorronde'!AE9","v":"scVictorie'04 E3"},null,null,null,{"$f":"'E jeugd voorronde'!AK9","v":6},{"$f":"'E jeugd voorronde'!AL9","v":11},{"$f":"'E jeugd voorronde'!AM9","v":3.9950000000000001},{"$f":"'E jeugd voorronde'!AN9","v":1},{"$f":"'E jeugd voorronde'!AO9","v":1},{"$f":"'E jeugd voorronde'!AP9","v":3},{"$f":"'E jeugd voorronde'!AQ9","v":-5}]
[{"$f":"'E jeugd voorronde'!AD10","v":3},{"$f":"'E jeugd voorronde'!AE10","v":"Jodan Boys E6"},null,null,null,{"$f":"'E jeugd voorronde'!AK10","v":8},{"$f":"'E jeugd voorronde'!AL10","v":9},{"$f":"'E jeugd voorronde'!AM10","v":3.9990000000000001},{"$f":"'E jeugd voorronde'!AN10","v":1},{"$f":"'E jeugd voorronde'!AO10","v":1},{"$f":"'E jeugd voorronde'!AP10","v":3},{"$f":"'E jeugd voorronde'!AQ10","v":-1}]
[{"$f":"'E jeugd voorronde'!AD11","v":3},{"$f":"'E jeugd voorronde'!AE11","v":"Bergambacht E5"},null,null,null,{"$f":"'E jeugd voorronde'!AK11","v":7},{"$f":"'E jeugd voorronde'!AL11","v":7},{"$f":"'E jeugd voorronde'!AM11","v":8},{"$f":"'E jeugd voorronde'!AN11","v":2},{"$f":"'E jeugd voorronde'!AO11","v":2},{"$f":"'E jeugd voorronde'!AP11","v":1},{"$f":"'E jeugd voorronde'!AQ11","v":0}]

{"sheet":"E-GROEP-4","index":5,"n_rows":29,"n_cols":13,"rows_kept":29,"cut":false,"hidden":false,"merged":[[0,12,2,13],[20,6,22,6],[20,7,22,7],[23,1,23,4],[24,1,24,4],[0,0,2,11],[20,8,22,8],[20,9,22,9],[20,10,22,10],[20,11,22,11],[20,5,22,5],[3,5,3,7],[3,9,3,11],[3,0,3,1],[3,2,3,4],[27,1,27,4],[13,0,13,1],[20,0,22,0],[11,0,11,1],[12,0,12,1],[9,0,9,1],[10,0,10,1],[4,0,4,1],[7,0,7,1],[8,0,8,1],[5,0,5,1],[6,0,6,1],[28,1,28,4],[14,0,14,1],[15,0,15,1],[16,0,16,1],[17,0,17,1],[18,0,18,1],[25,1,25,4],[26,1,26,4],[20,1,22,4]]}
["SCHOONHOVEN TOERNOOI",null,null,null,null,null,null,null,null,null,null,null,"SCORES BY:\nOnlineExcelCursus.NL\nMichael van den Dool"]
[]
[]
[{"$f":"'E jeugd voorronde'!AC30","v":"Tijd"},{"$f":"'E jeugd voorronde'!AD30","v":0},{"$f":"'E jeugd voorronde'!AF30","v":"VELD D"},null,null,{"$f":"'E jeugd voorronde'!AT30","v":"Uitslag"},{"$f":"'E jeugd voorronde'!AU30","v":0},{"$f":"'E jeugd voorronde'!AV30","v":0},null,{"$f":"'E jeugd voorronde'!AX30","v":"Punten"},{"$f":"'E jeugd voorronde'!AY30","v":0},{"$f":"'E jeugd voorronde'!AZ30","v":0}]
[{"$f":"'E jeugd voorronde'!AC31","v":"12:30:00"},{"$f":"'E jeugd voorronde'!AD31","v":"00:00:00"},{"$f":"'E jeugd voorronde'!AF31","v":"Smitshoek E10"},{"$f":"'E jeugd voorronde'!AL31","v":"--"},{"$f":"'E jeugd voorronde'!AM31","v":"Bergambacht E7"},{"$f":"'E jeugd voorronde'!AT31","v":1},{"$f":"'E jeugd voorronde'!AU31","v":"--"},{"$f":"'E jeugd voorronde'!AV31","v":2},null,{"$f":"'E jeugd voorronde'!Y31","v":0},null,{"$f":"'E jeugd voorronde'!AA31","v":3}]
[{"$f":"'E jeugd voorronde'!AC32","v":"12:55:00"},{"$f":"'E jeugd voorronde'!AD32","v":"00:00:00"},{"$f":"'E jeugd voorronde'!AF32","v":"Schoonhoven E7"},{"$f":"'E jeugd voorronde'!AL32","v":"--"},{"$f":"'E jeugd voorronde'!AM32","v":"Jodan Boys E8"},{"$f":"'E jeugd voorronde'!AT32","v":2},{"$f":"'E jeugd voorronde'!AU32","v":"--"},{"$f":"'E jeugd voorronde'!AV32","v":1},null,{"$f":"'E jeugd voorronde'!Y32","v":3},null,{"$f":"'E jeugd voorronde'!AA32","v":0}]
[{"$f":"'E jeugd voorronde'!AC33","v":"13:20:00"},{"$f":"'E jeugd voorronde'!AD33","v":"00:00:00"},{"$f":"'E jeugd voorronde'!AF33","v":"Schoonhoven E8"},{"$f":"'E jeugd voorronde'!AL33","v":"--"},{"$f":"'E jeugd voorronde'!AM33","v":"VFC Vlaardingen E8"},{"$f":"'E jeugd voorronde'!AT33","v":1},{"$f":"'E jeugd voorronde'!AU33","v":"--"},{"$f":"'E jeugd voorronde'!AV33","v":2},null,{"$f":"'E jeugd voorronde'!Y33","v":0},null,{"$f":"'E jeugd voorronde'!AA33","v":3}]
[{"$f":"'E jeugd voorronde'!AC34","v":"13:45:00"},{"$f":"'E jeugd voorronde'!AD34","v":"00:00:00"},{"$f":"'E jeugd voorronde'!AF34","v":"Smitshoek E10"},{"$f":"'E jeugd voorronde'!AL34","v":"--"},{"$f":"'E jeugd voorronde'!AM34","v":"Jodan Boys E8"},{"$f":"'E jeugd voorronde'!AT34","v":3},{"$f":"'E jeugd voorronde'!AU34","v":"--"},{"$f":"'E jeugd voorronde'!AV34","v":1},null,{"$f":"'E jeugd voorronde'!Y34","v":3},null,{"$f":"'E jeugd voorronde'!AA34","v":0}]
[{"$f":"'E jeugd voorronde'!AC35","v":"14:10:00"},{"$f":"'E jeugd voorronde'!AD35","v":"00:00:00"},{"$f":"'E jeugd voorronde'!AF35","v":"VFC Vlaardingen E8"},{"$f":"'E jeugd voorronde'!AL35","v":"--"},{"$f":"'E jeugd voorronde'!AM35","v":"Schoonhoven E7"},{"$f":"'E jeugd voorronde'!AT35","v":1},{"$f":"'E jeugd voorronde'!AU35","v":"--"},{"$f":"'E jeugd voorronde'!AV35","v":6},null,{"$f":"'E jeugd voorronde'!Y35","v":0},null,{"$f":"'E jeugd voorronde'!AA35","v":3}]
[{"$f":"'E jeugd voorronde'!AC36","v":"14:35:00"},{"$f":"'E jeugd voorronde'!AD36","v":"00:00:00"},{"$f":"'E jeugd voorronde'!AF36","v":"Jodan Boys E8"},{"$f":"'E jeugd voorronde'!AL36","v":"--"},{"$f":"'E jeugd voorronde'!AM36","v":"Bergambacht E7"},{"$f":"'E jeugd voorronde'!AT36","v":2},{"$f":"'E jeugd voorronde'!AU36","v":"--"},{"$f":"'E jeugd voorronde'!AV36","v":2},null,{"$f":"'E jeugd voorronde'!Y36","v":1},null,{"$f":"'E jeugd voorronde'!AA36","v":1}]
[{"$f":"'E jeugd voorronde'!AC37","v":"15:00:00"},{"$f":"'E jeugd voorronde'!AD37","v":"00:00:00"},{"$f":"'E jeugd voorronde'!AF37","v":"Schoonhoven E7"},{"$f":"'E jeugd voorronde'!AL37","v":"--"},{"$f":"'E jeugd voorronde'!AM37","v":"Schoonhoven E8"},{"$f":"'E jeugd voorronde'!AT37","v":3},{"$f":"'E jeugd voorronde'!AU37","v":"--"},{"$f":"'E jeugd voorronde'!AV37","v":1},null,{"$f":"'E jeugd voorronde'!Y37","v":3},null,{"$f":"'E jeugd voorronde'!AA37","v":0}]
[{"$f":"'E jeugd voorronde'!AC38","v":"15:25:00"},{"$f":"'E jeugd voorronde'!AD38","v":"00:00:00"},{"$f":"'E jeugd voorronde'!AF38","v":"Bergambacht E7"},{"$f":"'E jeugd voorronde'!AL38","v":"--"},{"$f":"'E jeugd voorronde'!AM38","v":"Schoonhoven E8"},{"$f":"'E jeugd voorronde'!AT38","v":1},{"$f":"'E jeugd voorronde'!AU38","v":"--"},{"$f":"'E jeugd voorronde'!AV38","v":1},null,{"$f":"'E jeugd voorronde'!Y38","v":1},null,{"$f":"'E jeugd voorronde'!AA38","v":1}]
[{"$f":"'E jeugd voorronde'!AC39","v":"15:50:00"},{"$f":"'E jeugd voorronde'!AD39","v":"00:00:00"},{"$f":"'E jeugd voorronde'!AF39","v":"VFC Vlaardingen E8"},{"$f":"'E jeugd voorronde'!AL39","v":"--"},{"$f":"'E jeugd voorronde'!AM39","v":"Smitshoek E10"},{"$f":"'E jeugd voorronde'!AT39","v":1},{"$f":"'E jeugd voorronde'!AU39","v":"--"},{"$f":"'E jeugd voorronde'!AV39","v":0},null,{"$f":"'E jeugd voorronde'!Y39","v":3},null,{"$f":"'E jeugd voorronde'!AA39","v":0}]
[{"$f":"'E jeugd voorronde'!AC40","v":"16:15:00"},{"$f":"'E jeugd voorronde'!AD40","v":"00:00:00"},{"$f":"'E jeugd voorronde'!AF40","v":"Schoonhoven E8"},{"$f":"'E jeugd voorronde'!AL40","v":"--"},{"$f":"'E jeugd voorronde'!AM40","v":"Jodan Boys E8"},{"$f":"'E jeugd voorronde'!AT40","v":0},{"$f":"'E jeugd voorronde'!AU40","v":"--"},{"$f":"'E jeugd voorronde'!AV40","v":2},null,{"$f":"'E jeugd voorronde'!Y40","v":0},null,{"$f":"'E jeugd voorronde'!AA40","v":3}]
[{"$f":"'E jeugd voorronde'!AC41","v":"16:40:00"},{"$f":"'E jeugd voorronde'!AD41","v":"00:00:00"},{"$f":"'E jeugd voorronde'!AF41","v":"VFC Vlaardingen E8"},{"$f":"'E jeugd voorronde'!AL41","v":"--"},{"$f":"'E jeugd voorronde'!AM41","v":"Bergambacht E7"},{"$f":"'E jeugd voorronde'!AT41","v":0},{"$f":"'E jeugd voorronde'!AU41","v":"--"},{"$f":"'E jeugd voorronde'!AV41","v":1},null,{"$f":"'E jeugd voorronde'!Y41","v":0},null,{"$f":"'E jeugd voorronde'!AA41","v":3}]
[{"$f":"'E jeugd voorronde'!AC42","v":"17:05:00"},{"$f":"'E jeugd voorronde'!AD42","v":"00:00:00"},{"$f":"'E jeugd voorronde'!AF42","v":"Bergambacht E7"},{"$f":"'E jeugd voorronde'!AL42","v":"--"},{"$f":"'E jeugd voorronde'!AM42","v":"Schoonhoven E7"},{"$f":"'E jeugd voorronde'!AT42","v":1},{"$f":"'E jeugd voorronde'!AU42","v":"--"},{"$f":"'E jeugd voorronde'!AV42","v":3},null,{"$f":"'E jeugd voorronde'!Y42","v":0},null,{"$f":"'E jeugd voorronde'!AA42","v":3}]
[{"$f":"'E jeugd voorronde'!AC43","v":"17:30:00"},{"$f":"'E jeugd voorronde'!AD43","v":"00:00:00"},{"$f":"'E jeugd voorronde'!AF43","v":"Smitshoek E10"},{"$f":"'E jeugd voorronde'!AL43","v":"--"},{"$f":"'E jeugd voorronde'!AM43","v":"Schoonhoven E8"},{"$f":"'E jeugd voorronde'!AT43","v":3},{"$f":"'E jeugd voorronde'!AU43","v":"--"},{"$f":"'E jeugd voorronde'!AV43","v":3},null,{"$f":"'E jeugd voorronde'!Y43","v":1},null,{"$f":"'E jeugd voorronde'!AA43","v":1}]
[{"$f":"'E jeugd voorronde'!AC44","v":"17:55:00"},{"$f":"'E jeugd voorronde'!AD44","v":"00:00:00"},{"$f":"'E jeugd voorronde'!AF44","v":"Schoonhoven E7"},{"$f":"'E jeugd voorronde'!AL44","v":"--"},{"$f":"'E jeugd voorronde'!AM44","v":"Smitshoek E10"},{"$f":"'E jeugd voorronde'!AT44","v":2},{"$f":"'E jeugd voorronde'!AU44","v":"--"},{"$f":"'E jeugd voorronde'!AV44","v":1},null,{"$f":"'E jeugd voorronde'!Y44","v":3},null,{"$f":"'E jeugd voorronde'!AA44","v":0}]
[{"$f":"'E jeugd voorronde'!AC45","v":"18:20:00"},{"$f":"'E jeugd voorronde'!AD45","v":"00:00:00"},{"$f":"'E jeugd voorronde'!AF45","v":"Jodan Boys E8"},{"$f":"'E jeugd voorronde'!AL45","v":"--"},{"$f":"'E jeugd voorronde'!AM45","v":"VFC Vlaardingen E8"},{"$f":"'E jeugd voorronde'!AT45","v":0},{"$f":"'E jeugd voorronde'!AU45","v":"--"},{"$f":"'E jeugd voorronde'!AV45","v":4},null,{"$f":"'E jeugd voorronde'!Y45","v":0},null,{"$f":"'E jeugd voorronde'!AA45","v":3}]
[]
[{"$f":"'E jeugd voorronde'!AR3","v":"Stand"},{"$f":"'E jeugd voorronde'!AS5","v":"Groep 4"},null,null,null,{"$f":"'E jeugd voorronde'!AY5","v":"V"},{"$f":"'E jeugd voorronde'!AZ5","v":"T"},{"$f":"'E jeugd voorronde'!BA5","v":"P"},{"$f":"'E jeugd voorronde'!BB3","v":"Gewonnen"},{"$f":"'E jeugd voorronde'!BC3","v":"Gelijk"},{"$f":"'E jeugd voorronde'!BD3","v":"Verloren"},{"$f":"'E jeugd voorronde'!BE3","v":"Saldo"}]
[{"$f":"'E jeugd voorronde'!AR4","v":0},null,null,null,null,null,null,null,{"$f":"'E jeugd voorronde'!BB4","v":0},{"$f":"'E jeugd voorronde'!BC4","v":0},{"$f":"'E jeugd voorronde'!BD4","v":0},{"$f":"'E jeugd voorronde'!BE4","v":0}]
[{"$f":"'E jeugd voorronde'!AR5","v":0},null,null,null,null,null,null,null,{"$f":"'E jeugd voorronde'!BB5","v":0},{"$f":"'E jeugd voorronde'!BC5","v":0},{"$f":"'E jeugd voorronde'!BD5","v":0},{"$f":"'E jeugd voorronde'!BE5","v":0}]
[{"$f":"'E jeugd voorronde'!AR6","v":1},{"$f":"'E jeugd voorronde'!AS6","v":"Schoonhoven E7"},null,null,null,{"$f":"'E jeugd voorronde'!AY6","v":16},{"$f":"'E jeugd voorronde'!AZ6","v":5},{"$f":"'E jeugd voorronde'!BA6","v":15.010999999999999},{"$f":"'E jeugd voorronde'!BB6","v":5},{"$f":"'E jeugd voorronde'!BC6","v":0},{"$f":"'E jeugd voorronde'!BD6","v":0},{"$f":"'E jeugd voorronde'!BE6","v":11}]
[{"$f":"'E jeugd voorronde'!AR7","v":5},{"$f":"'E jeugd voorronde'!AS7","v":"Schoonhoven E8"},null,null,null,{"$f":"'E jeugd voorronde'!AY7","v":6},{"$f":"'E jeugd voorronde'!AZ7","v":11},{"$f":"'E jeugd voorronde'!BA7","v":1.9949999999999999},{"$f":"'E jeugd voorronde'!BB7","v":0},{"$f":"'E jeugd voorronde'!BC7","v":2},{"$f":"'E jeugd voorronde'!BD7","v":3},{"$f":"'E jeugd voorronde'!BE7","v":-5}]
[{"$f":"'E jeugd voorronde'!AR8","v":2},{"$f":"'E jeugd voorronde'!AS8","v":"VFC Vlaardingen E8"},null,null,null,{"$f":"'E jeugd voorronde'!AY8","v":8},{"$f":"'E jeugd voorronde'!AZ8","v":8},{"$f":"'E jeugd voorronde'!BA8","v":9},{"$f":"'E jeugd voorronde'!BB8","v":3},{"$f":"'E jeugd voorronde'!BC8","v":0},{"$f":"'E jeugd voorronde'!BD8","v":2},{"$f":"'E jeugd voorronde'!BE8","v":0}]
[{"$f":"'E jeugd voorronde'!AR9","v":4},{"$f":"'E jeugd voorronde'!AS9","v":"Jodan Boys E8"},null,null,null,{"$f":"'E jeugd voorronde'!AY9","v":6},{"$f":"'E jeugd voorronde'!AZ9","v":11},{"$f":"'E jeugd voorronde'!BA9","v":3.9950000000000001},{"$f":"'E jeugd voorronde'!BB9","v":1},{"$f":"'E jeugd voorronde'!BC9","v":1},{"$f":"'E jeugd voorronde'!BD9","v":3},{"$f":"'E jeugd voorronde'!BE9","v":-5}]
[{"$f":"'E jeugd voorronde'!AR10","v":3},{"$f":"'E jeugd voorronde'!AS10","v":"Smitshoek E10"},null,null,null,{"$f":"'E jeugd voorronde'!AY10","v":8},{"$f":"'E jeugd voorronde'!AZ10","v":9},{"$f":"'E jeugd voorronde'!BA10","v":3.9990000000000001},{"$f":"'E jeugd voorronde'!BB10","v":1},{"$f":"'E jeugd voorronde'!BC10","v":1},{"$f":"'E jeugd voorronde'!BD10","v":3},{"$f":"'E jeugd voorronde'!BE10","v":-1}]
[{"$f":"'E jeugd voorronde'!AR11","v":3},{"$f":"'E jeugd voorronde'!AS11","v":"Bergambacht E7"},null,null,null,{"$f":"'E jeugd voorronde'!AY11","v":7},{"$f":"'E jeugd voorronde'!AZ11","v":7},{"$f":"'E jeugd voorronde'!BA11","v":8},{"$f":"'E jeugd voorronde'!BB11","v":2},{"$f":"'E jeugd voorronde'!BC11","v":2},{"$f":"'E jeugd voorronde'!BD11","v":1},{"$f":"'E jeugd voorronde'!BE11","v":0}]