{"text_format":"1","workbook":"xlsx","n_sheets":7,"sheets":["Poules","Finale","GROEP-1","GROEP-2","GROEP-3","GROEP-4","Blad1"],"not_rendered":{"charts":0,"images":0,"macros":1,"external_links":0,"defined_names":0,"comments":0,"pivot_tables":0},"unopened":[],"bounds":{"document_bytes":16777216,"sheet_cells":100000,"rows_first":2000,"rows_last":500,"rows_between":2000,"halvings":0,"cell_chars":16384,"cell_head_chars":4096},"cells_cut":0,"cells_raw":0,"read":"whole","date_system":"1900"}

{"sheet":"Poules","index":0,"n_rows":41,"n_cols":69,"rows_kept":41,"cut":false,"hidden":false,"merged":[[2,56,4,56],[2,42,4,42],[2,53,4,53],[2,54,4,54],[2,55,4,55],[2,28,4,28],[2,39,4,39],[2,40,4,40],[2,41,4,41],[4,44,4,49],[13,38,13,43],[12,38,12,43],[11,38,11,43],[24,31,24,43],[24,6,24,18],[24,28,24,29],[24,20,24,22],[8,44,8,49],[10,45,10,47],[10,49,10,51],[8,30,8,35],[11,28,11,29],[16,31,16,36],[16,38,16,43],[15,38,15,43],[24,49,24,51],[10,24,10,26],[14,38,14,43],[10,28,10,29],[8,1,8,6],[10,3,10,4],[10,6,10,18],[11,3,11,4],[12,3,12,4],[13,3,13,4],[13,13,13,18],[28,3,28,4],[29,3,29,4],[30,3,30,4],[26,6,26,11],[25,6,25,11],[28,13,28,18],[27,13,27,18],[30,6,30,11],[29,6,29,11],[28,6,28,11],[27,6,27,11],[30,13,30,18],[29,13,29,18],[26,13,26,18],[25,13,25,18],[15,31,15,36],[14,31,14,36],[13,31,13,36],[16,6,16,11],[15,6,15,11],[14,6,14,11],[13,6,13,11],[15,13,15,18],[13,28,13,29],[14,28,14,29],[15,28,15,29],[16,28,16,29],[24,24,24,26],[27,3,27,4],[25,3,25,4],[26,3,26,4],[15,3,15,4],[16,13,16,18],[14,13,14,18],[14,3,14,4],[25,28,25,29],[26,28,26,29],[24,3,24,4],[16,3,16,4],[17,3,17,4],[17,6,17,11],[17,13,17,18],[17,28,17,29],[20,3,20,4],[20,6,20,11],[20,13,20,18],[20,28,20,29],[12,6,12,11],[11,6,11,11],[12,13,12,18],[11,13,11,18],[0,0,1,49],[5,1,5,6],[6,1,6,6],[7,1,7,6],[4,1,4,6],[2,0,4,0],[2,12,4,12],[2,11,4,11],[2,10,4,10],[2,27,4,27],[5,44,5,49],[7,44,7,49],[2,14,4,14],[2,29,4,29],[2,43,4,43],[4,15,4,21],[4,30,4,35],[6,30,6,35],[2,13,4,13],[2,25,4,25],[2,26,4,26],[6,44,6,49],[5,15,5,21],[5,30,5,35],[6,15,6,21],[12,31,12,36],[11,31,11,36],[10,20,10,22],[7,15,7,21],[7,30,7,35],[8,15,8,21],[10,31,10,43],[12,28,12,29],[24,45,24,47],[27,31,27,36],[26,31,26,36],[27,28,27,29],[28,28,28,29],[25,31,25,36],[30,38,30,43],[29,38,29,43],[28,38,28,43],[27,38,27,43],[26,38,26,43],[25,38,25,43],[30,31,30,36],[29,31,29,36],[28,31,28,36],[30,28,30,29],[29,28,29,29],[17,31,17,36],[17,38,17,43],[18,3,18,4],[18,6,18,11],[18,13,18,18],[18,28,18,29],[18,31,18,36],[18,38,18,43],[19,3,19,4],[19,6,19,11],[19,13,19,18],[19,28,19,29],[19,31,19,36],[19,38,19,43],[20,31,20,36],[20,38,20,43],[21,3,21,4],[21,6,21,11],[21,13,21,18],[21,28,21,29],[21,31,21,36],[21,38,21,43],[22,3,22,4],[22,6,22,11],[22,13,22,18],[22,28,22,29],[22,31,22,36],[22,38,22,43],[31,3,31,4],[31,6,31,11],[31,13,31,18],[31,28,31,29],[31,31,31,36],[31,38,31,43],[32,3,32,4],[32,6,32,11],[32,13,32,18],[32,28,32,29],[32,31,32,36],[32,38,32,43],[33,3,33,4],[33,6,33,11],[33,13,33,18],[33,28,33,29],[33,31,33,36],[33,38,33,43],[34,3,34,4],[34,6,34,11],[34,13,34,18],[34,28,34,29],[34,31,34,36],[34,38,34,43],[35,3,35,4],[35,6,35,11],[35,13,35,18],[35,28,35,29],[35,31,35,36],[35,38,35,43],[36,3,36,4],[36,6,36,11],[36,13,36,18],[36,28,36,29],[36,31,36,36],[36,38,36,43]]}
["Schoonhoven E TOERNOOI 2014",null,null,null,null,null,null,null,null,null,null,null,null,null,null,null,null,null,null,null,null,null,null,null,null,null,null,null,null,null,null,null,null,null,null,null,null,null,null,null,null,null,null,null,null,null,null,null,null,null,{"$f":"COUNTA(U12:W17)","v":18},{"$f":"COUNTA(AT12:AV17)","v":18},{"$f":"COUNTA(U26:W31)","v":18},{"$f":"COUNTA(AT26:AV31)","v":18},null,null,null,null,null,null,null,{"$f":"VALUE(A6)","v":2},{"$f":"B6","v":"Schoonhoven E1"},{"$f":"VALUE(O6)","v":2},{"$f":"P6","v":"Schoonhoven E3"},{"$f":"VALUE(AD6)","v":3},{"$f":"AE6","v":"Schoonhoven E5"},{"$f":"VALUE(AR6)","v":4},{"$f":"AS6","v":"Schoonhoven E7"}]
[null,null,null,null,null,null,null,null,null,null,null,null,null,null,null,null,null,null,null,null,null,null,null,null,null,null,null,null,null,null,null,null,null,null,null,null,null,null,null,null,null,null,null,null,null,null,null,null,null,null,null,null,null,null,null,null,null,null,null,null,null,{"$f":"VALUE(A7)","v":4},{"$f":"B7","v":"Cabauw E1"},{"$f":"VALUE(O7)","v":1},{"$f":"P7","v":"Cabauw E2"},{"$f":"VALUE(AD7)","v":1},{"$f":"AE7","v":"Lekkerkerk E2"},{"$f":"VALUE(AR7)","v":2},{"$f":"AS7","v":"Stolwijk E2"}]
["Stand",null,null,null,null,null,null,null,null,null,"Gewonnen","Gelijk","Verloren","Saldo","Stand",null,null,null,null,null,null,null,null,null,null,"Gewonnen","Gelijk","Verloren","Saldo","Stand",null,null,null,null,null,null,null,null,null,"Gewonnen","Gelijk","Verloren","Saldo","Stand",null,null,null,null,null,null,null,null,null,"Gewonnen","Gelijk","Verloren","Saldo",null,null,null,null,{"$f":"VALUE(A8)","v":3},{"$f":"B8","v":"Jodan Boys E2"},{"$f":"VALUE(O8)","v":3},{"$f":"P8","v":"RKDEO E3"},{"$f":"VALUE(AD8)","v":2},{"$f":"AE8","v":"RKDEO E9"},{"$f":"VALUE(AR8)","v":1},{"$f":"AS8","v":"VFC Vlaardingen E8"}]
[null,null,null,null,null,null,null,null,null,null,null,null,null,null,null,null,null,null,null,null,null,null,null,null,null,null,null,null,null,null,null,null,null,null,null,null,null,null,null,null,null,null,null,null,null,null,null,null,null,null,null,null,null,null,null,null,null,null,null,null,null,{"$f":"VALUE(A9)","v":1},{"$f":"B9","v":"Alblasserdam E1"},{"$f":"VALUE(O9)","v":4},{"$f":"P9","v":"VV GZ E3"},{"$f":"VALUE(AD9)","v":4},{"$f":"AE9","v":"scVictorie'04 E3"},{"$f":"VALUE(AR9)","v":2},{"$f":"AS9","v":"Jodan Boys E8"}]
[null,"Groep 1",null,null,null,null,null,"V","T","P",null,null,null,null,null,"Groep 2",null,null,null,null,null,null,"V","T","P",null,null,null,null,null,"Groep 3",null,null,null,null,null,"V","T","P",null,null,null,null,null,"Groep 4",null,null,null,null,null,"V","T","P"]
[{"$f":"RANK(J6,$J$6:$J$9,0)","v":2},"Schoonhoven E1",null,null,null,null,null,{"$f":"SUMIF($G$12:$L$23,B6,$U$12:$U$23)+SUMIF($N$12:$S$23,B6,$W$12:$W$23)","v":9},{"$f":"SUMIF($G$12:$L$23,B6,$W$12:$W$23)+SUMIF($N$12:$S$23,B6,$U$12:$U$23)","v":8},{"$f":"(K6*3)+L6+(H6*0.001)-(I6*0.001)","v":9.0010000000000012},{"$f":"SUMPRODUCT(($G$12:$L$23=B6)*($Y$12:$Y$23=3))+SUMPRODUCT(($N$12:$S$23=B6)*($AA$12:$AA$23=3))","v":3},{"$f":"SUMPRODUCT(($G$12:$L$23=B6)*($Y$12:$Y$23=1))+SUMPRODUCT(($N$12:$S$23=B6)*($AA$12:$AA$23=1))","v":0},{"$f":"SUMPRODUCT(($G$12:$L$23=B6)*($Y$12:$Y$23=0))+SUMPRODUCT(($N$12:$S$23=B6)*($AA$12:$AA$23=0))","v":3},{"$f":"H6-I6","v":1},{"$f":"RANK(Y6,$Y$6:$Y$9,0)","v":2},"Schoonhoven E3",null,null,null,null,null,null,{"$f":"SUMIF($AF$12:$AK$23,P6,$AT$12:$AT$23)+SUMIF($AM$12:$AR$23,P6,$AV$12:$AV$23)","v":9},{"$f":"SUMIF($AF$12:$AK$23,P6,$AV$12:$AV$23)+SUMIF($AM$12:$AR$23,P6,$AT$12:$AT$23)","v":9},{"$f":"(Z6*3)+AA6+(W6*0.001)-(X6*0.001)","v":8},{"$f":"SUMPRODUCT(($AF$12:$AK$23=P6)*($AX$12:$AX$23=3))+SUMPRODUCT(($AM$12:$AR$23=P6)*($AZ$12:$AZ$23=3))","v":2},{"$f":"SUMPRODUCT(($AF$12:$AK$23=P6)*($AX$12:$AX$23=1))+SUMPRODUCT(($AM$12:$AR$23=P6)*($AZ$12:$AZ$23=1))","v":2},{"$f":"SUMPRODUCT(($AF$12:$AK$23=P6)*($AX$12:$AX$23=0))+SUMPRODUCT(($AM$12:$AR$23=P6)*($AZ$12:$AZ$23=0))","v":2},{"$f":"W6-X6","v":0},{"$f":"RANK(AM6,$AM$6:$AM$9,0)","v":3},"Schoonhoven E5",null,null,null,null,null,{"$f":"SUMIF($G$26:$L$37,AE6,$U$26:$U$37)+SUMIF($N$26:$S$37,AE6,$W$26:$W$37)","v":8},{"$f":"SUMIF($G$26:$L$37,AE6,$W$26:$W$37)+SUMIF($N$26:$S$37,AE6,$U$26:$U$37)","v":6},{"$f":"(AN6*3)+AO6+(AK6*0.001)-(AL6*0.001)","v":8.0019999999999989},{"$f":"SUMPRODUCT(($G$26:$L$37=AE6)*($Y$26:$Y$37=3))+SUMPRODUCT(($N$26:$S$37=AE6)*($AA$26:$AA$37=3))","v":2},{"$f":"SUMPRODUCT(($G$26:$L$37=AE6)*($Y$26:$Y$37=1))+SUMPRODUCT(($N$26:$S$37=AE6)*($AA$26:$AA$37=1))","v":2},{"$f":"SUMPRODUCT(($G$26:$L$37=AE6)*($Y$26:$Y$37=0))+SUMPRODUCT(($N$26:$S$37=AE6)*($AA$26:$AA$37=0))","v":2},{"$f":"AK6-AL6","v":2},{"$f":"RANK(BA6,$BA$6:$BA$9,0)","v":4},"Schoonhoven E7",null,null,null,null,null,{"$f":"SUMIF($AF$26:$AK$37,AS6,$AT$26:$AT$37)+SUMIF($AM$26:$AR$37,AS6,$AV$26:$AV$37)","v":7},{"$f":"SUMIF($AF$26:$AK$37,AS6,$AV$26:$AV$37)+SUMIF($AM$26:$AR$37,AS6,$AT$26:$AT$37)","v":7},{"$f":"(BB6*3)+BC6+(AY6*0.001)-(AZ6*0.001)","v":7},{"$f":"SUMPRODUCT(($AF$26:$AK$37=AS6)*($AX$26:$AX$37=3))+SUMPRODUCT(($AM$26:$AR$37=AS6)*($AZ$26:$AZ$37=3))","v":1},{"$f":"SUMPRODUCT(($AF$26:$AK$37=AS6)*($AX$26:$AX$37=1))+SUMPRODUCT(($AM$26:$AR$37=AS6)*($AZ$26:$AZ$37=1))","v":4},{"$f":"SUMPRODUCT(($AF$26:$AK$37=AS6)*($AX$26:$AX$37=0))+SUMPRODUCT(($AM$26:$AR$37=AS6)*($AZ$26:$AZ$37=0))","v":1},{"$f":"AY6-AZ6","v":0}]
[{"$f":"RANK(J7,$J$6:$J$9,0)","v":4},"Cabauw E1",null,null,null,null,null,{"$f":"SUMIF($G$12:$L$23,B7,$U$12:$U$23)+SUMIF($N$12:$S$23,B7,$W$12:$W$23)","v":13},{"$f":"SUMIF($G$12:$L$23,B7,$W$12:$W$23)+SUMIF($N$12:$S$23,B7,$U$12:$U$23)","v":17},{"$f":"(K7*3)+L7+(H7*0.001)-(I7*0.001)","v":8.9960000000000004},{"$f":"SUMPRODUCT(($G$12:$L$23=B7)*($Y$12:$Y$23=3))+SUMPRODUCT(($N$12:$S$23=B7)*($AA$12:$AA$23=3))","v":3},{"$f":"SUMPRODUCT(($G$12:$L$23=B7)*($Y$12:$Y$23=1))+SUMPRODUCT(($N$12:$S$23=B7)*($AA$12:$AA$23=1))","v":0},{"$f":"SUMPRODUCT(($G$12:$L$23=B7)*($Y$12:$Y$23=0))+SUMPRODUCT(($N$12:$S$23=B7)*($AA$12:$AA$23=0))","v":3},{"$f":"H7-I7","v":-4},{"$f":"RANK(Y7,$Y$6:$Y$9,0)","v":1},"Cabauw E2",null,null,null,null,null,null,{"$f":"SUMIF($AF$12:$AK$23,P7,$AT$12:$AT$23)+SUMIF($AM$12:$AR$23,P7,$AV$12:$AV$23)","v":10},{"$f":"SUMIF($AF$12:$AK$23,P7,$AV$12:$AV$23)+SUMIF($AM$12:$AR$23,P7,$AT$12:$AT$23)","v":9},{"$f":"(Z7*3)+AA7+(W7*0.001)-(X7*0.001)","v":10.000999999999999},{"$f":"SUMPRODUCT(($AF$12:$AK$23=P7)*($AX$12:$AX$23=3))+SUMPRODUCT(($AM$12:$AR$23=P7)*($AZ$12:$AZ$23=3))","v":3},{"$f":"SUMPRODUCT(($AF$12:$AK$23=P7)*($AX$12:$AX$23=1))+SUMPRODUCT(($AM$12:$AR$23=P7)*($AZ$12:$AZ$23=1))","v":1},{"$f":"SUMPRODUCT(($AF$12:$AK$23=P7)*($AX$12:$AX$23=0))+SUMPRODUCT(($AM$12:$AR$23=P7)*($AZ$12:$AZ$23=0))","v":2},{"$f":"W7-X7","v":1},{"$f":"RANK(AM7,$AM$6:$AM$9,0)","v":1},"Lekkerkerk E2",null,null,null,null,null,{"$f":"SUMIF($G$26:$L$37,AE7,$U$26:$U$37)+SUMIF($N$26:$S$37,AE7,$W$26:$W$37)","v":9},{"$f":"SUMIF($G$26:$L$37,AE7,$W$26:$W$37)+SUMIF($N$26:$S$37,AE7,$U$26:$U$37)","v":8},{"$f":"(AN7*3)+AO7+(AK7*0.001)-(AL7*0.001)","v":9.0010000000000012},{"$f":"SUMPRODUCT(($G$26:$L$37=AE7)*($Y$26:$Y$37=3))+SUMPRODUCT(($N$26:$S$37=AE7)*($AA$26:$AA$37=3))","v":3},{"$f":"SUMPRODUCT(($G$26:$L$37=AE7)*($Y$26:$Y$37=1))+SUMPRODUCT(($N$26:$S$37=AE7)*($AA$26:$AA$37=1))","v":0},{"$f":"SUMPRODUCT(($G$26:$L$37=AE7)*($Y$26:$Y$37=0))+SUMPRODUCT(($N$26:$S$37=AE7)*($AA$26:$AA$37=0))","v":3},{"$f":"AK7-AL7","v":1},{"$f":"RANK(BA7,$BA$6:$BA$9,0)","v":2},"Stolwijk E2",null,null,null,null,null,{"$f":"SUMIF($AF$26:$AK$37,AS7,$AT$26:$AT$37)+SUMIF($AM$26:$AR$37,AS7,$AV$26:$AV$37)","v":7},{"$f":"SUMIF($AF$26:$AK$37,AS7,$AV$26:$AV$37)+SUMIF($AM$26:$AR$37,AS7,$AT$26:$AT$37)","v":7},{"$f":"(BB7*3)+BC7+(AY7*0.001)-(AZ7*0.001)","v":8},{"$f":"SUMPRODUCT(($AF$26:$AK$37=AS7)*($AX$26:$AX$37=3))+SUMPRODUCT(($AM$26:$AR$37=AS7)*($AZ$26:$AZ$37=3))","v":2},{"$f":"SUMPRODUCT(($AF$26:$AK$37=AS7)*($AX$26:$AX$37=1))+SUMPRODUCT(($AM$26:$AR$37=AS7)*($AZ$26:$AZ$37=1))","v":2},{"$f":"SUMPRODUCT(($AF$26:$AK$37=AS7)*($AX$26:$AX$37=0))+SUMPRODUCT(($AM$26:$AR$37=AS7)*($AZ$26:$AZ$37=0))","v":2},{"$f":"AY7-AZ7","v":0}]
[{"$f":"RANK(J8,$J$6:$J$9,0)","v":3},"Jodan Boys E2",null,null,null,null,null,{"$f":"SUMIF($G$12:$L$23,B8,$U$12:$U$23)+SUMIF($N$12:$S$23,B8,$W$12:$W$23)","v":10},{"$f":"SUMIF($G$12:$L$23,B8,$W$12:$W$23)+SUMIF($N$12:$S$23,B8,$U$12:$U$23)","v":10},{"$f":"(K8*3)+L8+(H8*0.001)-(I8*0.001)","v":9},{"$f":"SUMPRODUCT(($G$12:$L$23=B8)*($Y$12:$Y$23=3))+SUMPRODUCT(($N$12:$S$23=B8)*($AA$12:$AA$23=3))","v":3},{"$f":"SUMPRODUCT(($G$12:$L$23=B8)*($Y$12:$Y$23=1))+SUMPRODUCT(($N$12:$S$23=B8)*($AA$12:$AA$23=1))","v":0},{"$f":"SUMPRODUCT(($G$12:$L$23=B8)*($Y$12:$Y$23=0))+SUMPRODUCT(($N$12:$S$23=B8)*($AA$12:$AA$23=0))","v":3},{"$f":"H8-I8","v":0},{"$f":"RANK(Y8,$Y$6:$Y$9,0)","v":3},"RKDEO E3",null,null,null,null,null,null,{"$f":"SUMIF($AF$12:$AK$23,P8,$AT$12:$AT$23)+SUMIF($AM$12:$AR$23,P8,$AV$12:$AV$23)","v":8},{"$f":"SUMIF($AF$12:$AK$23,P8,$AV$12:$AV$23)+SUMIF($AM$12:$AR$23,P8,$AT$12:$AT$23)","v":8},{"$f":"(Z8*3)+AA8+(W8*0.001)-(X8*0.001)","v":7.9999999999999991},{"$f":"SUMPRODUCT(($AF$12:$AK$23=P8)*($AX$12:$AX$23=3))+SUMPRODUCT(($AM$12:$AR$23=P8)*($AZ$12:$AZ$23=3))","v":2},{"$f":"SUMPRODUCT(($AF$12:$AK$23=P8)*($AX$12:$AX$23=1))+SUMPRODUCT(($AM$12:$AR$23=P8)*($AZ$12:$AZ$23=1))","v":2},{"$f":"SUMPRODUCT(($AF$12:$AK$23=P8)*($AX$12:$AX$23=0))+SUMPRODUCT(($AM$12:$AR$23=P8)*($AZ$12:$AZ$23=0))","v":2},{"$f":"W8-X8","v":0},{"$f":"RANK(AM8,$AM$6:$AM$9,0)","v":2},"RKDEO E9",null,null,null,null,null,{"$f":"SUMIF($G$26:$L$37,AE8,$U$26:$U$37)+SUMIF($N$26:$S$37,AE8,$W$26:$W$37)","v":11},{"$f":"SUMIF($G$26:$L$37,AE8,$W$26:$W$37)+SUMIF($N$26:$S$37,AE8,$U$26:$U$37)","v":14},{"$f":"(AN8*3)+AO8+(AK8*0.001)-(AL8*0.001)","v":8.9969999999999999},{"$f":"SUMPRODUCT(($G$26:$L$37=AE8)*($Y$26:$Y$37=3))+SUMPRODUCT(($N$26:$S$37=AE8)*($AA$26:$AA$37=3))","v":3},{"$f":"SUMPRODUCT(($G$26:$L$37=AE8)*($Y$26:$Y$37=1))+SUMPRODUCT(($N$26:$S$37=AE8)*($AA$26:$AA$37=1))","v":0},{"$f":"SUMPRODUCT(($G$26:$L$37=AE8)*($Y$26:$Y$37=0))+SUMPRODUCT(($N$26:$S$37=AE8)*($AA$26:$AA$37=0))","v":3},{"$f":"AK8-AL8","v":-3},{"$f":"RANK(BA8,$BA$6:$BA$9,0)","v":1},"VFC Vlaardingen E8",null,null,null,null,null,{"$f":"SUMIF($AF$26:$AK$37,AS8,$AT$26:$AT$37)+SUMIF($AM$26:$AR$37,AS8,$AV$26:$AV$37)","v":10},{"$f":"SUMIF($AF$26:$AK$37,AS8,$AV$26:$AV$37)+SUMIF($AM$26:$AR$37,AS8,$AT$26:$AT$37)","v":10},{"$f":"(BB8*3)+BC8+(AY8*0.001)-(AZ8*0.001)","v":9},{"$f":"SUMPRODUCT(($AF$26:$AK$37=AS8)*($AX$26:$AX$37=3))+SUMPRODUCT(($AM$26:$AR$37=AS8)*($AZ$26:$AZ$37=3))","v":3},{"$f":"SUMPRODUCT(($AF$26:$AK$37=AS8)*($AX$26:$AX$37=1))+SUMPRODUCT(($AM$26:$AR$37=AS8)*($AZ$26:$AZ$37=1))","v":0},{"$f":"SUMPRODUCT(($AF$26:$AK$37=AS8)*($AX$26:$AX$37=0))+SUMPRODUCT(($AM$26:$AR$37=AS8)*($AZ$26:$AZ$37=0))","v":3},{"$f":"AY8-AZ8","v":0}]
[{"$f":"RANK(J9,$J$6:$J$9,0)","v":1},"Alblasserdam E1",null,null,null,null,null,{"$f":"SUMIF($G$12:$L$23,B9,$U$12:$U$23)+SUMIF($N$12:$S$23,B9,$W$12:$W$23)","v":15},{"$f":"SUMIF($G$12:$L$23,B9,$W$12:$W$23)+SUMIF($N$12:$S$23,B9,$U$12:$U$23)","v":12},{"$f":"(K9*3)+L9+(H9*0.001)-(I9*0.001)","v":9.0030000000000001},{"$f":"SUMPRODUCT(($G$12:$L$23=B9)*($Y$12:$Y$23=3))+SUMPRODUCT(($N$12:$S$23=B9)*($AA$12:$AA$23=3))","v":3},{"$f":"SUMPRODUCT(($G$12:$L$23=B9)*($Y$12:$Y$23=1))+SUMPRODUCT(($N$12:$S$23=B9)*($AA$12:$AA$23=1))","v":0},{"$f":"SUMPRODUCT(($G$12:$L$23=B9)*($Y$12:$Y$23=0))+SUMPRODUCT(($N$12:$S$23=B9)*($AA$12:$AA$23=0))","v":3},{"$f":"H9-I9","v":3},{"$f":"RANK(Y9,$Y$6:$Y$9,0)","v":4},"VV GZ E3",null,null,null,null,null,null,{"$f":"SUMIF($AF$12:$AK$23,P9,$AT$12:$AT$23)+SUMIF($AM$12:$AR$23,P9,$AV$12:$AV$23)","v":6},{"$f":"SUMIF($AF$12:$AK$23,P9,$AV$12:$AV$23)+SUMIF($AM$12:$AR$23,P9,$AT$12:$AT$23)","v":7},{"$f":"(Z9*3)+AA9+(W9*0.001)-(X9*0.001)","v":4.9990000000000006},{"$f":"SUMPRODUCT(($AF$12:$AK$23=P9)*($AX$12:$AX$23=3))+SUMPRODUCT(($AM$12:$AR$23=P9)*($AZ$12:$AZ$23=3))","v":0},{"$f":"SUMPRODUCT(($AF$12:$AK$23=P9)*($AX$12:$AX$23=1))+SUMPRODUCT(($AM$12:$AR$23=P9)*($AZ$12:$AZ$23=1))","v":5},{"$f":"SUMPRODUCT(($AF$12:$AK$23=P9)*($AX$12:$AX$23=0))+SUMPRODUCT(($AM$12:$AR$23=P9)*($AZ$12:$AZ$23=0))","v":1},{"$f":"W9-X9","v":-1},{"$f":"RANK(AM9,$AM$6:$AM$9,0)","v":4},"scVictorie'04 E3",null,null,null,null,null,{"$f":"SUMIF($G$26:$L$37,AE9,$U$26:$U$37)+SUMIF($N$26:$S$37,AE9,$W$26:$W$37)","v":8},{"$f":"SUMIF($G$26:$L$37,AE9,$W$26:$W$37)+SUMIF($N$26:$S$37,AE9,$U$26:$U$37)","v":8},{"$f":"(AN9*3)+AO9+(AK9*0.001)-(AL9*0.001)","v":7.9999999999999991},{"$f":"SUMPRODUCT(($G$26:$L$37=AE9)*($Y$26:$Y$37=3))+SUMPRODUCT(($N$26:$S$37=AE9)*($AA$26:$AA$37=3))","v":2},{"$f":"SUMPRODUCT(($G$26:$L$37=AE9)*($Y$26:$Y$37=1))+SUMPRODUCT(($N$26:$S$37=AE9)*($AA$26:$AA$37=1))","v":2},{"$f":"SUMPRODUCT(($G$26:$L$37=AE9)*($Y$26:$Y$37=0))+SUMPRODUCT(($N$26:$S$37=AE9)*($AA$26:$AA$37=0))","v":2},{"$f":"AK9-AL9","v":0},{"$f":"RANK(BA9,$BA$6:$BA$9,0)","v":2},"Jodan Boys E8",null,null,null,null,null,{"$f":"SUMIF($AF$26:$AK$37,AS9,$AT$26:$AT$37)+SUMIF($AM$26:$AR$37,AS9,$AV$26:$AV$37)","v":10},{"$f":"SUMIF($AF$26:$AK$37,AS9,$AV$26:$AV$37)+SUMIF($AM$26:$AR$37,AS9,$AT$26:$AT$37)","v":10},{"$f":"(BB9*3)+BC9+(AY9*0.001)-(AZ9*0.001)","v":8},{"$f":"SUMPRODUCT(($AF$26:$AK$37=AS9)*($AX$26:$AX$37=3))+SUMPRODUCT(($AM$26:$AR$37=AS9)*($AZ$26:$AZ$37=3))","v":2},{"$f":"SUMPRODUCT(($AF$26:$AK$37=AS9)*($AX$26:$AX$37=1))+SUMPRODUCT(($AM$26:$AR$37=AS9)*($AZ$26:$AZ$37=1))","v":2},{"$f":"SUMPRODUCT(($AF$26:$AK$37=AS9)*($AX$26:$AX$37=0))+SUMPRODUCT(($AM$26:$AR$37=AS9)*($AZ$26:$AZ$37=0))","v":2},{"$f":"AY9-AZ9","v":0}]
[]
[null,null,null,"Tijd",null,null,"VELD A",null,null,null,null,null,null,null,null,null,null,null,null,null,"Uitslag",null,null,null,"Punten",null,null,null,"Tijd",null,null,"VELD B",null,null,null,null,null,null,null,null,null,null,null,null,null,"Uitslag",null,null,null,"Punten"]
[null,null,null,"14:15:00",null,null,{"$f":"B6","v":"Schoonhoven E1"},null,null,null,null,null,"--",{"$f":"B7","v":"Cabauw E1"},null,null,null,null,null,null,1,"--",2,null,{"$f":"IF(U12=\"\",\"\",IF(U12>W12,3,IF(U12=W12,1,0)))","v":0},null,{"$f":"IF(W12=\"\",\"\",IF(W12>U12,3,IF(W12=U12,1,0)))","v":3},null,"14:15:00",null,null,{"$f":"P6","v":"Schoonhoven E3"},null,null,null,null,null,"--",{"$f":"P7","v":"Cabauw E2"},null,null,null,null,null,null,1,"--",3,null,{"$f":"IF(AT12=\"\",\"\",IF(AT12>AV12,3,IF(AT12=AV12,1,0)))","v":0},null,{"$f":"IF(AV12=\"\",\"\",IF(AV12>AT12,3,IF(AV12=AT12,1,0)))","v":3}]
[null,null,null,"14:30:00",null,null,{"$f":"N19","v":"Jodan Boys E2"},null,null,null,null,null,"--",{"$f":"B9","v":"Alblasserdam E1"},null,null,null,null,null,null,2,"--",1,null,{"$f":"IF(U13=\"\",\"\",IF(U13>W13,3,IF(U13=W13,1,0)))","v":3},null,{"$f":"IF(W13=\"\",\"\",IF(W13>U13,3,IF(W13=U13,1,0)))","v":0},null,"14:30:00",null,null,{"$f":"P8","v":"RKDEO E3"},null,null,null,null,null,"--",{"$f":"P9","v":"VV GZ E3"},null,null,null,null,null,null,1,"--",1,null,{"$f":"IF(AT13=\"\",\"\",IF(AT13>AV13,3,IF(AT13=AV13,1,0)))","v":1},null,{"$f":"IF(AV13=\"\",\"\",IF(AV13>AT13,3,IF(AV13=AT13,1,0)))","v":1}]
[null,null,null,"14:45:00",null,null,{"$f":"B9","v":"Alblasserdam E1"},null,null,null,null,null,"--",{"$f":"B6","v":"Schoonhoven E1"},null,null,null,null,null,null,0,"--",2,null,{"$f":"IF(U14=\"\",\"\",IF(U14>W14,3,IF(U14=W14,1,0)))","v":0},null,3,null,"14:45:00",null,null,{"$f":"P9","v":"VV GZ E3"},null,null,null,null,null,"--",{"$f":"P6","v":"Schoonhoven E3"},null,null,null,null,null,null,2,"--",2,null,{"$f":"IF(AT14=\"\",\"\",IF(AT14>AV14,3,IF(AT14=AV14,1,0)))","v":1},null,1]
[null,null,null,"15:00:00",null,null,{"$f":"B7","v":"Cabauw E1"},null,null,null,null,null,"--",{"$f":"B8","v":"Jodan Boys E2"},null,null,null,null,null,null,3,"--",1,null,3,null,0,null,"15:00:00",null,null,{"$f":"P7","v":"Cabauw E2"},null,null,null,null,null,"--",{"$f":"P8","v":"RKDEO E3"},null,null,null,null,null,null,3,"--",2,null,3,null,0]
[null,null,null,"15:15:00",null,null,{"$f":"B7","v":"Cabauw E1"},null,null,null,null,null,"--",{"$f":"B9","v":"Alblasserdam E1"},null,null,null,null,null,null,0,"--",6,null,0,null,3,null,"15:15:00",null,null,{"$f":"P6","v":"Schoonhoven E3"},null,null,null,null,null,"--",{"$f":"P8","v":"RKDEO E3"},null,null,null,null,null,null,1,"--",0,null,3,null,0]
[null,null,null,"15:30:00",null,null,{"$f":"B6","v":"Schoonhoven E1"},null,null,null,null,null,"--",{"$f":"B8","v":"Jodan Boys E2"},null,null,null,null,null,null,1,"--",2,null,0,null,3,null,"15:30:00",null,null,{"$f":"P7","v":"Cabauw E2"},null,null,null,null,null,"--",{"$f":"P9","v":"VV GZ E3"},null,null,null,null,null,null,1,"--",0,null,3,null,0]
[null,null,null,"15:45:00",null,null,{"$f":"B7","v":"Cabauw E1"},null,null,null,null,null,"--",{"$f":"B6","v":"Schoonhoven E1"},null,null,null,null,null,null,1,"--",2,null,{"$f":"IF(U18=\"\",\"\",IF(U18>W18,3,IF(U18=W18,1,0)))","v":0},null,{"$f":"IF(W18=\"\",\"\",IF(W18>U18,3,IF(W18=U18,1,0)))","v":3},null,"15:45:00",null,null,{"$f":"P7","v":"Cabauw E2"},null,null,null,null,null,"--",{"$f":"P6","v":"Schoonhoven E3"},null,null,null,null,null,null,1,"--",3,null,{"$f":"IF(AT18=\"\",\"\",IF(AT18>AV18,3,IF(AT18=AV18,1,0)))","v":0},null,{"$f":"IF(AV18=\"\",\"\",IF(AV18>AT18,3,IF(AV18=AT18,1,0)))","v":3}]
[null,null,null,"16:00:00",null,null,{"$f":"B9","v":"Alblasserdam E1"},null,null,null,null,null,"--",{"$f":"B8","v":"Jodan Boys E2"},null,null,null,null,null,null,2,"--",1,null,{"$f":"IF(U19=\"\",\"\",IF(U19>W19,3,IF(U19=W19,1,0)))","v":3},null,{"$f":"IF(W19=\"\",\"\",IF(W19>U19,3,IF(W19=U19,1,0)))","v":0},null,"16:00:00",null,null,{"$f":"P9","v":"VV GZ E3"},null,null,null,null,null,"--",{"$f":"P8","v":"RKDEO E3"},null,null,null,null,null,null,1,"--",1,null,{"$f":"IF(AT19=\"\",\"\",IF(AT19>AV19,3,IF(AT19=AV19,1,0)))","v":1},null,{"$f":"IF(AV19=\"\",\"\",IF(AV19>AT19,3,IF(AV19=AT19,1,0)))","v":1}]
[null,null,null,"16:15:00",null,null,{"$f":"B6","v":"Schoonhoven E1"},null,null,null,null,null,"--",{"$f":"B9","v":"Alblasserdam E1"},null,null,null,null,null,null,1,"--",2,null,{"$f":"IF(U20=\"\",\"\",IF(U20>W20,3,IF(U20=W20,1,0)))","v":0},null,3,null,"16:15:00",null,null,{"$f":"P6","v":"Schoonhoven E3"},null,null,null,null,null,"--",{"$f":"P9","v":"VV GZ E3"},null,null,null,null,null,null,2,"--",2,null,{"$f":"IF(AT20=\"\",\"\",IF(AT20>AV20,3,IF(AT20=AV20,1,0)))","v":1},null,1]
[null,null,null,"16:30:00",null,null,{"$f":"B8","v":"Jodan Boys E2"},null,null,null,null,null,"--",{"$f":"B7","v":"Cabauw E1"},null,null,null,null,null,null,3,"--",1,null,3,null,0,null,"16:30:00",null,null,{"$f":"P8","v":"RKDEO E3"},null,null,null,null,null,"--",{"$f":"P7","v":"Cabauw E2"},null,null,null,null,null,null,3,"--",2,null,3,null,0]
[null,null,null,"16:45:00",null,null,{"$f":"B9","v":"Alblasserdam E1"},null,null,null,null,null,"--",{"$f":"B7","v":"Cabauw E1"},null,null,null,null,null,null,4,"--",6,null,0,null,3,null,"16:45:00",null,null,{"$f":"P8","v":"RKDEO E3"},null,null,null,null,null,"--",{"$f":"P6","v":"Schoonhoven E3"},null,null,null,null,null,null,1,"--",0,null,3,null,0]
[null,null,null,"17:00:00",null,null,{"$f":"B8","v":"Jodan Boys E2"},null,null,null,null,null,"--",{"$f":"B6","v":"Schoonhoven E1"},null,null,null,null,null,null,1,"--",2,null,0,null,3,null,"17:00:00",null,null,{"$f":"P9","v":"VV GZ E3"},null,null,null,null,null,"--",{"$f":"P7","v":"Cabauw E2"},null,null,null,null,null,null,0,"--",0,null,1,null,1]
[]
[null,null,null,"Tijd",null,null,"VELD C",null,null,null,null,null,null,null,null,null,null,null,null,null,"Uitslag",null,null,null,"Punten",null,null,null,"Tijd",null,null,"VELD D",null,null,null,null,null,null,null,null,null,null,null,null,null,"Uitslag",null,null,null,"Punten"]
[null,null,null,"14:15:00",null,null,{"$f":"AE6","v":"Schoonhoven E5"},null,null,null,null,null,"--",{"$f":"AE7","v":"Lekkerkerk E2"},null,null,null,null,null,null,0,"--",2,null,{"$f":"IF(U26=\"\",\"\",IF(U26>W26,3,IF(U26=W26,1,0)))","v":0},null,{"$f":"IF(W26=\"\",\"\",IF(W26>U26,3,IF(W26=U26,1,0)))","v":3},null,"14:15:00",null,null,{"$f":"AS6","v":"Schoonhoven E7"},null,null,null,null,null,"--",{"$f":"AS7","v":"Stolwijk E2"},null,null,null,null,null,null,1,"--",1,null,{"$f":"IF(AT26=\"\",\"\",IF(AT26>AV26,3,IF(AT26=AV26,1,0)))","v":1},null,{"$f":"IF(AV26=\"\",\"\",IF(AV26>AT26,3,IF(AV26=AT26,1,0)))","v":1}]
[null,null,null,"14:30:00",null,null,{"$f":"AE8","v":"RKDEO E9"},null,null,null,null,null,"--",{"$f":"AE9","v":"scVictorie'04 E3"},null,null,null,null,null,null,4,"--",1,null,{"$f":"IF(U27=\"\",\"\",IF(U27>W27,3,IF(U27=W27,1,0)))","v":3},null,{"$f":"IF(W27=\"\",\"\",IF(W27>U27,3,IF(W27=U27,1,0)))","v":0},null,"14:30:00",null,null,{"$f":"AS8","v":"VFC Vlaardingen E8"},null,null,null,null,null,"--",{"$f":"AS9","v":"Jodan Boys E8"},null,null,null,null,null,null,3,"--",2,null,{"$f":"IF(AT27=\"\",\"\",IF(AT27>AV27,3,IF(AT27=AV27,1,0)))","v":3},null,{"$f":"IF(AV27=\"\",\"\",IF(AV27>AT27,3,IF(AV27=AT27,1,0)))","v":0}]
[null,null,null,"14:45:00",null,null,{"$f":"AE9","v":"scVictorie'04 E3"},null,null,null,null,null,"--",{"$f":"AE6","v":"Schoonhoven E5"},null,null,null,null,null,null,1,"--",1,null,{"$f":"IF(U28=\"\",\"\",IF(U28>W28,3,IF(U28=W28,1,0)))","v":1},null,1,null,"14:45:00",null,null,{"$f":"AS9","v":"Jodan Boys E8"},null,null,null,null,null,"--",{"$f":"AS6","v":"Schoonhoven E7"},null,null,null,null,null,null,2,"--",2,null,{"$f":"IF(AT28=\"\",\"\",IF(AT28>AV28,3,IF(AT28=AV28,1,0)))","v":1},null,1]
[null,null,null,"15:00:00",null,null,{"$f":"AE7","v":"Lekkerkerk E2"},null,null,null,null,null,"--",{"$f":"AE8","v":"RKDEO E9"},null,null,null,null,null,null,2,"--",3,null,0,null,3,null,"15:00:00",null,null,{"$f":"AS7","v":"Stolwijk E2"},null,null,null,null,null,"--",{"$f":"AS8","v":"VFC Vlaardingen E8"},null,null,null,null,null,null,1,"--",3,null,0,null,3]
[null,null,null,"15:15:00",null,null,{"$f":"AE6","v":"Schoonhoven E5"},null,null,null,null,null,"--",{"$f":"AE8","v":"RKDEO E9"},null,null,null,null,null,null,0,"--",1,null,0,null,3,null,"15:15:00",null,null,{"$f":"AS7","v":"Stolwijk E2"},null,null,null,null,null,"--",{"$f":"AS9","v":"Jodan Boys E8"},null,null,null,null,null,null,0,"--",1,null,0,null,3]
[null,null,null,"15:30:00",null,null,{"$f":"AE9","v":"scVictorie'04 E3"},null,null,null,null,null,"--",{"$f":"AE7","v":"Lekkerkerk E2"},null,null,null,null,null,null,1,"--",0,null,3,null,0,null,"15:30:00",null,null,{"$f":"AS6","v":"Schoonhoven E7"},null,null,null,null,null,"--",{"$f":"AS8","v":"VFC Vlaardingen E8"},null,null,null,null,null,null,0,"--",1,null,0,null,3]
[null,null,null,"15:45:00",null,null,{"$f":"AE7","v":"Lekkerkerk E2"},null,null,null,null,null,"--",{"$f":"AE6","v":"Schoonhoven E5"},null,null,null,null,null,null,1,"--",2,null,{"$f":"IF(U32=\"\",\"\",IF(U32>W32,3,IF(U32=W32,1,0)))","v":0},null,{"$f":"IF(W32=\"\",\"\",IF(W32>U32,3,IF(W32=U32,1,0)))","v":3},null,"15:45:00",null,null,{"$f":"AS7","v":"Stolwijk E2"},null,null,null,null,null,"--",{"$f":"AS6","v":"Schoonhoven E7"},null,null,null,null,null,null,1,"--",1,null,{"$f":"IF(AT32=\"\",\"\",IF(AT32>AV32,3,IF(AT32=AV32,1,0)))","v":1},null,{"$f":"IF(AV32=\"\",\"\",IF(AV32>AT32,3,IF(AV32=AT32,1,0)))","v":1}]
[null,null,null,"16:00:00",null,null,{"$f":"AE9","v":"scVictorie'04 E3"},null,null,null,null,null,"--",{"$f":"AE8","v":"RKDEO E9"},null,null,null,null,null,null,4,"--",1,null,{"$f":"IF(U33=\"\",\"\",IF(U33>W33,3,IF(U33=W33,1,0)))","v":3},null,{"$f":"IF(W33=\"\",\"\",IF(W33>U33,3,IF(W33=U33,1,0)))","v":0},null,"16:00:00",null,null,{"$f":"AS9","v":"Jodan Boys E8"},null,null,null,null,null,"--",{"$f":"AS8","v":"VFC Vlaardingen E8"},null,null,null,null,null,null,3,"--",2,null,{"$f":"IF(AT33=\"\",\"\",IF(AT33>AV33,3,IF(AT33=AV33,1,0)))","v":3},null,{"$f":"IF(AV33=\"\",\"\",IF(AV33>AT33,3,IF(AV33=AT33,1,0)))","v":0}]
[null,null,null,"16:15:00",null,null,{"$f":"AE6","v":"Schoonhoven E5"},null,null,null,null,null,"--",{"$f":"AE9","v":"scVictorie'04 E3"},null,null,null,null,null,null,1,"--",1,null,{"$f":"IF(U34=\"\",\"\",IF(U34>W34,3,IF(U34=W34,1,0)))","v":1},null,1,null,"16:15:00",null,null,{"$f":"AS6","v":"Schoonhoven E7"},null,null,null,null,null,"--",{"$f":"AS9","v":"Jodan Boys E8"},null,null,null,null,null,null,2,"--",2,null,{"$f":"IF(AT34=\"\",\"\",IF(AT34>AV34,3,IF(AT34=AV34,1,0)))","v":1},null,1]
[null,null,null,"16:30:00",null,null,{"$f":"AE8","v":"RKDEO E9"},null,null,null,null,null,"--",{"$f":"AE7","v":"Lekkerkerk E2"},null,null,null,null,null,null,2,"--",3,null,0,null,3,null,"16:30:00",null,null,{"$f":"AS8","v":"VFC Vlaardingen E8"},null,null,null,null,null,"--",{"$f":"AS7","v":"Stolwijk E2"},null,null,null,null,null,null,1,"--",3,null,0,null,3]
[null,null,null,"16:45:00",null,null,{"$f":"AE8","v":"RKDEO E9"},null,null,null,null,null,"--",{"$f":"AE6","v":"Schoonhoven E5"},null,null,null,null,null,null,0,"--",4,null,0,null,3,null,"16:45:00",null,null,{"$f":"AS9","v":"Jodan Boys E8"},null,null,null,null,null,"--",{"$f":"AS7","v":"Stolwijk E2"},null,null,null,null,null,null,0,"--",1,null,0,null,3]
[null,null,null,"17:00:00",null,null,{"$f":"AE7","v":"Lekkerkerk E2"},null,null,null,null,null,"--",{"$f":"AE9","v":"scVictorie'04 E3"},null,null,null,null,null,null,1,"--",0,null,3,null,0,null,"17:00:00",null,null,{"$f":"AS8","v":"VFC Vlaardingen E8"},null,null,null,null,null,"--",{"$f":"AS6","v":"Schoonhoven E7"},null,null,null,null,null,null,0,"--",1,null,0,null,3]
[]
[]
[]
[null,null,null,"Kwart finales / Halve finales /  Finales op het volgende blad!"]

{"sheet":"Finale","index":1,"n_rows":21,"n_cols":57,"rows_kept":21,"cut":false,"hidden":false,"merged":[[20,12,22,18],[2,0,2,1],[2,3,2,6],[2,8,2,11],[5,0,5,1],[15,7,15,8],[5,16,5,17],[6,3,6,6],[6,8,6,11],[2,24,2,27],[3,3,3,6],[3,8,3,11],[3,24,3,27],[3,19,3,22],[0,3,0,27],[8,3,8,27],[10,0,10,1],[10,24,10,27],[10,19,10,22],[10,8,10,11],[10,3,10,6],[6,24,6,27],[5,24,5,27],[5,19,5,22],[10,16,10,17],[6,19,6,22],[5,3,5,6],[2,16,2,17],[2,19,2,22],[5,8,5,11],[11,24,11,27],[11,19,11,22],[11,8,11,11],[11,3,11,6],[18,12,18,18],[16,11,16,14],[16,16,16,19],[15,16,15,19],[15,11,15,14],[13,3,13,27]]}
[null,null,null,"Kwartfinale",null,null,null,null,null,null,null,null,null,null,null,null,null,null,null,null,null,null,null,null,null,null,null,null,null,null,null,null,null,null,null,null,null,null,null,null,null,null,null,null,null,null,null,null,{"$f":"Poules!AY1","v":18},{"$f":"Poules!BJ1","v":2},{"$f":"Poules!BK1","v":"Schoonhoven E1"},{"$f":"Poules!BL1","v":2},{"$f":"Poules!BM1","v":"Schoonhoven E3"},{"$f":"Poules!BN1","v":3},{"$f":"Poules!BO1","v":"Schoonhoven E5"},{"$f":"Poules!BP1","v":4},{"$f":"Poules!BQ1","v":"Schoonhoven E7"}]
[null,null,null,null,null,null,null,null,null,null,null,null,null,null,null,null,null,null,null,null,null,null,null,null,null,null,null,null,null,null,null,null,null,null,null,null,null,null,null,null,null,null,null,null,null,null,null,null,{"$f":"Poules!AZ1","v":18},{"$f":"Poules!BJ2","v":4},{"$f":"Poules!BK2","v":"Cabauw E1"},{"$f":"Poules!BL2","v":1},{"$f":"Poules!BM2","v":"Cabauw E2"},{"$f":"Poules!BN2","v":1},{"$f":"Poules!BO2","v":"Lekkerkerk E2"},{"$f":"Poules!BP2","v":2},{"$f":"Poules!BQ2","v":"Stolwijk E2"}]
["16:30:00",null,"A","Nr 1 groep 1",null,null,null,null,"Nr 2 groep 3",null,null,null,null,null,null,null,"16:30:00",null,"B","Nr 1 groep 2",null,null,null,null,"Nr 2 groep 4",null,null,null,null,null,null,null,null,null,null,null,null,null,null,null,null,null,null,null,null,null,null,null,{"$f":"Poules!BA1","v":18},{"$f":"Poules!BJ3","v":3},{"$f":"Poules!BK3","v":"Jodan Boys E2"},{"$f":"Poules!BL3","v":3},{"$f":"Poules!BM3","v":"RKDEO E3"},{"$f":"Poules!BN3","v":2},{"$f":"Poules!BO3","v":"RKDEO E9"},{"$f":"Poules!BP3","v":1},{"$f":"Poules!BQ3","v":"VFC Vlaardingen E8"}]
[null,null,null,{"$f":"IF(AW1=18,VLOOKUP(1,AX1:AY4,2,0),\"\")","v":"Alblasserdam E1"},null,null,null,"--",{"$f":"IF(AW3=18,VLOOKUP(2,BB1:BC4,2,0),\"\")","v":"RKDEO E9"},null,null,null,null,null,"-",null,null,null,null,{"$f":"IF(AW2=18,VLOOKUP(1,AZ1:BA4,2,0),\"\")","v":"Cabauw E2"},null,null,null,"--",{"$f":"IF(AW4=18,VLOOKUP(2,BD1:BE4,2,0),\"\")","v":"Stolwijk E2"},null,null,null,null,null,"-",null,null,null,null,null,null,null,null,null,null,null,null,null,null,null,null,null,{"$f":"Poules!BB1","v":18},{"$f":"Poules!BJ4","v":1},{"$f":"Poules!BK4","v":"Alblasserdam E1"},{"$f":"Poules!BL4","v":4},{"$f":"Poules!BM4","v":"VV GZ E3"},{"$f":"Poules!BN4","v":4},{"$f":"Poules!BO4","v":"scVictorie'04 E3"},{"$f":"Poules!BP4","v":2},{"$f":"Poules!BQ4","v":"Jodan Boys E8"}]
[]
["16:30:00",null,"C","Nr 2 groep 1",null,null,null,null,"Nr 1 groep 3",null,null,null,null,null,null,null,"16:30:00",null,"D","Nr 2 groep 2",null,null,null,null,"Nr 1 groep 4"]
[null,null,null,{"$f":"IF(AW3=18,VLOOKUP(2,AX1:AY4,2,0),\"\")","v":"Schoonhoven E1"},null,null,null,null,{"$f":"IF(AW2=18,VLOOKUP(1,BB1:BC4,2,0),\"\")","v":"Lekkerkerk E2"},null,null,null,null,null,"-",null,null,null,null,{"$f":"IF(AW4=18,VLOOKUP(2,AZ1:BA4,2,0),\"\")","v":"Schoonhoven E3"},null,null,null,null,{"$f":"IF(AW1=18,VLOOKUP(1,BD1:BE4,2,0),\"\")","v":"VFC Vlaardingen E8"},null,null,null,null,null,"-"]
[]
[null,null,null,"Halve finale"]
[]
["16:45:00",null,"E","Winnaar A",null,null,null,null,"Winnaar B",null,null,null,null,null,null,null,"16:45:00",null,"F","Winnaar C",null,null,null,null,"Winnaar D"]
[null,null,null,{"$f":"IF(N4=\"\",\"\",IF(N4>P4,D4,I4))","v":""},null,null,null,null,{"$f":"IF(AD4=\"\",\"\",IF(AD4>AF4,T4,Y4))","v":""},null,null,null,null,null,"-",null,null,null,null,{"$f":"IF(N7=\"\",\"\",IF(N7>P7,D7,I7))","v":""},null,null,null,null,{"$f":"IF(AD7=\"\",\"\",IF(AD7>AF7,T7,Y7))","v":""},null,null,null,null,null,"-"]
[]
[null,null,null,"Finale"]
[]
[null,null,null,null,null,null,null,"17:05:00",null,null,null,"Winnaar E",null,null,null,null,"Winnaar F"]
[null,null,null,null,null,null,null,null,null,null,null,{"$f":"IF(N12=\"\",\"\",IF(N12>P12,D12,I12))","v":""},null,null,null,null,{"$f":"IF(AD12=\"\",\"\",IF(AD12>AF12,T12,Y12))","v":""},null,null,null,null,1,"-",2]
[]
[null,null,null,null,null,null,null,null,null,null,null,null,"Winnaar E-toernooi"]
[]
[null,null,null,null,null,null,null,null,null,null,null,null,{"$f":"IF(V17=\"\",\"\",IF(V17>X17,L17,Q17))","v":""}]

{"sheet":"GROEP-1","index":2,"n_rows":25,"n_cols":15,"rows_kept":25,"cut":false,"hidden":false,"merged":[[21,1,21,6],[18,10,20,10],[9,2,9,3],[9,5,9,6],[4,0,4,1],[5,0,5,1],[5,2,5,3],[4,2,4,3],[4,5,4,6],[5,5,5,6],[8,0,8,1],[9,0,9,1],[6,2,6,3],[6,5,6,6],[8,2,8,3],[8,5,8,6],[18,8,20,8],[18,9,20,9],[18,11,20,11],[18,12,20,12],[18,13,20,13],[0,14,2,15],[0,0,2,13],[22,1,22,6],[23,1,23,6],[24,1,24,6],[18,0,20,0],[3,0,3,1],[3,2,3,6],[3,7,3,9],[7,2,7,3],[7,5,7,6],[6,0,6,1],[7,0,7,1],[3,11,3,13],[18,1,20,6],[18,7,20,7],[10,0,10,1],[10,2,10,3],[10,5,10,6],[11,0,11,1],[11,2,11,3],[11,5,11,6],[12,0,12,1],[12,2,12,3],[12,5,12,6],[13,0,13,1],[13,2,13,3],[13,5,13,6],[14,0,14,1],[14,2,14,3],[14,5,14,6],[15,0,15,1],[15,2,15,3],[15,5,15,6]]}
["SCHOONHOVEN TOERNOOI",null,null,null,null,null,null,null,null,null,null,null,null,null,"Scores door:\nOnlineExcelCursus.NL"]
[]
[]
[{"$f":"Poules!D11","v":"Tijd"},{"$f":"Poules!E11","v":0},{"$f":"Poules!G11","v":"VELD A"},null,null,null,null,{"$f":"Poules!U11","v":"Uitslag"},null,null,null,{"$f":"Poules!Y11","v":"Punten"}]
[{"$f":"Poules!D12","v":"14:15:00"},{"$f":"Poules!E12","v":"00:00:00"},{"$f":"Poules!G12","v":"Schoonhoven E1"},{"$f":"Poules!H12","v":0},{"$f":"Poules!M12","v":"--"},{"$f":"Poules!N12","v":"Cabauw E1"},{"$f":"Poules!O12","v":0},{"$f":"Poules!U12","v":1},{"$f":"Poules!V12","v":"--"},{"$f":"Poules!W12","v":2},null,{"$f":"Poules!Y12","v":0},null,{"$f":"Poules!AA12","v":3}]
[{"$f":"Poules!D13","v":"14:30:00"},{"$f":"Poules!E13","v":"00:00:00"},{"$f":"Poules!G13","v":"Jodan Boys E2"},{"$f":"Poules!H13","v":0},{"$f":"Poules!M13","v":"--"},{"$f":"Poules!N13","v":"Alblasserdam E1"},{"$f":"Poules!O13","v":0},{"$f":"Poules!U13","v":2},{"$f":"Poules!V13","v":"--"},{"$f":"Poules!W13","v":1},null,{"$f":"Poules!Y13","v":3},null,{"$f":"Poules!AA13","v":0}]
[{"$f":"Poules!D14","v":"14:45:00"},{"$f":"Poules!E14","v":"00:00:00"},{"$f":"Poules!G14","v":"Alblasserdam E1"},{"$f":"Poules!H14","v":0},{"$f":"Poules!M14","v":"--"},{"$f":"Poules!N14","v":"Schoonhoven E1"},{"$f":"Poules!O14","v":0},{"$f":"Poules!U14","v":0},{"$f":"Poules!V14","v":"--"},{"$f":"Poules!W14","v":2},null,{"$f":"Poules!Y14","v":0},null,{"$f":"Poules!AA14","v":3}]
[{"$f":"Poules!D15","v":"15:00:00"},{"$f":"Poules!E15","v":"00:00:00"},{"$f":"Poules!G15","v":"Cabauw E1"},{"$f":"Poules!H15","v":0},{"$f":"Poules!M15","v":"--"},{"$f":"Poules!N15","v":"Jodan Boys E2"},{"$f":"Poules!O15","v":0},{"$f":"Poules!U15","v":3},{"$f":"Poules!V15","v":"--"},{"$f":"Poules!W15","v":1},null,{"$f":"Poules!Y15","v":3},null,{"$f":"Poules!AA15","v":0}]
[{"$f":"Poules!D16","v":"15:15:00"},{"$f":"Poules!E16","v":"00:00:00"},{"$f":"Poules!G16","v":"Cabauw E1"},{"$f":"Poules!H16","v":0},{"$f":"Poules!M16","v":"--"},{"$f":"Poules!N16","v":"Alblasserdam E1"},{"$f":"Poules!O16","v":0},{"$f":"Poules!U16","v":0},{"$f":"Poules!V16","v":"--"},{"$f":"Poules!W16","v":6},null,{"$f":"Poules!Y16","v":0},null,{"$f":"Poules!AA16","v":3}]
[{"$f":"Poules!D17","v":"15:30:00"},{"$f":"Poules!E17","v":"00:00:00"},{"$f":"Poules!G17","v":"Schoonhoven E1"},{"$f":"Poules!H17","v":0},{"$f":"Poules!M17","v":"--"},{"$f":"Poules!N17","v":"Jodan Boys E2"},{"$f":"Poules!O17","v":0},{"$f":"Poules!U17","v":1},{"$f":"Poules!V17","v":"--"},{"$f":"Poules!W17","v":2},null,{"$f":"Poules!Y17","v":0},null,{"$f":"Poules!AA17","v":3}]
[{"$f":"Poules!D18","v":"15:45:00"},{"$f":"Poules!E18","v":"00:00:00"},{"$f":"Poules!G18","v":"Cabauw E1"},{"$f":"Poules!H18","v":0},{"$f":"Poules!M18","v":"--"},{"$f":"Poules!N18","v":"Schoonhoven E1"},{"$f":"Poules!O18","v":0},{"$f":"Poules!U18","v":1},{"$f":"Poules!V18","v":"--"},{"$f":"Poules!W18","v":2},null,{"$f":"Poules!Y18","v":0},null,{"$f":"Poules!AA18","v":3}]
[{"$f":"Poules!D19","v":"16:00:00"},{"$f":"Poules!E19","v":"00:00:00"},{"$f":"Poules!G19","v":"Alblasserdam E1"},{"$f":"Poules!H19","v":0},{"$f":"Poules!M19","v":"--"},{"$f":"Poules!N19","v":"Jodan Boys E2"},{"$f":"Poules!O19","v":0},{"$f":"Poules!U19","v":2},{"$f":"Poules!V19","v":"--"},{"$f":"Poules!W19","v":1},null,{"$f":"Poules!Y19","v":3},null,{"$f":"Poules!AA19","v":0}]
[{"$f":"Poules!D20","v":"16:15:00"},{"$f":"Poules!E20","v":"00:00:00"},{"$f":"Poules!G20","v":"Schoonhoven E1"},{"$f":"Poules!H20","v":0},{"$f":"Poules!M20","v":"--"},{"$f":"Poules!N20","v":"Alblasserdam E1"},{"$f":"Poules!O20","v":0},{"$f":"Poules!U20","v":1},{"$f":"Poules!V20","v":"--"},{"$f":"Poules!W20","v":2},null,{"$f":"Poules!Y20","v":0},null,{"$f":"Poules!AA20","v":3}]
[{"$f":"Poules!D21","v":"16:30:00"},{"$f":"Poules!E21","v":"00:00:00"},{"$f":"Poules!G21","v":"Jodan Boys E2"},{"$f":"Poules!H21","v":0},{"$f":"Poules!M21","v":"--"},{"$f":"Poules!N21","v":"Cabauw E1"},{"$f":"Poules!O21","v":0},{"$f":"Poules!U21","v":3},{"$f":"Poules!V21","v":"--"},{"$f":"Poules!W21","v":1},null,{"$f":"Poules!Y21","v":3},null,{"$f":"Poules!AA21","v":0}]
[{"$f":"Poules!D22","v":"16:45:00"},{"$f":"Poules!E22","v":"00:00:00"},{"$f":"Poules!G22","v":"Alblasserdam E1"},{"$f":"Poules!H22","v":0},{"$f":"Poules!M22","v":"--"},{"$f":"Poules!N22","v":"Cabauw E1"},{"$f":"Poules!O22","v":0},{"$f":"Poules!U22","v":4},{"$f":"Poules!V22","v":"--"},{"$f":"Poules!W22","v":6},null,{"$f":"Poules!Y22","v":0},null,{"$f":"Poules!AA22","v":3}]
[{"$f":"Poules!D23","v":"17:00:00"},{"$f":"Poules!E23","v":"00:00:00"},{"$f":"Poules!G23","v":"Jodan Boys E2"},{"$f":"Poules!H23","v":0},{"$f":"Poules!M23","v":"--"},{"$f":"Poules!N23","v":"Schoonhoven E1"},{"$f":"Poules!O23","v":0},{"$f":"Poules!U23","v":1},{"$f":"Poules!V23","v":"--"},{"$f":"Poules!W23","v":2},null,{"$f":"Poules!Y23","v":0},null,{"$f":"Poules!AA23","v":3}]
[]
[]
[{"$f":"Poules!A3","v":"Stand"},{"$f":"Poules!B5","v":"Groep 1"},null,null,null,null,null,{"$f":"Poules!H5","v":"V"},{"$f":"Poules!I5","v":"T"},{"$f":"Poules!J5","v":"P"},{"$f":"Poules!K3","v":"Gewonnen"},{"$f":"Poules!L3","v":"Gelijk"},{"$f":"Poules!M3","v":"Verloren"},{"$f":"Poules!N3","v":"Saldo"}]
[{"$f":"Poules!A4","v":0},null,null,null,null,null,null,null,null,null,{"$f":"Poules!K4","v":0},{"$f":"Poules!L4","v":0},{"$f":"Poules!M4","v":0},{"$f":"Poules!N4","v":0}]
[{"$f":"Poules!A5","v":0},null,null,null,null,null,null,null,null,null,{"$f":"Poules!K5","v":0},{"$f":"Poules!L5","v":0},{"$f":"Poules!M5","v":0},{"$f":"Poules!N5","v":0}]
[{"$f":"Poules!A6","v":2},{"$f":"Poules!B6","v":"Schoonhoven E1"},{"$f":"Poules!C6","v":0},{"$f":"Poules!D6","v":0},{"$f":"Poules!E6","v":0},{"$f":"Poules!F6","v":0},{"$f":"Poules!G6","v":0},{"$f":"Poules!H6","v":9},{"$f":"Poules!I6","v":8},{"$f":"Poules!J6","v":9.0010000000000012},{"$f":"Poules!K6","v":3},{"$f":"Poules!L6","v":0},{"$f":"Poules!M6","v":3},{"$f":"Poules!N6","v":1}]
[{"$f":"Poules!A7","v":4},{"$f":"Poules!B7","v":"Cabauw E1"},{"$f":"Poules!C7","v":0},{"$f":"Poules!D7","v":0},{"$f":"Poules!E7","v":0},{"$f":"Poules!F7","v":0},{"$f":"Poules!G7","v":0},{"$f":"Poules!H7","v":13},{"$f":"Poules!I7","v":17},{"$f":"Poules!J7","v":8.9960000000000004},{"$f":"Poules!K7","v":3},{"$f":"Poules!L7","v":0},{"$f":"Poules!M7","v":3},{"$f":"Poules!N7","v":-4}]
[{"$f":"Poules!A8","v":3},{"$f":"Poules!B8","v":"Jodan Boys E2"},{"$f":"Poules!C8","v":0},{"$f":"Poules!D8","v":0},{"$f":"Poules!E8","v":0},{"$f":"Poules!F8","v":0},{"$f":"Poules!G8","v":0},{"$f":"Poules!H8","v":10},{"$f":"Poules!I8","v":10},{"$f":"Poules!J8","v":9},{"$f":"Poules!K8","v":3},{"$f":"Poules!L8","v":0},{"$f":"Poules!M8","v":3},{"$f":"Poules!N8","v":0}]
[{"$f":"Poules!A9","v":1},{"$f":"Poules!B9","v":"Alblasserdam E1"},{"$f":"Poules!C9","v":0},{"$f":"Poules!D9","v":0},{"$f":"Poules!E9","v":0},{"$f":"Poules!F9","v":0},{"$f":"Poules!G9","v":0},{"$f":"Poules!H9","v":15},{"$f":"Poules!I9","v":12},{"$f":"Poules!J9","v":9.0030000000000001},{"$f":"Poules!K9","v":3},{"$f":"Poules!L9","v":0},{"$f":"Poules!M9","v":3},{"$f":"Poules!N9","v":3}]

{"sheet":"GROEP-2","index":3,"n_rows":24,"n_cols":13,"rows_kept":24,"cut":false,"hidden":false,"merged":[[23,1,23,4],[7,0,7,1],[8,0,8,1],[17,11,19,11],[4,0,4,1],[5,0,5,1],[17,0,19,0],[17,1,19,4],[17,5,19,5],[10,0,10,1],[11,0,11,1],[12,0,12,1],[13,0,13,1],[14,0,14,1],[15,0,15,1],[0,12,2,13],[20,1,20,4],[21,1,21,4],[22,1,22,4],[0,0,2,11],[3,5,3,7],[3,9,3,11],[3,0,3,1],[3,2,3,4],[9,0,9,1],[6,0,6,1],[17,8,19,8],[17,9,19,9],[17,10,19,10],[17,7,19,7],[17,6,19,6]]}
["SCHOONHOVEN TOERNOOI",null,null,null,null,null,null,null,null,null,null,null,"Scores door:\nOnlineExcelCursus.NL"]
[]
[]
[{"$f":"Poules!AC11","v":"Tijd"},null,{"$f":"Poules!AF11","v":"VELD B"},null,null,{"$f":"Poules!AT11","v":"Uitslag"},null,null,null,{"$f":"Poules!AX11","v":"Punten"}]
[{"$f":"Poules!AC12","v":"14:15:00"},{"$f":"Poules!AD12","v":"00:00:00"},{"$f":"Poules!AF12","v":"Schoonhoven E3"},{"$f":"Poules!AL12","v":"--"},{"$f":"Poules!AM12","v":"Cabauw E2"},{"$f":"Poules!AT12","v":1},{"$f":"Poules!AU12","v":"--"},{"$f":"Poules!AV12","v":3},null,{"$f":"Poules!AX12","v":0},null,{"$f":"Poules!AZ12","v":3}]
[{"$f":"Poules!AC13","v":"14:30:00"},{"$f":"Poules!AD13","v":"00:00:00"},{"$f":"Poules!AF13","v":"RKDEO E3"},{"$f":"Poules!AL13","v":"--"},{"$f":"Poules!AM13","v":"VV GZ E3"},{"$f":"Poules!AT13","v":1},{"$f":"Poules!AU13","v":"--"},{"$f":"Poules!AV13","v":1},null,{"$f":"Poules!AX13","v":1},null,{"$f":"Poules!AZ13","v":1}]
[{"$f":"Poules!AC14","v":"14:45:00"},{"$f":"Poules!AD14","v":"00:00:00"},{"$f":"Poules!AF14","v":"VV GZ E3"},{"$f":"Poules!AL14","v":"--"},{"$f":"Poules!AM14","v":"Schoonhoven E3"},{"$f":"Poules!AT14","v":2},{"$f":"Poules!AU14","v":"--"},{"$f":"Poules!AV14","v":2},null,{"$f":"Poules!AX14","v":1},null,{"$f":"Poules!AZ14","v":1}]
[{"$f":"Poules!AC15","v":"15:00:00"},{"$f":"Poules!AD15","v":"00:00:00"},{"$f":"Poules!AF15","v":"Cabauw E2"},{"$f":"Poules!AL15","v":"--"},{"$f":"Poules!AM15","v":"RKDEO E3"},{"$f":"Poules!AT15","v":3},{"$f":"Poules!AU15","v":"--"},{"$f":"Poules!AV15","v":2},null,{"$f":"Poules!AX15","v":3},null,{"$f":"Poules!AZ15","v":0}]
[{"$f":"Poules!AC16","v":"15:15:00"},{"$f":"Poules!AD16","v":"00:00:00"},{"$f":"Poules!AF16","v":"Schoonhoven E3"},{"$f":"Poules!AL16","v":"--"},{"$f":"Poules!AM16","v":"RKDEO E3"},{"$f":"Poules!AT16","v":1},{"$f":"Poules!AU16","v":"--"},{"$f":"Poules!AV16","v":0},null,{"$f":"Poules!AX16","v":3},null,{"$f":"Poules!AZ16","v":0}]
[{"$f":"Poules!AC17","v":"15:30:00"},{"$f":"Poules!AD17","v":"00:00:00"},{"$f":"Poules!AF17","v":"Cabauw E2"},{"$f":"Poules!AL17","v":"--"},{"$f":"Poules!AM17","v":"VV GZ E3"},{"$f":"Poules!AT17","v":1},{"$f":"Poules!AU17","v":"--"},{"$f":"Poules!AV17","v":0},null,{"$f":"Poules!AX17","v":3},null,{"$f":"Poules!AZ17","v":0}]
[{"$f":"Poules!AC18","v":"15:45:00"},{"$f":"Poules!AD18","v":"00:00:00"},{"$f":"Poules!AF18","v":"Cabauw E2"},{"$f":"Poules!AL18","v":"--"},{"$f":"Poules!AM18","v":"Schoonhoven E3"},{"$f":"Poules!AT18","v":1},{"$f":"Poules!AU18","v":"--"},{"$f":"Poules!AV18","v":3},null,{"$f":"Poules!AX18","v":0},null,{"$f":"Poules!AZ18","v":3}]
[{"$f":"Poules!AC19","v":"16:00:00"},{"$f":"Poules!AD19","v":"00:00:00"},{"$f":"Poules!AF19","v":"VV GZ E3"},{"$f":"Poules!AL19","v":"--"},{"$f":"Poules!AM19","v":"RKDEO E3"},{"$f":"Poules!AT19","v":1},{"$f":"Poules!AU19","v":"--"},{"$f":"Poules!AV19","v":1},null,{"$f":"Poules!AX19","v":1},null,{"$f":"Poules!AZ19","v":1}]
[{"$f":"Poules!AC20","v":"16:15:00"},{"$f":"Poules!AD20","v":"00:00:00"},{"$f":"Poules!AF20","v":"Schoonhoven E3"},{"$f":"Poules!AL20","v":"--"},{"$f":"Poules!AM20","v":"VV GZ E3"},{"$f":"Poules!AT20","v":2},{"$f":"Poules!AU20","v":"--"},{"$f":"Poules!AV20","v":2},null,{"$f":"Poules!AX20","v":1},null,{"$f":"Poules!AZ20","v":1}]
[{"$f":"Poules!AC21","v":"16:30:00"},{"$f":"Poules!AD21","v":"00:00:00"},{"$f":"Poules!AF21","v":"RKDEO E3"},{"$f":"Poules!AL21","v":"--"},{"$f":"Poules!AM21","v":"Cabauw E2"},{"$f":"Poules!AT21","v":3},{"$f":"Poules!AU21","v":"--"},{"$f":"Poules!AV21","v":2},null,{"$f":"Poules!AX21","v":3},null,{"$f":"Poules!AZ21","v":0}]
[{"$f":"Poules!AC22","v":"16:45:00"},{"$f":"Poules!AD22","v":"00:00:00"},{"$f":"Poules!AF22","v":"RKDEO E3"},{"$f":"Poules!AL22","v":"--"},{"$f":"Poules!AM22","v":"Schoonhoven E3"},{"$f":"Poules!AT22","v":1},{"$f":"Poules!AU22","v":"--"},{"$f":"Poules!AV22","v":0},null,{"$f":"Poules!AX22","v":3},null,{"$f":"Poules!AZ22","v":0}]
[{"$f":"Poules!AC23","v":"17:00:00"},{"$f":"Poules!AD23","v":"00:00:00"},{"$f":"Poules!AF23","v":"VV GZ E3"},{"$f":"Poules!AL23","v":"--"},{"$f":"Poules!AM23","v":"Cabauw E2"},{"$f":"Poules!AT23","v":0},{"$f":"Poules!AU23","v":"--"},{"$f":"Poules!AV23","v":0},null,{"$f":"Poules!AX23","v":1},null,{"$f":"Poules!AZ23","v":1}]
[]
[{"$f":"Poules!O3","v":"Stand"},{"$f":"Poules!P5","v":"Groep 2"},null,null,null,{"$f":"Poules!W5","v":"V"},{"$f":"Poules!X5","v":"T"},{"$f":"Poules!Y5","v":"P"},{"$f":"Poules!Z3","v":"Gewonnen"},{"$f":"Poules!AA3","v":"Gelijk"},{"$f":"Poules!AB3","v":"Verloren"},{"$f":"Poules!AC3","v":"Saldo"}]
[{"$f":"Poules!O4","v":0},null,null,null,null,null,null,null,{"$f":"Poules!Z4","v":0},{"$f":"Poules!AA4","v":0},{"$f":"Poules!AB4","v":0},{"$f":"Poules!AC4","v":0}]
[{"$f":"Poules!O5","v":0},null,null,null,null,null,null,null,{"$f":"Poules!Z5","v":0},{"$f":"Poules!AA5","v":0},{"$f":"Poules!AB5","v":0},{"$f":"Poules!AC5","v":0}]
[{"$f":"Poules!O6","v":2},{"$f":"Poules!P6","v":"Schoonhoven E3"},null,null,null,{"$f":"Poules!W6","v":9},{"$f":"Poules!X6","v":9},{"$f":"Poules!Y6","v":8},{"$f":"Poules!Z6","v":2},{"$f":"Poules!AA6","v":2},{"$f":"Poules!AB6","v":2},{"$f":"Poules!AC6","v":0}]
[{"$f":"Poules!O7","v":1},{"$f":"Poules!P7","v":"Cabauw E2"},null,null,null,{"$f":"Poules!W7","v":10},{"$f":"Poules!X7","v":9},{"$f":"Poules!Y7","v":10.000999999999999},{"$f":"Poules!Z7","v":3},{"$f":"Poules!AA7","v":1},{"$f":"Poules!AB7","v":2},{"$f":"Poules!AC7","v":1}]
[{"$f":"Poules!O8","v":3},{"$f":"Poules!P8","v":"RKDEO E3"},null,null,null,{"$f":"Poules!W8","v":8},{"$f":"Poules!X8","v":8},{"$f":"Poules!Y8","v":7.9999999999999991},{"$f":"Poules!Z8","v":2},{"$f":"Poules!AA8","v":2},{"$f":"Poules!AB8","v":2},{"$f":"Poules!AC8","v":0}]
[{"$f":"Poules!O9","v":4},{"$f":"Poules!P9","v":"VV GZ E3"},null,null,null,{"$f":"Poules!W9","v":6},{"$f":"Poules!X9","v":7},{"$f":"Poules!Y9","v":4.9990000000000006},{"$f":"Poules!Z9","v":0},{"$f":"Poules!AA9","v":5},{"$f":"Poules!AB9","v":1},{"$f":"Poules!AC9","v":-1}]

{"sheet":"GROEP-3","index":4,"n_rows":23,"n_cols":13,"rows_kept":23,"cut":false,"hidden":false,"merged":[[21,1,21,4],[22,1,22,4],[19,1,19,4],[16,0,18,0],[5,0,5,1],[6,0,6,1],[20,1,20,4],[16,1,18,4],[8,0,8,1],[10,0,10,1],[11,0,11,1],[12,0,12,1],[13,0,13,1],[14,0,14,1],[15,0,15,1],[16,8,18,8],[16,9,18,9],[0,12,2,13],[16,5,18,5],[16,6,18,6],[16,7,18,7],[0,0,2,11],[16,10,18,10],[16,11,18,11],[9,0,9,1],[7,0,7,1],[3,9,3,11],[4,0,4,1],[3,0,3,1],[3,5,3,7],[3,2,3,4]]}
["SCHOONHOVEN TOERNOOI",null,null,null,null,null,null,null,null,null,null,null,"Scores door:\nOnlineExcelCursus.NL"]
[]
[]
[{"$f":"Poules!D25","v":"Tijd"},{"$f":"Poules!E25","v":0},{"$f":"Poules!G25","v":"VELD C"},null,null,{"$f":"Poules!U25","v":"Uitslag"},{"$f":"Poules!V25","v":0},{"$f":"Poules!W25","v":0},null,{"$f":"Poules!Y25","v":"Punten"}]
[{"$f":"Poules!D26","v":"14:15:00"},{"$f":"Poules!E26","v":"00:00:00"},{"$f":"Poules!G26","v":"Schoonhoven E5"},{"$f":"Poules!M26","v":"--"},{"$f":"Poules!N26","v":"Lekkerkerk E2"},{"$f":"Poules!U26","v":0},{"$f":"Poules!V26","v":"--"},{"$f":"Poules!W26","v":2},null,{"$f":"Poules!Y26","v":0},null,{"$f":"Poules!AA26","v":3}]
[{"$f":"Poules!D27","v":"14:30:00"},{"$f":"Poules!E27","v":"00:00:00"},{"$f":"Poules!G27","v":"RKDEO E9"},{"$f":"Poules!M27","v":"--"},{"$f":"Poules!N27","v":"scVictorie'04 E3"},{"$f":"Poules!U27","v":4},{"$f":"Poules!V27","v":"--"},{"$f":"Poules!W27","v":1},null,{"$f":"Poules!Y27","v":3},null,{"$f":"Poules!AA27","v":0}]
[{"$f":"Poules!D28","v":"14:45:00"},{"$f":"Poules!E28","v":"00:00:00"},{"$f":"Poules!G28","v":"scVictorie'04 E3"},{"$f":"Poules!M28","v":"--"},{"$f":"Poules!N28","v":"Schoonhoven E5"},{"$f":"Poules!U28","v":1},{"$f":"Poules!V28","v":"--"},{"$f":"Poules!W28","v":1},null,{"$f":"Poules!Y28","v":1},null,{"$f":"Poules!AA28","v":1}]
[{"$f":"Poules!D29","v":"15:00:00"},{"$f":"Poules!E29","v":"00:00:00"},{"$f":"Poules!G29","v":"Lekkerkerk E2"},{"$f":"Poules!M29","v":"--"},{"$f":"Poules!N29","v":"RKDEO E9"},{"$f":"Poules!U29","v":2},{"$f":"Poules!V29","v":"--"},{"$f":"Poules!W29","v":3},null,{"$f":"Poules!Y29","v":0},null,{"$f":"Poules!AA29","v":3}]
[{"$f":"Poules!D30","v":"15:15:00"},{"$f":"Poules!E30","v":"00:00:00"},{"$f":"Poules!G30","v":"Schoonhoven E5"},{"$f":"Poules!M30","v":"--"},{"$f":"Poules!N30","v":"RKDEO E9"},{"$f":"Poules!U30","v":0},{"$f":"Poules!V30","v":"--"},{"$f":"Poules!W30","v":1},null,{"$f":"Poules!Y30","v":0},null,{"$f":"Poules!AA30","v":3}]
[{"$f":"Poules!D31","v":"15:30:00"},{"$f":"Poules!E31","v":"00:00:00"},{"$f":"Poules!G31","v":"scVictorie'04 E3"},{"$f":"Poules!M31","v":"--"},{"$f":"Poules!N31","v":"Lekkerkerk E2"},{"$f":"Poules!U31","v":1},{"$f":"Poules!V31","v":"--"},{"$f":"Poules!W31","v":0},null,{"$f":"Poules!Y31","v":3},null,{"$f":"Poules!AA31","v":0}]
[{"$f":"Poules!D32","v":"15:45:00"},{"$f":"Poules!E32","v":"00:00:00"},{"$f":"Poules!G32","v":"Lekkerkerk E2"},{"$f":"Poules!M32","v":"--"},{"$f":"Poules!N32","v":"Schoonhoven E5"},{"$f":"Poules!U32","v":1},{"$f":"Poules!V32","v":"--"},{"$f":"Poules!W32","v":2},null,{"$f":"Poules!Y32","v":0},null,{"$f":"Poules!AA32","v":3}]
[{"$f":"Poules!D33","v":"16:00:00"},{"$f":"Poules!E33","v":"00:00:00"},{"$f":"Poules!G33","v":"scVictorie'04 E3"},{"$f":"Poules!M33","v":"--"},{"$f":"Poules!N33","v":"RKDEO E9"},{"$f":"Poules!U33","v":4},{"$f":"Poules!V33","v":"--"},{"$f":"Poules!W33","v":1},null,{"$f":"Poules!Y33","v":3},null,{"$f":"Poules!AA33","v":0}]
[{"$f":"Poules!D34","v":"16:15:00"},{"$f":"Poules!E34","v":"00:00:00"},{"$f":"Poules!G34","v":"Schoonhoven E5"},{"$f":"Poules!M34","v":"--"},{"$f":"Poules!N34","v":"scVictorie'04 E3"},{"$f":"Poules!U34","v":1},{"$f":"Poules!V34","v":"--"},{"$f":"Poules!W34","v":1},null,{"$f":"Poules!Y34","v":1},null,{"$f":"Poules!AA34","v":1}]
[{"$f":"Poules!D35","v":"16:30:00"},{"$f":"Poules!E35","v":"00:00:00"},{"$f":"Poules!G35","v":"RKDEO E9"},{"$f":"Poules!M35","v":"--"},{"$f":"Poules!N35","v":"Lekkerkerk E2"},{"$f":"Poules!U35","v":2},{"$f":"Poules!V35","v":"--"},{"$f":"Poules!W35","v":3},null,{"$f":"Poules!Y35","v":0},null,{"$f":"Poules!AA35","v":3}]
[{"$f":"Poules!D36","v":"16:45:00"},{"$f":"Poules!E36","v":"00:00:00"},{"$f":"Poules!G36","v":"RKDEO E9"},{"$f":"Poules!M36","v":"--"},{"$f":"Poules!N36","v":"Schoonhoven E5"},{"$f":"Poules!U36","v":0},{"$f":"Poules!V36","v":"--"},{"$f":"Poules!W36","v":4},null,{"$f":"Poules!Y36","v":0},null,{"$f":"Poules!AA36","v":3}]
[{"$f":"Poules!D37","v":"17:00:00"},{"$f":"Poules!E37","v":"00:00:00"},{"$f":"Poules!G37","v":"Lekkerkerk E2"},{"$f":"Poules!M37","v":"--"},{"$f":"Poules!N37","v":"scVictorie'04 E3"},{"$f":"Poules!U37","v":1},{"$f":"Poules!V37","v":"--"},{"$f":"Poules!W37","v":0},null,{"$f":"Poules!Y37","v":3},null,{"$f":"Poules!AA37","v":0}]
[{"$f":"Poules!AD3","v":"Stand"},{"$f":"Poules!AE5","v":"Groep 3"},null,null,null,{"$f":"Poules!AK5","v":"V"},{"$f":"Poules!AL5","v":"T"},{"$f":"Poules!AM5","v":"P"},{"$f":"Poules!AN3","v":"Gewonnen"},{"$f":"Poules!AO3","v":"Gelijk"},{"$f":"Poules!AP3","v":"Verloren"},{"$f":"Poules!AQ3","v":"Saldo"}]
[{"$f":"Poules!AD4","v":0},null,null,null,null,null,null,null,{"$f":"Poules!AN4","v":0},{"$f":"Poules!AO4","v":0},{"$f":"Poules!AP4","v":0},{"$f":"Poules!AQ4","v":0}]
[{"$f":"Poules!AD5","v":0},null,null,null,null,null,null,null,{"$f":"Poules!AN5","v":0},{"$f":"Poules!AO5","v":0},{"$f":"Poules!AP5","v":0},{"$f":"Poules!AQ5","v":0}]
[{"$f":"Poules!AD6","v":3},{"$f":"Poules!AE6","v":"Schoonhoven E5"},null,null,null,{"$f":"Poules!AK6","v":8},{"$f":"Poules!AL6","v":6},{"$f":"Poules!AM6","v":8.0019999999999989},{"$f":"Poules!AN6","v":2},{"$f":"Poules!AO6","v":2},{"$f":"Poules!AP6","v":2},{"$f":"Poules!AQ6","v":2}]
[{"$f":"Poules!AD7","v":1},{"$f":"Poules!AE7","v":"Lekkerkerk E2"},null,null,null,{"$f":"Poules!AK7","v":9},{"$f":"Poules!AL7","v":8},{"$f":"Poules!AM7","v":9.0010000000000012},{"$f":"Poules!AN7","v":3},{"$f":"Poules!AO7","v":0},{"$f":"Poules!AP7","v":3},{"$f":"Poules!AQ7","v":1}]
[{"$f":"Poules!AD8","v":2},{"$f":"Poules!AE8","v":"RKDEO E9"},null,null,null,{"$f":"Poules!AK8","v":11},{"$f":"Poules!AL8","v":14},{"$f":"Poules!AM8","v":8.9969999999999999},{"$f":"Poules!AN8","v":3},{"$f":"Poules!AO8","v":0},{"$f":"Poules!AP8","v":3},{"$f":"Poules!AQ8","v":-3}]
[{"$f":"Poules!AD9","v":4},{"$f":"Poules!AE9","v":"scVictorie'04 E3"},null,null,null,{"$f":"Poules!AK9","v":8},{"$f":"Poules!AL9","v":8},{"$f":"Poules!AM9","v":7.9999999999999991},{"$f":"Poules!AN9","v":2},{"$f":"Poules!AO9","v":2},{"$f":"Poules!AP9","v":2},{"$f":"Poules!AQ9","v":0}]

{"sheet":"GROEP-4","index":5,"n_rows":23,"n_cols":13,"rows_kept":23,"cut":false,"hidden":false,"merged":[[21,1,21,4],[22,1,22,4],[16,1,18,4],[3,2,3,4],[16,0,18,0],[9,0,9,1],[4,0,4,1],[7,0,7,1],[8,0,8,1],[5,0,5,1],[6,0,6,1],[12,0,12,1],[13,0,13,1],[14,0,14,1],[15,0,15,1],[0,12,2,13],[16,6,18,6],[16,7,18,7],[19,1,19,4],[20,1,20,4],[0,0,2,11],[16,8,18,8],[16,9,18,9],[16,10,18,10],[16,11,18,11],[16,5,18,5],[3,5,3,7],[3,9,3,11],[3,0,3,1],[10,0,10,1],[11,0,11,1]]}
["SCHOONHOVEN TOERNOOI",null,null,null,null,null,null,null,null,null,null,null,"Scores door:\nOnlineExcelCursus.NL"]
[]
[]
[{"$f":"Poules!AC25","v":"Tijd"},{"$f":"Poules!AD25","v":0},{"$f":"Poules!AF25","v":"VELD D"},null,null,{"$f":"Poules!AT25","v":"Uitslag"},{"$f":"Poules!AU25","v":0},{"$f":"Poules!AV25","v":0},null,{"$f":"Poules!AX25","v":"Punten"},{"$f":"Poules!AY25","v":0},{"$f":"Poules!AZ25","v":0}]
[{"$f":"Poules!AC26","v":"14:15:00"},{"$f":"Poules!AD26","v":"00:00:00"},{"$f":"Poules!AF26","v":"Schoonhoven E7"},{"$f":"Poules!AL26","v":"--"},{"$f":"Poules!AM26","v":"Stolwijk E2"},{"$f":"Poules!AT26","v":1},{"$f":"Poules!AU26","v":"--"},{"$f":"Poules!AV26","v":1},null,{"$f":"Poules!AX26","v":1},null,{"$f":"Poules!AZ26","v":1}]
[{"$f":"Poules!AC27","v":"14:30:00"},{"$f":"Poules!AD27","v":"00:00:00"},{"$f":"Poules!AF27","v":"VFC Vlaardingen E8"},{"$f":"Poules!AL27","v":"--"},{"$f":"Poules!AM27","v":"Jodan Boys E8"},{"$f":"Poules!AT27","v":3},{"$f":"Poules!AU27","v":"--"},{"$f":"Poules!AV27","v":2},null,{"$f":"Poules!AX27","v":3},null,{"$f":"Poules!AZ27","v":0}]
[{"$f":"Poules!AC28","v":"14:45:00"},{"$f":"Poules!AD28","v":"00:00:00"},{"$f":"Poules!AF28","v":"Jodan Boys E8"},{"$f":"Poules!AL28","v":"--"},{"$f":"Poules!AM28","v":"Schoonhoven E7"},{"$f":"Poules!AT28","v":2},{"$f":"Poules!AU28","v":"--"},{"$f":"Poules!AV28","v":2},null,{"$f":"Poules!AX28","v":1},null,{"$f":"Poules!AZ28","v":1}]
[{"$f":"Poules!AC29","v":"15:00:00"},{"$f":"Poules!AD29","v":"00:00:00"},{"$f":"Poules!AF29","v":"Stolwijk E2"},{"$f":"Poules!AL29","v":"--"},{"$f":"Poules!AM29","v":"VFC Vlaardingen E8"},{"$f":"Poules!AT29","v":1},{"$f":"Poules!AU29","v":"--"},{"$f":"Poules!AV29","v":3},null,{"$f":"Poules!AX29","v":0},null,{"$f":"Poules!AZ29","v":3}]
[{"$f":"Poules!AC30","v":"15:15:00"},{"$f":"Poules!AD30","v":"00:00:00"},{"$f":"Poules!AF30","v":"Stolwijk E2"},{"$f":"Poules!AL30","v":"--"},{"$f":"Poules!AM30","v":"Jodan Boys E8"},{"$f":"Poules!AT30","v":0},{"$f":"Poules!AU30","v":"--"},{"$f":"Poules!AV30","v":1},null,{"$f":"Poules!AX30","v":0},null,{"$f":"Poules!AZ30","v":3}]
[{"$f":"Poules!AC31","v":"15:30:00"},{"$f":"Poules!AD31","v":"00:00:00"},{"$f":"Poules!AF31","v":"Schoonhoven E7"},{"$f":"Poules!AL31","v":"--"},{"$f":"Poules!AM31","v":"VFC Vlaardingen E8"},{"$f":"Poules!AT31","v":0},{"$f":"Poules!AU31","v":"--"},{"$f":"Poules!AV31","v":1},null,{"$f":"Poules!AX31","v":0},null,{"$f":"Poules!AZ31","v":3}]
[{"$f":"Poules!AC32","v":"15:45:00"},{"$f":"Poules!AD32","v":"00:00:00"},{"$f":"Poules!AF32","v":"Stolwijk E2"},{"$f":"Poules!AL32","v":"--"},{"$f":"Poules!AM32","v":"Schoonhoven E7"},{"$f":"Poules!AT32","v":1},{"$f":"Poules!AU32","v":"--"},{"$f":"Poules!AV32","v":1},null,{"$f":"Poules!AX32","v":1},null,{"$f":"Poules!AZ32","v":1}]
[{"$f":"Poules!AC33","v":"16:00:00"},{"$f":"Poules!AD33","v":"00:00:00"},{"$f":"Poules!AF33","v":"Jodan Boys E8"},{"$f":"Poules!AL33","v":"--"},{"$f":"Poules!AM33","v":"VFC Vlaardingen E8"},{"$f":"Poules!AT33","v":3},{"$f":"Poules!AU33","v":"--"},{"$f":"Poules!AV33","v":2},null,{"$f":"Poules!AX33","v":3},null,{"$f":"Poules!AZ33","v":0}]
[{"$f":"Poules!AC34","v":"16:15:00"},{"$f":"Poules!AD34","v":"00:00:00"},{"$f":"Poules!AF34","v":"Schoonhoven E7"},{"$f":"Poules!AL34","v":"--"},{"$f":"Poules!AM34","v":"Jodan Boys E8"},{"$f":"Poules!AT34","v":2},{"$f":"Poules!AU34","v":"--"},{"$f":"Poules!AV34","v":2},null,{"$f":"Poules!AX34","v":1},null,{"$f":"Poules!AZ34","v":1}]
[{"$f":"Poules!AC35","v":"16:30:00"},{"$f":"Poules!AD35","v":"00:00:00"},{"$f":"Poules!AF35","v":"VFC Vlaardingen E8"},{"$f":"Poules!AL35","v":"--"},{"$f":"Poules!AM35","v":"Stolwijk E2"},{"$f":"Poules!AT35","v":1},{"$f":"Poules!AU35","v":"--"},{"$f":"Poules!AV35","v":3},null,{"$f":"Poules!AX35","v":0},null,{"$f":"Poules!AZ35","v":3}]
[{"$f":"Poules!AC36","v":"16:45:00"},{"$f":"Poules!AD36","v":"00:00:00"},{"$f":"Poules!AF36","v":"Jodan Boys E8"},{"$f":"Poules!AL36","v":"--"},{"$f":"Poules!AM36","v":"Stolwijk E2"},{"$f":"Poules!AT36","v":0},{"$f":"Poules!AU36","v":"--"},{"$f":"Poules!AV36","v":1},null,{"$f":"Poules!AX36","v":0},null,{"$f":"Poules!AZ36","v":3}]
[{"$f":"Poules!AC37","v":"17:00:00"},{"$f":"Poules!AD37","v":"00:00:00"},{"$f":"Poules!AF37","v":"VFC Vlaardingen E8"},{"$f":"Poules!AL37","v":"--"},{"$f":"Poules!AM37","v":"Schoonhoven E7"},{"$f":"Poules!AT37","v":0},{"$f":"Poules!AU37","v":"--"},{"$f":"Poules!AV37","v":1},null,{"$f":"Poules!AX37","v":0},null,{"$f":"Poules!AZ37","v":3}]
[{"$f":"Poules!AR3","v":"Stand"},{"$f":"Poules!AS5","v":"Groep 4"},null,null,null,{"$f":"Poules!AY5","v":"V"},{"$f":"Poules!AZ5","v":"T"},{"$f":"Poules!BA5","v":"P"},{"$f":"Poules!BB3","v":"Gewonnen"},{"$f":"Poules!BC3","v":"Gelijk"},{"$f":"Poules!BD3","v":"Verloren"},{"$f":"Poules!BE3","v":"Saldo"}]
[{"$f":"Poules!AR4","v":0},null,null,null,null,null,null,null,{"$f":"Poules!BB4","v":0},{"$f":"Poules!BC4","v":0},{"$f":"Poules!BD4","v":0},{"$f":"Poules!BE4","v":0}]
[{"$f":"Poules!AR5","v":0},null,null,null,null,null,null,null,{"$f":"Poules!BB5","v":0},{"$f":"Poules!BC5","v":0},{"$f":"Poules!BD5","v":0},{"$f":"Poules!BE5","v":0}]
[{"$f":"Poules!AR6","v":4},{"$f":"Poules!AS6","v":"Schoonhoven E7"},null,null,null,{"$f":"Poules!AY6","v":7},{"$f":"Poules!AZ6","v":7},{"$f":"Poules!BA6","v":7},{"$f":"Poules!BB6","v":1},{"$f":"Poules!BC6","v":4},{"$f":"Poules!BD6","v":1},{"$f":"Poules!BE6","v":0}]
[{"$f":"Poules!AR7","v":2},{"$f":"Poules!AS7","v":"Stolwijk E2"},null,null,null,{"$f":"Poules!AY7","v":7},{"$f":"Poules!AZ7","v":7},{"$f":"Poules!BA7","v":8},{"$f":"Poules!BB7","v":2},{"$f":"Poules!BC7","v":2},{"$f":"Poules!BD7","v":2},{"$f":"Poules!BE7","v":0}]
[{"$f":"Poules!AR8","v":1},{"$f":"Poules!AS8","v":"VFC Vlaardingen E8"},null,null,null,{"$f":"Poules!AY8","v":10},{"$f":"Poules!AZ8","v":10},{"$f":"Poules!BA8","v":9},{"$f":"Poules!BB8","v":3},{"$f":"Poules!BC8","v":0},{"$f":"Poules!BD8","v":3},{"$f":"Poules!BE8","v":0}]
[{"$f":"Poules!AR9","v":2},{"$f":"Poules!AS9","v":"Jodan Boys E8"},null,null,null,{"$f":"Poules!AY9","v":10},{"$f":"Poules!AZ9","v":10},{"$f":"Poules!BA9","v":8},{"$f":"Poules!BB9","v":2},{"$f":"Poules!BC9","v":2},{"$f":"Poules!BD9","v":2},{"$f":"Poules!BE9","v":0}]

{"sheet":"Blad1","index":6,"n_rows":0,"n_cols":0,"rows_kept":0,"cut":false,"hidden":false,"merged":[]}