{"text_format":"1","workbook":"xlsx","n_sheets":8,"sheets":["Invulformulier","GROEP-1","GROEP-2","GROEP-3","GROEP-4","GROEP-5","FINALE","Blad1"],"not_rendered":{"charts":0,"images":7,"macros":1,"external_links":1,"defined_names":1,"comments":0,"pivot_tables":0},"unopened":[],"bounds":{"document_bytes":16777216,"sheet_cells":100000,"rows_first":2000,"rows_last":500,"rows_between":2000,"halvings":0,"cell_chars":16384,"cell_head_chars":4096},"cells_cut":0,"cells_raw":0,"read":"whole","date_system":"1900"}

{"sheet":"Invulformulier","index":0,"n_rows":49,"n_cols":97,"rows_kept":49,"cut":false,"hidden":false,"merged":[[32,28,32,29],[33,28,33,29],[24,28,24,29],[30,28,30,29],[25,28,25,29],[23,45,23,47],[20,38,20,43],[19,38,19,43],[18,38,18,43],[33,38,33,43],[32,38,32,43],[33,31,33,36],[32,31,32,36],[26,31,26,36],[25,31,25,36],[21,31,21,36],[31,28,31,29],[26,28,26,29],[27,28,27,29],[20,28,20,29],[18,28,18,29],[19,28,19,29],[21,3,21,4],[19,3,19,4],[18,3,18,4],[20,3,20,4],[24,31,24,36],[31,38,31,43],[30,38,30,43],[29,38,29,43],[28,38,28,43],[27,38,27,43],[26,38,26,43],[25,38,25,43],[24,38,24,43],[31,31,31,36],[30,31,30,36],[29,31,29,36],[28,31,28,36],[27,31,27,36],[20,31,20,36],[19,31,19,36],[18,31,18,36],[30,6,30,11],[31,13,31,18],[30,13,30,18],[6,15,6,21],[13,31,13,36],[12,31,12,36],[11,20,11,22],[7,15,7,21],[7,30,7,35],[8,15,8,21],[11,31,11,43],[13,28,13,29],[0,0,1,49],[5,1,5,6],[6,1,6,6],[7,1,7,6],[4,1,4,6],[2,0,4,0],[2,12,4,12],[2,11,4,11],[2,10,4,10],[2,27,4,27],[5,44,5,49],[7,44,7,49],[2,14,4,14],[2,29,4,29],[2,43,4,43],[4,15,4,21],[4,30,4,35],[6,30,6,35],[2,13,4,13],[2,25,4,25],[2,26,4,26],[6,44,6,49],[5,15,5,21],[5,30,5,35],[16,3,16,4],[19,13,19,18],[18,13,18,18],[17,13,17,18],[15,13,15,18],[19,6,19,11],[18,6,18,11],[8,1,8,6],[9,1,9,6],[11,3,11,4],[11,6,11,18],[12,3,12,4],[15,3,15,4],[14,3,14,4],[13,3,13,4],[9,15,9,21],[14,13,14,18],[13,6,13,11],[12,6,12,11],[13,13,13,18],[12,13,12,18],[29,13,29,18],[28,13,28,18],[25,13,25,18],[24,13,24,18],[23,3,23,4],[17,3,17,4],[16,31,16,36],[15,31,15,36],[14,31,14,36],[17,6,17,11],[16,6,16,11],[15,6,15,11],[14,6,14,11],[16,13,16,18],[14,28,14,29],[15,28,15,29],[16,28,16,29],[17,28,17,29],[29,28,29,29],[28,28,28,29],[23,24,23,26],[21,13,21,18],[20,6,20,11],[20,13,20,18],[33,3,33,4],[33,13,33,18],[32,13,32,18],[26,3,26,4],[24,3,24,4],[21,6,21,11],[25,3,25,4],[31,3,31,4],[32,3,32,4],[27,3,27,4],[28,3,28,4],[29,3,29,4],[30,3,30,4],[33,6,33,11],[32,6,32,11],[31,6,31,11],[25,6,25,11],[24,6,24,11],[27,13,27,18],[26,13,26,18],[29,6,29,11],[28,6,28,11],[27,6,27,11],[26,6,26,11],[23,6,23,18],[23,28,23,29],[23,20,23,22],[8,44,8,49],[11,45,11,47],[9,30,9,35],[9,44,9,49],[11,49,11,51],[8,30,8,35],[21,28,21,29],[21,38,21,43],[12,28,12,29],[17,31,17,36],[17,38,17,43],[16,38,16,43],[23,49,23,51],[11,24,11,26],[15,38,15,43],[11,28,11,29],[2,28,4,28],[2,39,4,39],[2,40,4,40],[2,41,4,41],[4,44,4,49],[14,38,14,43],[13,38,13,43],[12,38,12,43],[23,31,23,43],[46,3,46,4],[46,6,46,11],[46,13,46,18],[2,57,4,57],[2,67,4,67],[2,68,4,68],[42,3,42,4],[42,6,42,11],[42,13,42,18],[43,3,43,4],[43,6,43,11],[43,13,43,18],[44,3,44,4],[44,6,44,11],[44,13,44,18],[39,3,39,4],[39,6,39,11],[39,13,39,18],[40,3,40,4],[40,6,40,11],[40,13,40,18],[41,3,41,4],[41,6,41,11],[41,13,41,18],[5,58,5,63],[6,58,6,63],[7,58,7,63],[8,58,8,63],[9,58,9,63],[2,71,4,71],[45,3,45,4],[45,6,45,11],[45,13,45,18],[36,3,36,4],[36,6,36,18],[36,20,36,22],[36,24,36,26],[37,3,37,4],[37,6,37,11],[37,13,37,18],[38,3,38,4],[38,6,38,11],[38,13,38,18],[2,56,4,56],[2,42,4,42],[2,53,4,53],[2,54,4,54],[2,55,4,55],[2,69,4,69],[2,70,4,70],[4,58,4,63],[46,28,46,29],[46,31,46,36],[46,38,46,43],[2,72,4,72],[2,82,4,82],[2,83,4,83],[42,28,42,29],[42,31,42,36],[42,38,42,43],[43,28,43,29],[43,31,43,36],[43,38,43,43],[44,28,44,29],[44,31,44,36],[44,38,44,43],[39,28,39,29],[39,31,39,36],[39,38,39,43],[40,28,40,29],[40,31,40,36],[40,38,40,43],[45,28,45,29],[45,31,45,36],[45,38,45,43],[36,28,36,29],[36,31,36,43],[36,45,36,47],[36,49,36,51],[37,28,37,29],[37,31,37,36],[37,38,37,43],[38,28,38,29],[38,31,38,36],[38,38,38,43],[41,28,41,29],[41,31,41,36],[41,38,41,43],[3,73,3,78],[2,84,4,84],[2,85,4,85],[4,73,4,78],[5,73,5,78],[6,73,6,78],[7,73,7,78],[8,73,8,78],[9,73,9,78]]}
["Toernooi 5 ploegen / 5 poules + Finale ronde beste nummers 1",null,null,null,null,null,null,null,null,null,null,null,null,null,null,null,null,null,null,null,null,null,null,null,null,null,null,null,null,null,null,null,null,null,null,null,null,null,null,null,null,null,null,null,null,null,null,null,null,null,{"$f":"COUNTA(U13:W22)","v":30},{"$f":"COUNTA(AT13:AV22)","v":30},{"$f":"COUNTA(U25:W34)","v":30},{"$f":"COUNTA(AT25:AV34)","v":30},{"$f":"COUNTA(U38:W47)","v":30},null,null,null,null,null,null,null,null,null,null,null,null,null,null,null,null,null,null,null,null,null,null,null,null,null,null,null,null,null,null,null,null,null,null,{"$f":"VALUE(A6)","v":3},{"$f":"B6","v":"PA TEAM 1"},{"$f":"VALUE(O6)","v":3},{"$f":"P6","v":"PB TEAM 1"},{"$f":"VALUE(AD6)","v":2},{"$f":"AE6","v":"PC TEAM 1"},{"$f":"VALUE(AR6)","v":4},{"$f":"AS6","v":"PD TEAM 1"}]
[null,null,null,null,null,null,null,null,null,null,null,null,null,null,null,null,null,null,null,null,null,null,null,null,null,null,null,null,null,null,null,null,null,null,null,null,null,null,null,null,null,null,null,null,null,null,null,null,null,null,null,null,null,null,null,null,null,null,null,null,null,null,null,null,null,null,null,null,null,null,null,null,null,null,null,null,null,null,null,null,null,null,null,null,null,null,null,null,null,{"$f":"VALUE(A7)","v":5},{"$f":"B7","v":"PA TEAM 2"},{"$f":"VALUE(O7)","v":1},{"$f":"P7","v":"PB TEAM 2"},{"$f":"VALUE(AD7)","v":4},{"$f":"AE7","v":"PC TEAM 2"},{"$f":"VALUE(AR7)","v":5},{"$f":"AS7","v":"PD TEAM 2"}]
["Stand",null,null,null,null,null,null,null,null,null,"Gewonnen","Gelijk","Verloren","Saldo","Stand",null,null,null,null,null,null,null,null,null,null,"Gewonnen","Gelijk","Verloren","Saldo","Stand",null,null,null,null,null,null,null,null,null,"Gewonnen","Gelijk","Verloren","Saldo","Stand",null,null,null,null,null,null,null,null,null,"Gewonnen","Gelijk","Verloren","Saldo","Stand",null,null,null,null,null,null,null,null,null,"Gewonnen","Gelijk","Verloren","Saldo",null,"Stand",null,null,null,null,null,null,null,null,null,"Gewonnen","Gelijk","Verloren","Saldo",null,null,null,{"$f":"VALUE(A8)","v":2},{"$f":"B8","v":"PA TEAM 3"},{"$f":"VALUE(O8)","v":4},{"$f":"P8","v":"PB TEAM 3"},{"$f":"VALUE(AD8)","v":3},{"$f":"AE8","v":"PC TEAM 3"},{"$f":"VALUE(AR8)","v":1},{"$f":"AS8","v":"PD TEAM 3"}]
[null,null,null,null,null,null,null,null,null,null,null,null,null,null,null,null,null,null,null,null,null,null,null,null,null,null,null,null,null,null,null,null,null,null,null,null,null,null,null,null,null,null,null,null,null,null,null,null,null,null,null,null,null,null,null,null,null,null,null,null,null,null,null,null,null,null,null,null,null,null,null,null,null,"Automatisch berekend!",null,null,null,null,null,null,null,null,null,null,null,null,null,null,null,{"$f":"VALUE(A9)","v":1},{"$f":"B9","v":"PA TEAM 4"},{"$f":"VALUE(O9)","v":2},{"$f":"P9","v":"PB TEAM 4"},{"$f":"VALUE(AD9)","v":5},{"$f":"AE9","v":"PC TEAM 4"},{"$f":"VALUE(AR9)","v":3},{"$f":"AS9","v":"PD TEAM 4"}]
[null,"Poule A",null,null,null,null,null,"V","T","P",null,null,null,null,null,"Poule B",null,null,null,null,null,null,"V","T","P",null,null,null,null,null,"Poule C",null,null,null,null,null,"V","T","P",null,null,null,null,null,"Poule D",null,null,null,null,null,"V","T","P",null,null,null,null,null,"Poule E",null,null,null,null,null,"V","T","P",null,null,null,null,null,null,"Finalepoule",null,null,null,null,null,"V","T","P",null,null,null,null,null,null,null,{"$f":"VALUE(A10)","v":4},{"$f":"B10","v":"PA TEAM 5"},{"$f":"VALUE(O10)","v":5},{"$f":"P10","v":"PB TEAM 5"},{"$f":"VALUE(AD10)","v":1},{"$f":"AE10","v":"PC TEAM 5"},{"$f":"VALUE(AR10)","v":2},{"$f":"AS10","v":"PD TEAM 5"}]
[{"$f":"RANK(J6,$J$6:$J$10,0)","v":3},"PA TEAM 1",null,null,null,null,null,{"$f":"SUMIF($G$13:$L$22,B6,$U$13:$U$22)+SUMIF($N$13:$S$22,B6,$W$13:$W$22)","v":11},{"$f":"SUMIF($G$13:$L$22,B6,$W$13:$W$22)+SUMIF($N$13:$S$22,B6,$U$13:$U$22)","v":12},{"$f":"(K6*3)+L6+(H6*0.001)-(I6*0.001)+(H6*0.00001)","v":4.9991100000000008},{"$f":"SUMPRODUCT(($G$13:$L$22=B6)*($Y$13:$Y$22=3))+SUMPRODUCT(($N$13:$S$22=B6)*($AA$13:$AA$22=3))","v":1},{"$f":"SUMPRODUCT(($G$13:$L$22=B6)*($Y$13:$Y$22=1))+SUMPRODUCT(($N$13:$S$22=B6)*($AA$13:$AA$22=1))","v":2},{"$f":"SUMPRODUCT(($G$13:$L$22=B6)*($Y$13:$Y$22=0))+SUMPRODUCT(($N$13:$S$22=B6)*($AA$13:$AA$22=0))","v":1},{"$f":"H6-I6","v":-1},{"$f":"RANK(Y6,$Y$6:$Y$10,0)","v":3},"PB TEAM 1",null,null,null,null,null,null,{"$f":"SUMIF($AF$13:$AK$22,P6,$AT$13:$AT$22)+SUMIF($AM$13:$AR$22,P6,$AV$13:$AV$22)","v":15},{"$f":"SUMIF($AF$13:$AK$22,P6,$AV$13:$AV$22)+SUMIF($AM$13:$AR$22,P6,$AT$13:$AT$22)","v":20},{"$f":"(Z6*3)+AA6+(W6*0.001)-(X6*0.001)+(W6*0.00001)","v":5.9951499999999998},{"$f":"SUMPRODUCT(($AF$13:$AK$22=P6)*($AX$13:$AX$22=3))+SUMPRODUCT(($AM$13:$AR$22=P6)*($AZ$13:$AZ$22=3))","v":2},{"$f":"SUMPRODUCT(($AF$13:$AK$22=P6)*($AX$13:$AX$22=1))+SUMPRODUCT(($AM$13:$AR$22=P6)*($AZ$13:$AZ$22=1))","v":0},{"$f":"SUMPRODUCT(($AF$13:$AK$22=P6)*($AX$13:$AX$22=0))+SUMPRODUCT(($AM$13:$AR$22=P6)*($AZ$13:$AZ$22=0))","v":2},{"$f":"W6-X6","v":-5},{"$f":"RANK(AM6,$AM$6:$AM$10,0)","v":2},"PC TEAM 1",null,null,null,null,null,{"$f":"SUMIF($G$25:$L$34,AE6,$U$25:$U$34)+SUMIF($N$25:$S$34,AE6,$W$25:$W$34)","v":24},{"$f":"SUMIF($G$25:$L$34,AE6,$W$25:$W$34)+SUMIF($N$25:$S$34,AE6,$U$25:$U$34)","v":19},{"$f":"(AN6*3)+AO6+(AK6*0.001)-(AL6*0.001)+(AK6*0.00001)","v":6.0052399999999997},{"$f":"SUMPRODUCT(($G$25:$L$34=AE6)*($Y$25:$Y$34=3))+SUMPRODUCT(($N$25:$S$34=AE6)*($AA$25:$AA$34=3))","v":2},{"$f":"SUMPRODUCT(($G$25:$L$34=AE6)*($Y$25:$Y$34=1))+SUMPRODUCT(($N$25:$S$34=AE6)*($AA$25:$AA$34=1))","v":0},{"$f":"SUMPRODUCT(($G$25:$L$34=AE6)*($Y$25:$Y$34=0))+SUMPRODUCT(($N$25:$S$34=AE6)*($AA$25:$AA$34=0))","v":2},{"$f":"AK6-AL6","v":5},{"$f":"RANK(BA6,$BA$6:$BA$10,0)","v":4},"PD TEAM 1",null,null,null,null,null,{"$f":"SUMIF($AF$25:$AK$34,AS6,$AT$25:$AT$34)+SUMIF($AM$25:$AR$34,AS6,$AV$25:$AV$34)","v":7},{"$f":"SUMIF($AF$25:$AK$34,AS6,$AV$25:$AV$34)+SUMIF($AM$25:$AR$34,AS6,$AT$25:$AT$34)","v":10},{"$f":"(BB6*3)+BC6+(AY6*0.001)-(AZ6*0.001)+(AY6*0.00001)","v":2.9970700000000003},{"$f":"SUMPRODUCT(($AF$25:$AK$34=AS6)*($AX$25:$AX$34=3))+SUMPRODUCT(($AM$25:$AR$34=AS6)*($AZ$25:$AZ$34=3))","v":0},{"$f":"SUMPRODUCT(($AF$25:$AK$34=AS6)*($AX$25:$AX$34=1))+SUMPRODUCT(($AM$25:$AR$34=AS6)*($AZ$25:$AZ$34=1))","v":3},{"$f":"SUMPRODUCT(($AF$25:$AK$34=AS6)*($AX$25:$AX$34=0))+SUMPRODUCT(($AM$25:$AR$34=AS6)*($AZ$25:$AZ$34=0))","v":1},{"$f":"AY6-AZ6","v":-3},{"$f":"RANK(BO6,$BO$6:$BO$10,0)","v":5},"PE TEAM 1",null,null,null,null,null,{"$f":"SUMIF($G$38:$L$47,BG6,$U$38:$U$47)+SUMIF($N$38:$S$47,BG6,$W$38:$W$47)","v":12},{"$f":"SUMIF($G$38:$L$47,BG6,$W$38:$W$47)+SUMIF($N$38:$S$47,BG6,$U$38:$U$47)","v":15},{"$f":"(BP6*3)+BQ6+(BM6*0.001)-(BN6*0.001)+(BM6*0.00001)","v":2.9971199999999998},{"$f":"SUMPRODUCT(($G$38:$L$47=BG6)*($Y$38:$Y$47=3))+SUMPRODUCT(($N$38:$S$47=BG6)*($AA$38:$AA$47=3))","v":1},{"$f":"SUMPRODUCT(($G$38:$L$47=BG6)*($Y$38:$Y$47=1))+SUMPRODUCT(($N$38:$S$47=BG6)*($AA$38:$AA$47=1))","v":0},{"$f":"SUMPRODUCT(($G$38:$L$47=BG6)*($Y$38:$Y$47=0))+SUMPRODUCT(($N$38:$S$47=BG6)*($AA$38:$AA$47=0))","v":3},{"$f":"BM6-BN6","v":-3},null,{"$f":"RANK(CD6,$CD$6:$CD$10,0)","v":4},{"$f":"VLOOKUP(1,Invulformulier!$A$6:$G$10,2,FALSE)","v":"PA TEAM 4"},null,null,null,null,null,{"$f":"SUMIF($AF$38:$AK$47,BV6,$AT$38:$AT$47)+SUMIF($AM$38:$AR$47,BV6,$AV$38:$AV$47)","v":8},{"$f":"SUMIF($AF$38:$AK$47,BV6,$AV$38:$AV$47)+SUMIF($AM$38:$AR$47,BV6,$AT$38:$AT$47)","v":10},{"$f":"(CE6*3)+CF6+(CB6*0.001)-(CC6*0.001)+(CB6*0.00001)","v":3.9980800000000003},{"$f":"SUMPRODUCT(($AF$38:$AK$47=BV6)*($AX$38:$AX$47=3))+SUMPRODUCT(($AM$38:$AR$47=BV6)*($AZ$38:$AZ$47=3))","v":1},{"$f":"SUMPRODUCT(($AF$38:$AK$47=BV6)*($AX$38:$AX$47=1))+SUMPRODUCT(($AM$38:$AR$47=BV6)*($AZ$38:$AZ$47=1))","v":1},{"$f":"SUMPRODUCT(($AF$38:$AK$47=BV6)*($AX$38:$AX$47=0))+SUMPRODUCT(($AM$38:$AR$47=BV6)*($AZ$38:$AZ$47=0))","v":2},{"$f":"CB6-CC6","v":-2}]
[{"$f":"RANK(J7,$J$6:$J$10,0)","v":5},"PA TEAM 2",null,null,null,null,null,{"$f":"SUMIF($G$13:$L$22,B7,$U$13:$U$22)+SUMIF($N$13:$S$22,B7,$W$13:$W$22)","v":10},{"$f":"SUMIF($G$13:$L$22,B7,$W$13:$W$22)+SUMIF($N$13:$S$22,B7,$U$13:$U$22)","v":10},{"$f":"(K7*3)+L7+(H7*0.001)-(I7*0.001)+(H7*0.00001)","v":3.0001000000000002},{"$f":"SUMPRODUCT(($G$13:$L$22=B7)*($Y$13:$Y$22=3))+SUMPRODUCT(($N$13:$S$22=B7)*($AA$13:$AA$22=3))","v":1},{"$f":"SUMPRODUCT(($G$13:$L$22=B7)*($Y$13:$Y$22=1))+SUMPRODUCT(($N$13:$S$22=B7)*($AA$13:$AA$22=1))","v":0},{"$f":"SUMPRODUCT(($G$13:$L$22=B7)*($Y$13:$Y$22=0))+SUMPRODUCT(($N$13:$S$22=B7)*($AA$13:$AA$22=0))","v":3},{"$f":"H7-I7","v":0},{"$f":"RANK(Y7,$Y$6:$Y$10,0)","v":1},"PB TEAM 2",null,null,null,null,null,null,{"$f":"SUMIF($AF$13:$AK$22,P7,$AT$13:$AT$22)+SUMIF($AM$13:$AR$22,P7,$AV$13:$AV$22)","v":16},{"$f":"SUMIF($AF$13:$AK$22,P7,$AV$13:$AV$22)+SUMIF($AM$13:$AR$22,P7,$AT$13:$AT$22)","v":7},{"$f":"(Z7*3)+AA7+(W7*0.001)-(X7*0.001)+(W7*0.00001)","v":7.0091600000000005},{"$f":"SUMPRODUCT(($AF$13:$AK$22=P7)*($AX$13:$AX$22=3))+SUMPRODUCT(($AM$13:$AR$22=P7)*($AZ$13:$AZ$22=3))","v":2},{"$f":"SUMPRODUCT(($AF$13:$AK$22=P7)*($AX$13:$AX$22=1))+SUMPRODUCT(($AM$13:$AR$22=P7)*($AZ$13:$AZ$22=1))","v":1},{"$f":"SUMPRODUCT(($AF$13:$AK$22=P7)*($AX$13:$AX$22=0))+SUMPRODUCT(($AM$13:$AR$22=P7)*($AZ$13:$AZ$22=0))","v":1},{"$f":"W7-X7","v":9},{"$f":"RANK(AM7,$AM$6:$AM$10,0)","v":4},"PC TEAM 2",null,null,null,null,null,{"$f":"SUMIF($G$25:$L$34,AE7,$U$25:$U$34)+SUMIF($N$25:$S$34,AE7,$W$25:$W$34)","v":9},{"$f":"SUMIF($G$25:$L$34,AE7,$W$25:$W$34)+SUMIF($N$25:$S$34,AE7,$U$25:$U$34)","v":16},{"$f":"(AN7*3)+AO7+(AK7*0.001)-(AL7*0.001)+(AK7*0.00001)","v":5.9930900000000005},{"$f":"SUMPRODUCT(($G$25:$L$34=AE7)*($Y$25:$Y$34=3))+SUMPRODUCT(($N$25:$S$34=AE7)*($AA$25:$AA$34=3))","v":2},{"$f":"SUMPRODUCT(($G$25:$L$34=AE7)*($Y$25:$Y$34=1))+SUMPRODUCT(($N$25:$S$34=AE7)*($AA$25:$AA$34=1))","v":0},{"$f":"SUMPRODUCT(($G$25:$L$34=AE7)*($Y$25:$Y$34=0))+SUMPRODUCT(($N$25:$S$34=AE7)*($AA$25:$AA$34=0))","v":2},{"$f":"AK7-AL7","v":-7},{"$f":"RANK(BA7,$BA$6:$BA$10,0)","v":5},"PD TEAM 2",null,null,null,null,null,{"$f":"SUMIF($AF$25:$AK$34,AS7,$AT$25:$AT$34)+SUMIF($AM$25:$AR$34,AS7,$AV$25:$AV$34)","v":8},{"$f":"SUMIF($AF$25:$AK$34,AS7,$AV$25:$AV$34)+SUMIF($AM$25:$AR$34,AS7,$AT$25:$AT$34)","v":13},{"$f":"(BB7*3)+BC7+(AY7*0.001)-(AZ7*0.001)+(AY7*0.00001)","v":0.99507999999999996},{"$f":"SUMPRODUCT(($AF$25:$AK$34=AS7)*($AX$25:$AX$34=3))+SUMPRODUCT(($AM$25:$AR$34=AS7)*($AZ$25:$AZ$34=3))","v":0},{"$f":"SUMPRODUCT(($AF$25:$AK$34=AS7)*($AX$25:$AX$34=1))+SUMPRODUCT(($AM$25:$AR$34=AS7)*($AZ$25:$AZ$34=1))","v":1},{"$f":"SUMPRODUCT(($AF$25:$AK$34=AS7)*($AX$25:$AX$34=0))+SUMPRODUCT(($AM$25:$AR$34=AS7)*($AZ$25:$AZ$34=0))","v":3},{"$f":"AY7-AZ7","v":-5},{"$f":"RANK(BO7,$BO$6:$BO$10,0)","v":4},"PE TEAM 2",null,null,null,null,null,{"$f":"SUMIF($G$38:$L$47,BG7,$U$38:$U$47)+SUMIF($N$38:$S$47,BG7,$W$38:$W$47)","v":7},{"$f":"SUMIF($G$38:$L$47,BG7,$W$38:$W$47)+SUMIF($N$38:$S$47,BG7,$U$38:$U$47)","v":8},{"$f":"(BP7*3)+BQ7+(BM7*0.001)-(BN7*0.001)+(BM7*0.00001)","v":4.9990699999999997},{"$f":"SUMPRODUCT(($G$38:$L$47=BG7)*($Y$38:$Y$47=3))+SUMPRODUCT(($N$38:$S$47=BG7)*($AA$38:$AA$47=3))","v":1},{"$f":"SUMPRODUCT(($G$38:$L$47=BG7)*($Y$38:$Y$47=1))+SUMPRODUCT(($N$38:$S$47=BG7)*($AA$38:$AA$47=1))","v":2},{"$f":"SUMPRODUCT(($G$38:$L$47=BG7)*($Y$38:$Y$47=0))+SUMPRODUCT(($N$38:$S$47=BG7)*($AA$38:$AA$47=0))","v":1},{"$f":"BM7-BN7","v":-1},null,{"$f":"RANK(CD7,$CD$6:$CD$10,0)","v":3},{"$f":"VLOOKUP(1,Invulformulier!$O$6:$V$10,2,FALSE)","v":"PB TEAM 2"},null,null,null,null,null,{"$f":"SUMIF($AF$38:$AK$47,BV7,$AT$38:$AT$47)+SUMIF($AM$38:$AR$47,BV7,$AV$38:$AV$47)","v":13},{"$f":"SUMIF($AF$38:$AK$47,BV7,$AV$38:$AV$47)+SUMIF($AM$38:$AR$47,BV7,$AT$38:$AT$47)","v":10},{"$f":"(CE7*3)+CF7+(CB7*0.001)-(CC7*0.001)+(CB7*0.00001)","v":7.0031300000000005},{"$f":"SUMPRODUCT(($AF$38:$AK$47=BV7)*($AX$38:$AX$47=3))+SUMPRODUCT(($AM$38:$AR$47=BV7)*($AZ$38:$AZ$47=3))","v":2},{"$f":"SUMPRODUCT(($AF$38:$AK$47=BV7)*($AX$38:$AX$47=1))+SUMPRODUCT(($AM$38:$AR$47=BV7)*($AZ$38:$AZ$47=1))","v":1},{"$f":"SUMPRODUCT(($AF$38:$AK$47=BV7)*($AX$38:$AX$47=0))+SUMPRODUCT(($AM$38:$AR$47=BV7)*($AZ$38:$AZ$47=0))","v":1},{"$f":"CB7-CC7","v":3}]
[{"$f":"RANK(J8,$J$6:$J$10,0)","v":2},"PA TEAM 3",null,null,null,null,null,{"$f":"SUMIF($G$13:$L$22,B8,$U$13:$U$22)+SUMIF($N$13:$S$22,B8,$W$13:$W$22)","v":11},{"$f":"SUMIF($G$13:$L$22,B8,$W$13:$W$22)+SUMIF($N$13:$S$22,B8,$U$13:$U$22)","v":11},7.0001100000000003,{"$f":"SUMPRODUCT(($G$13:$L$22=B8)*($Y$13:$Y$22=3))+SUMPRODUCT(($N$13:$S$22=B8)*($AA$13:$AA$22=3))","v":2},{"$f":"SUMPRODUCT(($G$13:$L$22=B8)*($Y$13:$Y$22=1))+SUMPRODUCT(($N$13:$S$22=B8)*($AA$13:$AA$22=1))","v":1},{"$f":"SUMPRODUCT(($G$13:$L$22=B8)*($Y$13:$Y$22=0))+SUMPRODUCT(($N$13:$S$22=B8)*($AA$13:$AA$22=0))","v":1},{"$f":"H8-I8","v":0},{"$f":"RANK(Y8,$Y$6:$Y$10,0)","v":4},"PB TEAM 3",null,null,null,null,null,null,{"$f":"SUMIF($AF$13:$AK$22,P8,$AT$13:$AT$22)+SUMIF($AM$13:$AR$22,P8,$AV$13:$AV$22)","v":14},{"$f":"SUMIF($AF$13:$AK$22,P8,$AV$13:$AV$22)+SUMIF($AM$13:$AR$22,P8,$AT$13:$AT$22)","v":13},5.0011400000000004,{"$f":"SUMPRODUCT(($AF$13:$AK$22=P8)*($AX$13:$AX$22=3))+SUMPRODUCT(($AM$13:$AR$22=P8)*($AZ$13:$AZ$22=3))","v":1},{"$f":"SUMPRODUCT(($AF$13:$AK$22=P8)*($AX$13:$AX$22=1))+SUMPRODUCT(($AM$13:$AR$22=P8)*($AZ$13:$AZ$22=1))","v":2},{"$f":"SUMPRODUCT(($AF$13:$AK$22=P8)*($AX$13:$AX$22=0))+SUMPRODUCT(($AM$13:$AR$22=P8)*($AZ$13:$AZ$22=0))","v":1},{"$f":"W8-X8","v":1},{"$f":"RANK(AM8,$AM$6:$AM$10,0)","v":3},"PC TEAM 3",null,null,null,null,null,{"$f":"SUMIF($G$25:$L$34,AE8,$U$25:$U$34)+SUMIF($N$25:$S$34,AE8,$W$25:$W$34)","v":17},{"$f":"SUMIF($G$25:$L$34,AE8,$W$25:$W$34)+SUMIF($N$25:$S$34,AE8,$U$25:$U$34)","v":17},6.0001699999999998,{"$f":"SUMPRODUCT(($G$25:$L$34=AE8)*($Y$25:$Y$34=3))+SUMPRODUCT(($N$25:$S$34=AE8)*($AA$25:$AA$34=3))","v":2},{"$f":"SUMPRODUCT(($G$25:$L$34=AE8)*($Y$25:$Y$34=1))+SUMPRODUCT(($N$25:$S$34=AE8)*($AA$25:$AA$34=1))","v":0},{"$f":"SUMPRODUCT(($G$25:$L$34=AE8)*($Y$25:$Y$34=0))+SUMPRODUCT(($N$25:$S$34=AE8)*($AA$25:$AA$34=0))","v":2},{"$f":"AK8-AL8","v":0},{"$f":"RANK(BA8,$BA$6:$BA$10,0)","v":1},"PD TEAM 3",null,null,null,null,null,{"$f":"SUMIF($AF$25:$AK$34,AS8,$AT$25:$AT$34)+SUMIF($AM$25:$AR$34,AS8,$AV$25:$AV$34)","v":11},{"$f":"SUMIF($AF$25:$AK$34,AS8,$AV$25:$AV$34)+SUMIF($AM$25:$AR$34,AS8,$AT$25:$AT$34)","v":6},10.005109999999998,{"$f":"SUMPRODUCT(($AF$25:$AK$34=AS8)*($AX$25:$AX$34=3))+SUMPRODUCT(($AM$25:$AR$34=AS8)*($AZ$25:$AZ$34=3))","v":3},{"$f":"SUMPRODUCT(($AF$25:$AK$34=AS8)*($AX$25:$AX$34=1))+SUMPRODUCT(($AM$25:$AR$34=AS8)*($AZ$25:$AZ$34=1))","v":1},{"$f":"SUMPRODUCT(($AF$25:$AK$34=AS8)*($AX$25:$AX$34=0))+SUMPRODUCT(($AM$25:$AR$34=AS8)*($AZ$25:$AZ$34=0))","v":0},{"$f":"AY8-AZ8","v":5},2,"PE TEAM 3",null,null,null,null,null,{"$f":"SUMIF($G$38:$L$47,BG8,$U$38:$U$47)+SUMIF($N$38:$S$47,BG8,$W$38:$W$47)","v":9},{"$f":"SUMIF($G$38:$L$47,BG8,$W$38:$W$47)+SUMIF($N$38:$S$47,BG8,$U$38:$U$47)","v":9},6.0000900000000001,{"$f":"SUMPRODUCT(($G$38:$L$47=BG8)*($Y$38:$Y$47=3))+SUMPRODUCT(($N$38:$S$47=BG8)*($AA$38:$AA$47=3))","v":2},{"$f":"SUMPRODUCT(($G$38:$L$47=BG8)*($Y$38:$Y$47=1))+SUMPRODUCT(($N$38:$S$47=BG8)*($AA$38:$AA$47=1))","v":0},{"$f":"SUMPRODUCT(($G$38:$L$47=BG8)*($Y$38:$Y$47=0))+SUMPRODUCT(($N$38:$S$47=BG8)*($AA$38:$AA$47=0))","v":2},{"$f":"BM8-BN8","v":0},null,1,{"$f":"VLOOKUP(1,Invulformulier!$AD$6:$AJ$10,2,FALSE)","v":"PC TEAM 5"},null,null,null,null,null,10,8,9.0021000000000004,3,0,1,{"$f":"CB8-CC8","v":2}]
[{"$f":"RANK(J9,$J$6:$J$10,0)","v":1},"PA TEAM 4",null,null,null,null,null,{"$f":"SUMIF($G$13:$L$22,B9,$U$13:$U$22)+SUMIF($N$13:$S$22,B9,$W$13:$W$22)","v":10},{"$f":"SUMIF($G$13:$L$22,B9,$W$13:$W$22)+SUMIF($N$13:$S$22,B9,$U$13:$U$22)","v":3},8.0070999999999994,{"$f":"SUMPRODUCT(($G$13:$L$22=B9)*($Y$13:$Y$22=3))+SUMPRODUCT(($N$13:$S$22=B9)*($AA$13:$AA$22=3))","v":2},{"$f":"SUMPRODUCT(($G$13:$L$22=B9)*($Y$13:$Y$22=1))+SUMPRODUCT(($N$13:$S$22=B9)*($AA$13:$AA$22=1))","v":2},{"$f":"SUMPRODUCT(($G$13:$L$22=B9)*($Y$13:$Y$22=0))+SUMPRODUCT(($N$13:$S$22=B9)*($AA$13:$AA$22=0))","v":0},{"$f":"H9-I9","v":7},{"$f":"RANK(Y9,$Y$6:$Y$10,0)","v":2},"PB TEAM 4",null,null,null,null,null,null,{"$f":"SUMIF($AF$13:$AK$22,P9,$AT$13:$AT$22)+SUMIF($AM$13:$AR$22,P9,$AV$13:$AV$22)","v":12},{"$f":"SUMIF($AF$13:$AK$22,P9,$AV$13:$AV$22)+SUMIF($AM$13:$AR$22,P9,$AT$13:$AT$22)","v":12},6.0001199999999999,{"$f":"SUMPRODUCT(($AF$13:$AK$22=P9)*($AX$13:$AX$22=3))+SUMPRODUCT(($AM$13:$AR$22=P9)*($AZ$13:$AZ$22=3))","v":2},{"$f":"SUMPRODUCT(($AF$13:$AK$22=P9)*($AX$13:$AX$22=1))+SUMPRODUCT(($AM$13:$AR$22=P9)*($AZ$13:$AZ$22=1))","v":0},{"$f":"SUMPRODUCT(($AF$13:$AK$22=P9)*($AX$13:$AX$22=0))+SUMPRODUCT(($AM$13:$AR$22=P9)*($AZ$13:$AZ$22=0))","v":2},{"$f":"W9-X9","v":0},{"$f":"RANK(AM9,$AM$6:$AM$10,0)","v":5},"PC TEAM 4",null,null,null,null,null,{"$f":"SUMIF($G$25:$L$34,AE9,$U$25:$U$34)+SUMIF($N$25:$S$34,AE9,$W$25:$W$34)","v":7},{"$f":"SUMIF($G$25:$L$34,AE9,$W$25:$W$34)+SUMIF($N$25:$S$34,AE9,$U$25:$U$34)","v":19},-1.193E-2,{"$f":"SUMPRODUCT(($G$25:$L$34=AE9)*($Y$25:$Y$34=3))+SUMPRODUCT(($N$25:$S$34=AE9)*($AA$25:$AA$34=3))","v":0},{"$f":"SUMPRODUCT(($G$25:$L$34=AE9)*($Y$25:$Y$34=1))+SUMPRODUCT(($N$25:$S$34=AE9)*($AA$25:$AA$34=1))","v":0},{"$f":"SUMPRODUCT(($G$25:$L$34=AE9)*($Y$25:$Y$34=0))+SUMPRODUCT(($N$25:$S$34=AE9)*($AA$25:$AA$34=0))","v":4},{"$f":"AK9-AL9","v":-12},{"$f":"RANK(BA9,$BA$6:$BA$10,0)","v":3},"PD TEAM 4",null,null,null,null,null,{"$f":"SUMIF($AF$25:$AK$34,AS9,$AT$25:$AT$34)+SUMIF($AM$25:$AR$34,AS9,$AV$25:$AV$34)","v":10},{"$f":"SUMIF($AF$25:$AK$34,AS9,$AV$25:$AV$34)+SUMIF($AM$25:$AR$34,AS9,$AT$25:$AT$34)","v":9},5.0010999999999992,{"$f":"SUMPRODUCT(($AF$25:$AK$34=AS9)*($AX$25:$AX$34=3))+SUMPRODUCT(($AM$25:$AR$34=AS9)*($AZ$25:$AZ$34=3))","v":1},{"$f":"SUMPRODUCT(($AF$25:$AK$34=AS9)*($AX$25:$AX$34=1))+SUMPRODUCT(($AM$25:$AR$34=AS9)*($AZ$25:$AZ$34=1))","v":2},{"$f":"SUMPRODUCT(($AF$25:$AK$34=AS9)*($AX$25:$AX$34=0))+SUMPRODUCT(($AM$25:$AR$34=AS9)*($AZ$25:$AZ$34=0))","v":1},{"$f":"AY9-AZ9","v":1},1,"PE TEAM 4",null,null,null,null,null,{"$f":"SUMIF($G$38:$L$47,BG9,$U$38:$U$47)+SUMIF($N$38:$S$47,BG9,$W$38:$W$47)","v":11},{"$f":"SUMIF($G$38:$L$47,BG9,$W$38:$W$47)+SUMIF($N$38:$S$47,BG9,$U$38:$U$47)","v":7},8.0041099999999989,{"$f":"SUMPRODUCT(($G$38:$L$47=BG9)*($Y$38:$Y$47=3))+SUMPRODUCT(($N$38:$S$47=BG9)*($AA$38:$AA$47=3))","v":2},{"$f":"SUMPRODUCT(($G$38:$L$47=BG9)*($Y$38:$Y$47=1))+SUMPRODUCT(($N$38:$S$47=BG9)*($AA$38:$AA$47=1))","v":2},{"$f":"SUMPRODUCT(($G$38:$L$47=BG9)*($Y$38:$Y$47=0))+SUMPRODUCT(($N$38:$S$47=BG9)*($AA$38:$AA$47=0))","v":0},{"$f":"BM9-BN9","v":4},null,5,{"$f":"VLOOKUP(1,Invulformulier!$AR$6:$AX$10,2,FALSE)","v":"PD TEAM 3"},null,null,null,null,null,3,11,0.99202999999999986,0,1,3,-8]
[{"$f":"RANK(J10,$J$6:$J$10,0)","v":4},"PA TEAM 5",null,null,null,null,null,{"$f":"SUMIF($G$13:$L$22,B10,$U$13:$U$22)+SUMIF($N$13:$S$22,B10,$W$13:$W$22)","v":11},{"$f":"SUMIF($G$13:$L$22,B10,$W$13:$W$22)+SUMIF($N$13:$S$22,B10,$U$13:$U$22)","v":17},3.99411,{"$f":"SUMPRODUCT(($G$13:$L$22=B10)*($Y$13:$Y$22=3))+SUMPRODUCT(($N$13:$S$22=B10)*($AA$13:$AA$22=3))","v":1},{"$f":"SUMPRODUCT(($G$13:$L$22=B10)*($Y$13:$Y$22=1))+SUMPRODUCT(($N$13:$S$22=B10)*($AA$13:$AA$22=1))","v":1},{"$f":"SUMPRODUCT(($G$13:$L$22=B10)*($Y$13:$Y$22=0))+SUMPRODUCT(($N$13:$S$22=B10)*($AA$13:$AA$22=0))","v":2},{"$f":"H10-I10","v":-6},{"$f":"RANK(Y10,$Y$6:$Y$10,0)","v":5},"PB TEAM 5",null,null,null,null,null,null,{"$f":"SUMIF($AF$13:$AK$22,P10,$AT$13:$AT$22)+SUMIF($AM$13:$AR$22,P10,$AV$13:$AV$22)","v":9},{"$f":"SUMIF($AF$13:$AK$22,P10,$AV$13:$AV$22)+SUMIF($AM$13:$AR$22,P10,$AT$13:$AT$22)","v":14},3.9950900000000007,{"$f":"SUMPRODUCT(($AF$13:$AK$22=P10)*($AX$13:$AX$22=3))+SUMPRODUCT(($AM$13:$AR$22=P10)*($AZ$13:$AZ$22=3))","v":1},{"$f":"SUMPRODUCT(($AF$13:$AK$22=P10)*($AX$13:$AX$22=1))+SUMPRODUCT(($AM$13:$AR$22=P10)*($AZ$13:$AZ$22=1))","v":1},{"$f":"SUMPRODUCT(($AF$13:$AK$22=P10)*($AX$13:$AX$22=0))+SUMPRODUCT(($AM$13:$AR$22=P10)*($AZ$13:$AZ$22=0))","v":2},{"$f":"W10-X10","v":-5},{"$f":"RANK(AM10,$AM$6:$AM$10,0)","v":1},"PC TEAM 5",null,null,null,null,null,{"$f":"SUMIF($G$25:$L$34,AE10,$U$25:$U$34)+SUMIF($N$25:$S$34,AE10,$W$25:$W$34)","v":20},{"$f":"SUMIF($G$25:$L$34,AE10,$W$25:$W$34)+SUMIF($N$25:$S$34,AE10,$U$25:$U$34)","v":6},12.014199999999999,{"$f":"SUMPRODUCT(($G$25:$L$34=AE10)*($Y$25:$Y$34=3))+SUMPRODUCT(($N$25:$S$34=AE10)*($AA$25:$AA$34=3))","v":4},{"$f":"SUMPRODUCT(($G$25:$L$34=AE10)*($Y$25:$Y$34=1))+SUMPRODUCT(($N$25:$S$34=AE10)*($AA$25:$AA$34=1))","v":0},{"$f":"SUMPRODUCT(($G$25:$L$34=AE10)*($Y$25:$Y$34=0))+SUMPRODUCT(($N$25:$S$34=AE10)*($AA$25:$AA$34=0))","v":0},{"$f":"AK10-AL10","v":14},{"$f":"RANK(BA10,$BA$6:$BA$10,0)","v":2},"PD TEAM 5",null,null,null,null,null,{"$f":"SUMIF($AF$25:$AK$34,AS10,$AT$25:$AT$34)+SUMIF($AM$25:$AR$34,AS10,$AV$25:$AV$34)","v":11},{"$f":"SUMIF($AF$25:$AK$34,AS10,$AV$25:$AV$34)+SUMIF($AM$25:$AR$34,AS10,$AT$25:$AT$34)","v":9},6.0021100000000001,{"$f":"SUMPRODUCT(($AF$25:$AK$34=AS10)*($AX$25:$AX$34=3))+SUMPRODUCT(($AM$25:$AR$34=AS10)*($AZ$25:$AZ$34=3))","v":1},{"$f":"SUMPRODUCT(($AF$25:$AK$34=AS10)*($AX$25:$AX$34=1))+SUMPRODUCT(($AM$25:$AR$34=AS10)*($AZ$25:$AZ$34=1))","v":3},{"$f":"SUMPRODUCT(($AF$25:$AK$34=AS10)*($AX$25:$AX$34=0))+SUMPRODUCT(($AM$25:$AR$34=AS10)*($AZ$25:$AZ$34=0))","v":0},{"$f":"AY10-AZ10","v":2},3,"PE TEAM 5",null,null,null,null,null,{"$f":"SUMIF($G$38:$L$47,BG10,$U$38:$U$47)+SUMIF($N$38:$S$47,BG10,$W$38:$W$47)","v":13},{"$f":"SUMIF($G$38:$L$47,BG10,$W$38:$W$47)+SUMIF($N$38:$S$47,BG10,$U$38:$U$47)","v":13},5.0001300000000004,{"$f":"SUMPRODUCT(($G$38:$L$47=BG10)*($Y$38:$Y$47=3))+SUMPRODUCT(($N$38:$S$47=BG10)*($AA$38:$AA$47=3))","v":1},{"$f":"SUMPRODUCT(($G$38:$L$47=BG10)*($Y$38:$Y$47=1))+SUMPRODUCT(($N$38:$S$47=BG10)*($AA$38:$AA$47=1))","v":2},{"$f":"SUMPRODUCT(($G$38:$L$47=BG10)*($Y$38:$Y$47=0))+SUMPRODUCT(($N$38:$S$47=BG10)*($AA$38:$AA$47=0))","v":1},{"$f":"BM10-BN10","v":0},null,2,{"$f":"VLOOKUP(1,Invulformulier!$BF$6:$BL$10,2,FALSE)","v":"PE TEAM 4"},null,null,null,null,null,11,6,7.0051100000000002,2,1,1,5]
[]
[null,null,null,"Tijd",null,null,"VELD 1",null,null,null,null,null,null,null,null,null,null,null,null,null,"Uitslag",null,null,null,"Punten",null,null,null,"Tijd",null,null,"VELD 2",null,null,null,null,null,null,null,null,null,null,null,null,null,"Uitslag",null,null,null,"Punten"]
[null,null,null,"09:00:00",null,null,{"$f":"B6","v":"PA TEAM 1"},null,null,null,null,null,"--",{"$f":"B7","v":"PA TEAM 2"},null,null,null,null,null,null,3,"--",2,null,{"$f":"IF(U13=\"\",\"\",IF(U13>W13,3,IF(U13=W13,1,0)))","v":3},null,{"$f":"IF(W13=\"\",\"\",IF(W13>U13,3,IF(W13=U13,1,0)))","v":0},null,"09:00:00",null,null,{"$f":"P6","v":"PB TEAM 1"},null,null,null,null,null,"--",{"$f":"P7","v":"PB TEAM 2"},null,null,null,null,null,null,1,"--",8,null,{"$f":"IF(AT13=\"\",\"\",IF(AT13>AV13,3,IF(AT13=AV13,1,0)))","v":0},null,{"$f":"IF(AV13=\"\",\"\",IF(AV13>AT13,3,IF(AV13=AT13,1,0)))","v":3}]
[null,null,null,"09:20:00",null,null,{"$f":"B8","v":"PA TEAM 3"},null,null,null,null,null,"--",{"$f":"B9","v":"PA TEAM 4"},null,null,null,null,null,null,0,"--",0,null,{"$f":"IF(U14=\"\",\"\",IF(U14>W14,3,IF(U14=W14,1,0)))","v":1},null,{"$f":"IF(W14=\"\",\"\",IF(W14>U14,3,IF(W14=U14,1,0)))","v":1},null,"09:20:00",null,null,{"$f":"P8","v":"PB TEAM 3"},null,null,null,null,null,"--",{"$f":"P9","v":"PB TEAM 4"},null,null,null,null,null,null,2,"--",6,null,{"$f":"IF(AT14=\"\",\"\",IF(AT14>AV14,3,IF(AT14=AV14,1,0)))","v":0},null,{"$f":"IF(AV14=\"\",\"\",IF(AV14>AT14,3,IF(AV14=AT14,1,0)))","v":3}]
[null,null,null,"09:40:00",null,null,{"$f":"B10","v":"PA TEAM 5"},null,null,null,null,null,"--",{"$f":"B6","v":"PA TEAM 1"},null,null,null,null,null,null,5,"--",5,null,{"$f":"IF(U15=\"\",\"\",IF(U15>W15,3,IF(U15=W15,1,0)))","v":1},null,1,null,"09:40:00",null,null,{"$f":"P10","v":"PB TEAM 5"},null,null,null,null,null,"--",{"$f":"P6","v":"PB TEAM 1"},null,null,null,null,null,null,3,"--",8,null,{"$f":"IF(AT15=\"\",\"\",IF(AT15>AV15,3,IF(AT15=AV15,1,0)))","v":0},null,3]
[null,null,null,"10:00:00",null,null,{"$f":"B7","v":"PA TEAM 2"},null,null,null,null,null,"--",{"$f":"B8","v":"PA TEAM 3"},null,null,null,null,null,null,6,"--",3,null,3,null,0,null,"10:00:00",null,null,{"$f":"P7","v":"PB TEAM 2"},null,null,null,null,null,"--",{"$f":"P8","v":"PB TEAM 3"},null,null,null,null,null,null,4,"--",4,null,1,null,1]
[null,null,null,"10:20:00",null,null,{"$f":"B10","v":"PA TEAM 5"},null,null,null,null,null,"--",{"$f":"B9","v":"PA TEAM 4"},null,null,null,null,null,null,2,"--",8,null,0,null,3,null,"10:20:00",null,null,{"$f":"P10","v":"PB TEAM 5"},null,null,null,null,null,"--",{"$f":"P9","v":"PB TEAM 4"},null,null,null,null,null,null,2,"--",3,null,0,null,3]
[null,null,null,"10:40:00",null,null,{"$f":"B6","v":"PA TEAM 1"},null,null,null,null,null,"--",{"$f":"B8","v":"PA TEAM 3"},null,null,null,null,null,null,3,"--",5,null,0,null,3,null,"10:40:00",null,null,{"$f":"P6","v":"PB TEAM 1"},null,null,null,null,null,"--",{"$f":"P8","v":"PB TEAM 3"},null,null,null,null,null,null,1,"--",6,null,0,null,3]
[null,null,null,"11:00:00",null,null,{"$f":"B7","v":"PA TEAM 2"},null,null,null,null,null,"--",{"$f":"B10","v":"PA TEAM 5"},null,null,null,null,null,null,1,"--",2,null,0,null,3,null,"11:00:00",null,null,{"$f":"P7","v":"PB TEAM 2"},null,null,null,null,null,"--",{"$f":"P10","v":"PB TEAM 5"},null,null,null,null,null,null,1,"--",2,null,0,null,3]
[null,null,null,"11:20:00",null,null,{"$f":"B9","v":"PA TEAM 4"},null,null,null,null,null,"--",{"$f":"B6","v":"PA TEAM 1"},null,null,null,null,null,null,0,"--",0,null,1,null,1,null,"11:20:00",null,null,{"$f":"P9","v":"PB TEAM 4"},null,null,null,null,null,"--",{"$f":"P6","v":"PB TEAM 1"},null,null,null,null,null,null,3,"--",5,null,0,null,3]
[null,null,null,"11:40:00",null,null,{"$f":"B8","v":"PA TEAM 3"},null,null,null,null,null,"--",{"$f":"B10","v":"PA TEAM 5"},null,null,null,null,null,null,3,"--",2,null,3,null,0,null,"11:40:00",null,null,{"$f":"P8","v":"PB TEAM 3"},null,null,null,null,null,"--",{"$f":"P10","v":"PB TEAM 5"},null,null,null,null,null,null,2,"--",2,null,1,null,1]
[null,null,null,"12:00:00",null,null,{"$f":"B9","v":"PA TEAM 4"},null,null,null,null,null,"--",{"$f":"B7","v":"PA TEAM 2"},null,null,null,null,null,null,2,"--",1,null,3,null,0,null,"12:00:00",null,null,{"$f":"P9","v":"PB TEAM 4"},null,null,null,null,null,"--",{"$f":"P7","v":"PB TEAM 2"},null,null,null,null,null,null,0,"--",3,null,0,null,3]
[]
[null,null,null,"Tijd",null,null,"VELD 3",null,null,null,null,null,null,null,null,null,null,null,null,null,"Uitslag",null,null,null,"Punten",null,null,null,"Tijd",null,null,"VELD 4",null,null,null,null,null,null,null,null,null,null,null,null,null,"Uitslag",null,null,null,"Punten"]
[null,null,null,"09:00:00",null,null,{"$f":"AE6","v":"PC TEAM 1"},null,null,null,null,null,"--",{"$f":"AE7","v":"PC TEAM 2"},null,null,null,null,null,null,9,"--",2,null,{"$f":"IF(U25=\"\",\"\",IF(U25>W25,3,IF(U25=W25,1,0)))","v":3},null,{"$f":"IF(W25=\"\",\"\",IF(W25>U25,3,IF(W25=U25,1,0)))","v":0},null,"09:00:00",null,null,{"$f":"AS6","v":"PD TEAM 1"},null,null,null,null,null,"--",{"$f":"AS7","v":"PD TEAM 2"},null,null,null,null,null,null,1,"--",1,null,{"$f":"IF(AT25=\"\",\"\",IF(AT25>AV25,3,IF(AT25=AV25,1,0)))","v":1},null,{"$f":"IF(AV25=\"\",\"\",IF(AV25>AT25,3,IF(AV25=AT25,1,0)))","v":1}]
[null,null,null,"09:20:00",null,null,{"$f":"AE8","v":"PC TEAM 3"},null,null,null,null,null,"--",{"$f":"AE9","v":"PC TEAM 4"},null,null,null,null,null,null,8,"--",4,null,{"$f":"IF(U26=\"\",\"\",IF(U26>W26,3,IF(U26=W26,1,0)))","v":3},null,{"$f":"IF(W26=\"\",\"\",IF(W26>U26,3,IF(W26=U26,1,0)))","v":0},null,"09:20:00",null,null,{"$f":"AS8","v":"PD TEAM 3"},null,null,null,null,null,"--",{"$f":"AS9","v":"PD TEAM 4"},null,null,null,null,null,null,1,"--",0,null,{"$f":"IF(AT26=\"\",\"\",IF(AT26>AV26,3,IF(AT26=AV26,1,0)))","v":3},null,{"$f":"IF(AV26=\"\",\"\",IF(AV26>AT26,3,IF(AV26=AT26,1,0)))","v":0}]
[null,null,null,"09:40:00",null,null,{"$f":"AE10","v":"PC TEAM 5"},null,null,null,null,null,"--",{"$f":"AE6","v":"PC TEAM 1"},null,null,null,null,null,null,7,"--",5,null,{"$f":"IF(U27=\"\",\"\",IF(U27>W27,3,IF(U27=W27,1,0)))","v":3},null,0,null,"09:40:00",null,null,{"$f":"AS10","v":"PD TEAM 5"},null,null,null,null,null,"--",{"$f":"AS6","v":"PD TEAM 1"},null,null,null,null,null,null,1,"--",1,null,{"$f":"IF(AT27=\"\",\"\",IF(AT27>AV27,3,IF(AT27=AV27,1,0)))","v":1},null,1]
[null,null,null,"10:00:00",null,null,{"$f":"AE7","v":"PC TEAM 2"},null,null,null,null,null,"--",{"$f":"AE8","v":"PC TEAM 3"},null,null,null,null,null,null,4,"--",1,null,3,null,0,null,"10:00:00",null,null,{"$f":"AS7","v":"PD TEAM 2"},null,null,null,null,null,"--",{"$f":"AS8","v":"PD TEAM 3"},null,null,null,null,null,null,1,"--",2,null,0,null,3]
[null,null,null,"10:20:00",null,null,{"$f":"AE10","v":"PC TEAM 5"},null,null,null,null,null,"--",{"$f":"AE9","v":"PC TEAM 4"},null,null,null,null,null,null,5,"--",0,null,3,null,0,null,"10:20:00",null,null,{"$f":"AS10","v":"PD TEAM 5"},null,null,null,null,null,"--",{"$f":"AS9","v":"PD TEAM 4"},null,null,null,null,null,null,2,"--",2,null,1,null,1]
[null,null,null,"10:40:00",null,null,{"$f":"AE6","v":"PC TEAM 1"},null,null,null,null,null,"--",{"$f":"AE8","v":"PC TEAM 3"},null,null,null,null,null,null,6,"--",8,null,0,null,3,null,"10:40:00",null,null,{"$f":"AS6","v":"PD TEAM 1"},null,null,null,null,null,"--",{"$f":"AS8","v":"PD TEAM 3"},null,null,null,null,null,null,2,"--",5,null,0,null,3]
[null,null,null,"11:00:00",null,null,{"$f":"AE7","v":"PC TEAM 2"},null,null,null,null,null,"--",{"$f":"AE10","v":"PC TEAM 5"},null,null,null,null,null,null,1,"--",5,null,0,null,3,null,"11:00:00",null,null,{"$f":"AS7","v":"PD TEAM 2"},null,null,null,null,null,"--",{"$f":"AS10","v":"PD TEAM 5"},null,null,null,null,null,null,3,"--",5,null,0,null,3]
[null,null,null,"11:20:00",null,null,{"$f":"AE9","v":"PC TEAM 4"},null,null,null,null,null,"--",{"$f":"AE6","v":"PC TEAM 1"},null,null,null,null,null,null,2,"--",4,null,0,null,3,null,"11:20:00",null,null,{"$f":"AS9","v":"PD TEAM 4"},null,null,null,null,null,"--",{"$f":"AS6","v":"PD TEAM 1"},null,null,null,null,null,null,3,"--",3,null,1,null,1]
[null,null,null,"11:40:00",null,null,{"$f":"AE8","v":"PC TEAM 3"},null,null,null,null,null,"--",{"$f":"AE10","v":"PC TEAM 5"},null,null,null,null,null,null,0,"--",3,null,0,null,3,null,"11:40:00",null,null,{"$f":"AS8","v":"PD TEAM 3"},null,null,null,null,null,"--",{"$f":"AS10","v":"PD TEAM 5"},null,null,null,null,null,null,3,"--",3,null,1,null,1]
[null,null,null,"12:00:00",null,null,{"$f":"AE9","v":"PC TEAM 4"},null,null,null,null,null,"--",{"$f":"AE7","v":"PC TEAM 2"},null,null,null,null,null,null,1,"--",2,null,0,null,3,null,"12:00:00",null,null,{"$f":"AS9","v":"PD TEAM 4"},null,null,null,null,null,"--",{"$f":"AS7","v":"PD TEAM 2"},null,null,null,null,null,null,5,"--",3,null,3,null,0]
[]
[]
[null,null,null,"Tijd",null,null,"VELD 5",null,null,null,null,null,null,null,null,null,null,null,null,null,"Uitslag",null,null,null,"Punten",null,null,null,"Tijd",null,null,"FINALE RONDE HOOFDVELD",null,null,null,null,null,null,null,null,null,null,null,null,null,"Uitslag",null,null,null,"Punten"]
[null,null,null,"09:00:00",null,null,{"$f":"BG6","v":"PE TEAM 1"},null,null,null,null,null,"--",{"$f":"BG7","v":"PE TEAM 2"},null,null,null,null,null,null,2,"--",3,null,{"$f":"IF(U38=\"\",\"\",IF(U38>W38,3,IF(U38=W38,1,0)))","v":0},null,{"$f":"IF(W38=\"\",\"\",IF(W38>U38,3,IF(W38=U38,1,0)))","v":3},null,"09:00:00",null,null,{"$f":"BV6","v":"PA TEAM 4"},null,null,null,null,null,"--",{"$f":"BV7","v":"PB TEAM 2"},null,null,null,null,null,null,2,"--",5,null,{"$f":"IF(AT38=\"\",\"\",IF(AT38>AV38,3,IF(AT38=AV38,1,0)))","v":0},null,{"$f":"IF(AV38=\"\",\"\",IF(AV38>AT38,3,IF(AV38=AT38,1,0)))","v":3}]
[null,null,null,"09:20:00",null,null,{"$f":"BG8","v":"PE TEAM 3"},null,null,null,null,null,"--",{"$f":"BG9","v":"PE TEAM 4"},null,null,null,null,null,null,3,"--",5,null,{"$f":"IF(U39=\"\",\"\",IF(U39>W39,3,IF(U39=W39,1,0)))","v":0},null,{"$f":"IF(W39=\"\",\"\",IF(W39>U39,3,IF(W39=U39,1,0)))","v":3},null,"09:20:00",null,null,{"$f":"BV8","v":"PC TEAM 5"},null,null,null,null,null,"--",{"$f":"BV9","v":"PD TEAM 3"},null,null,null,null,null,null,3,"--",2,null,{"$f":"IF(AT39=\"\",\"\",IF(AT39>AV39,3,IF(AT39=AV39,1,0)))","v":3},null,{"$f":"IF(AV39=\"\",\"\",IF(AV39>AT39,3,IF(AV39=AT39,1,0)))","v":0}]
[null,null,null,"09:40:00",null,null,{"$f":"BG10","v":"PE TEAM 5"},null,null,null,null,null,"--",{"$f":"BG6","v":"PE TEAM 1"},null,null,null,null,null,null,6,"--",5,null,{"$f":"IF(U40=\"\",\"\",IF(U40>W40,3,IF(U40=W40,1,0)))","v":3},null,0,null,"09:40:00",null,null,{"$f":"BV10","v":"PE TEAM 4"},null,null,null,null,null,"--",{"$f":"BV6","v":"PA TEAM 4"},null,null,null,null,null,null,0,"--",0,null,{"$f":"IF(AT40=\"\",\"\",IF(AT40>AV40,3,IF(AT40=AV40,1,0)))","v":1},null,1]
[null,null,null,"10:00:00",null,null,{"$f":"BG7","v":"PE TEAM 2"},null,null,null,null,null,"--",{"$f":"BG8","v":"PE TEAM 3"},null,null,null,null,null,null,0,"--",2,null,0,null,3,null,"10:00:00",null,null,{"$f":"BV7","v":"PB TEAM 2"},null,null,null,null,null,"--",{"$f":"BV8","v":"PC TEAM 5"},null,null,null,null,null,null,1,"--",2,null,0,null,3]
[null,null,null,"10:20:00",null,null,{"$f":"BG10","v":"PE TEAM 5"},null,null,null,null,null,"--",{"$f":"BG9","v":"PE TEAM 4"},null,null,null,null,null,null,1,"--",1,null,1,null,1,null,"10:20:00",null,null,{"$f":"BV10","v":"PE TEAM 4"},null,null,null,null,null,"--",{"$f":"BV9","v":"PD TEAM 3"},null,null,null,null,null,null,4,"--",0,null,3,null,0]
[null,null,null,"10:40:00",null,null,{"$f":"BG6","v":"PE TEAM 1"},null,null,null,null,null,"--",{"$f":"BG8","v":"PE TEAM 3"},null,null,null,null,null,null,2,"--",1,null,3,null,0,null,"10:40:00",null,null,{"$f":"BV6","v":"PA TEAM 4"},null,null,null,null,null,"--",{"$f":"BV8","v":"PC TEAM 5"},null,null,null,null,null,null,3,"--",5,null,0,null,3]
[null,null,null,"11:00:00",null,null,{"$f":"BG7","v":"PE TEAM 2"},null,null,null,null,null,"--",{"$f":"BG10","v":"PE TEAM 5"},null,null,null,null,null,null,4,"--",4,null,1,null,1,null,"11:00:00",null,null,{"$f":"BV7","v":"PB TEAM 2"},null,null,null,null,null,"--",{"$f":"BV10","v":"PE TEAM 4"},null,null,null,null,null,null,6,"--",5,null,3,null,0]
[null,null,null,"11:20:00",null,null,{"$f":"BG9","v":"PE TEAM 4"},null,null,null,null,null,"--",{"$f":"BG6","v":"PE TEAM 1"},null,null,null,null,null,null,5,"--",3,null,3,null,0,null,"11:20:00",null,null,{"$f":"BV9","v":"PD TEAM 3"},null,null,null,null,null,"--",{"$f":"BV6","v":"PA TEAM 4"},null,null,null,null,null,null,0,"--",3,null,0,null,3]
[null,null,null,"11:40:00",null,null,{"$f":"BG8","v":"PE TEAM 3"},null,null,null,null,null,"--",{"$f":"BG10","v":"PE TEAM 5"},null,null,null,null,null,null,3,"--",2,null,3,null,0,null,"11:40:00",null,null,{"$f":"BV8","v":"PC TEAM 5"},null,null,null,null,null,"--",{"$f":"BV10","v":"PE TEAM 4"},null,null,null,null,null,null,0,"--",2,null,0,null,3]
[null,null,null,"12:00:00",null,null,{"$f":"BG9","v":"PE TEAM 4"},null,null,null,null,null,"--",{"$f":"BG7","v":"PE TEAM 2"},null,null,null,null,null,null,0,"--",0,null,1,null,1,null,"12:00:00",null,null,{"$f":"BV9","v":"PD TEAM 3"},null,null,null,null,null,"--",{"$f":"BV7","v":"PB TEAM 2"},null,null,null,null,null,null,1,"--",1,null,1,null,1]
[]
[null,null,null,"(zie verder op het volgende blad)"]

{"sheet":"GROEP-1","index":1,"n_rows":20,"n_cols":13,"rows_kept":20,"cut":false,"hidden":false,"merged":[[0,12,0,13],[0,0,0,11],[16,1,16,4],[17,1,17,4],[18,1,18,4],[1,0,1,1],[1,2,1,4],[1,5,1,7],[4,0,4,1],[5,0,5,1],[7,0,7,1],[1,9,1,11],[14,1,14,4],[15,1,15,4],[2,0,2,1],[3,0,3,1],[19,1,19,4],[6,0,6,1],[11,0,11,1],[8,0,8,1],[9,0,9,1],[10,0,10,1],[19,14,19,19],[15,14,15,19],[16,14,16,19],[17,14,17,19],[18,14,18,19]]}
["Stand groep 1",null,null,null,null,null,null,null,null,null,null,null,"SCORES BY:\nOnlineExcelCursus.NL"]
[{"$f":"Invulformulier!D12","v":"Tijd"},{"$f":"Invulformulier!E12","v":0},{"$f":"Invulformulier!G12","v":"VELD 1"},null,null,{"$f":"Invulformulier!U12","v":"Uitslag"},null,null,null,{"$f":"Invulformulier!Y12","v":"Punten"}]
[{"$f":"Invulformulier!D13","v":"09:00:00"},{"$f":"Invulformulier!E13","v":"00:00:00"},{"$f":"Invulformulier!G13","v":"PA TEAM 1"},{"$f":"Invulformulier!M13","v":"--"},{"$f":"Invulformulier!N13","v":"PA TEAM 2"},{"$f":"Invulformulier!U13","v":3},{"$f":"Invulformulier!V13","v":"--"},{"$f":"Invulformulier!W13","v":2},null,{"$f":"Invulformulier!Y13","v":3},null,{"$f":"Invulformulier!AA13","v":0}]
[{"$f":"Invulformulier!D14","v":"09:20:00"},{"$f":"Invulformulier!E14","v":"00:00:00"},{"$f":"Invulformulier!G14","v":"PA TEAM 3"},{"$f":"Invulformulier!M14","v":"--"},{"$f":"Invulformulier!N14","v":"PA TEAM 4"},{"$f":"Invulformulier!U14","v":0},{"$f":"Invulformulier!V14","v":"--"},{"$f":"Invulformulier!W14","v":0},null,{"$f":"Invulformulier!Y14","v":1},null,{"$f":"Invulformulier!AA14","v":1}]
[{"$f":"Invulformulier!D15","v":"09:40:00"},{"$f":"Invulformulier!E15","v":"00:00:00"},{"$f":"Invulformulier!G15","v":"PA TEAM 5"},{"$f":"Invulformulier!M15","v":"--"},{"$f":"Invulformulier!N15","v":"PA TEAM 1"},{"$f":"Invulformulier!U15","v":5},{"$f":"Invulformulier!V15","v":"--"},{"$f":"Invulformulier!W15","v":5},null,{"$f":"Invulformulier!Y15","v":1},null,{"$f":"Invulformulier!AA15","v":1}]
[{"$f":"Invulformulier!D16","v":"10:00:00"},{"$f":"Invulformulier!E16","v":"00:00:00"},{"$f":"Invulformulier!G16","v":"PA TEAM 2"},{"$f":"Invulformulier!M16","v":"--"},{"$f":"Invulformulier!N16","v":"PA TEAM 3"},{"$f":"Invulformulier!U16","v":6},{"$f":"Invulformulier!V16","v":"--"},{"$f":"Invulformulier!W16","v":3},null,{"$f":"Invulformulier!Y16","v":3},null,{"$f":"Invulformulier!AA16","v":0}]
[{"$f":"Invulformulier!D17","v":"10:20:00"},{"$f":"Invulformulier!E17","v":"00:00:00"},{"$f":"Invulformulier!G17","v":"PA TEAM 5"},{"$f":"Invulformulier!M17","v":"--"},{"$f":"Invulformulier!N17","v":"PA TEAM 4"},{"$f":"Invulformulier!U17","v":2},{"$f":"Invulformulier!V17","v":"--"},{"$f":"Invulformulier!W17","v":8},null,{"$f":"Invulformulier!Y17","v":0},null,{"$f":"Invulformulier!AA17","v":3}]
[{"$f":"Invulformulier!D18","v":"10:40:00"},{"$f":"Invulformulier!E18","v":"00:00:00"},{"$f":"Invulformulier!G18","v":"PA TEAM 1"},{"$f":"Invulformulier!M18","v":"--"},{"$f":"Invulformulier!N18","v":"PA TEAM 3"},{"$f":"Invulformulier!U18","v":3},{"$f":"Invulformulier!V18","v":"--"},{"$f":"Invulformulier!W18","v":5},null,{"$f":"Invulformulier!Y18","v":0},null,{"$f":"Invulformulier!AA18","v":3}]
[{"$f":"Invulformulier!D19","v":"11:00:00"},{"$f":"Invulformulier!E19","v":"00:00:00"},{"$f":"Invulformulier!G19","v":"PA TEAM 2"},{"$f":"Invulformulier!M19","v":"--"},{"$f":"Invulformulier!N19","v":"PA TEAM 5"},{"$f":"Invulformulier!U19","v":1},{"$f":"Invulformulier!V19","v":"--"},{"$f":"Invulformulier!W19","v":2},null,{"$f":"Invulformulier!Y19","v":0},null,{"$f":"Invulformulier!AA19","v":3}]
[{"$f":"Invulformulier!D20","v":"11:20:00"},{"$f":"Invulformulier!E20","v":"00:00:00"},{"$f":"Invulformulier!G20","v":"PA TEAM 4"},{"$f":"Invulformulier!M20","v":"--"},{"$f":"Invulformulier!N20","v":"PA TEAM 1"},{"$f":"Invulformulier!U20","v":0},{"$f":"Invulformulier!V20","v":"--"},{"$f":"Invulformulier!W20","v":0},null,{"$f":"Invulformulier!Y20","v":1},null,{"$f":"Invulformulier!AA20","v":1}]
[{"$f":"Invulformulier!D21","v":"11:40:00"},{"$f":"Invulformulier!E21","v":"00:00:00"},{"$f":"Invulformulier!G21","v":"PA TEAM 3"},{"$f":"Invulformulier!M21","v":"--"},{"$f":"Invulformulier!N21","v":"PA TEAM 5"},{"$f":"Invulformulier!U21","v":3},{"$f":"Invulformulier!V21","v":"--"},{"$f":"Invulformulier!W21","v":2},null,{"$f":"Invulformulier!Y21","v":3},null,{"$f":"Invulformulier!AA21","v":0}]
[{"$f":"Invulformulier!D22","v":"12:00:00"},{"$f":"Invulformulier!E22","v":"00:00:00"},{"$f":"Invulformulier!G22","v":"PA TEAM 4"},{"$f":"Invulformulier!M22","v":"--"},{"$f":"Invulformulier!N22","v":"PA TEAM 2"},{"$f":"Invulformulier!U22","v":2},{"$f":"Invulformulier!V22","v":"--"},{"$f":"Invulformulier!W22","v":1},null,{"$f":"Invulformulier!Y22","v":3},null,{"$f":"Invulformulier!AA22","v":0}]
[]
[]
[{"$f":"Invulformulier!A3","v":"Stand"},{"$f":"Invulformulier!B5","v":"Poule A"},null,null,null,"Voor","Tegen","Punten",{"$f":"Invulformulier!K3","v":"Gewonnen"},{"$f":"Invulformulier!L3","v":"Gelijk"},{"$f":"Invulformulier!M3","v":"Verloren"},{"$f":"Invulformulier!N3","v":"Saldo"}]
[1,{"$f":"VLOOKUP(A16,Invulformulier!$A$6:$N$10,2,FALSE)","v":"PA TEAM 4"},null,null,null,{"$f":"VLOOKUP($A$16,Invulformulier!$A$6:$N$10,8,FALSE)","v":10},{"$f":"VLOOKUP($A$16,Invulformulier!$A$6:$N$10,9,FALSE)","v":3},{"$f":"VLOOKUP($A$16,Invulformulier!$A$6:$N$10,10,FALSE)","v":8.0070999999999994},{"$f":"VLOOKUP($A$16,Invulformulier!$A$6:$N$10,11,FALSE)","v":2},{"$f":"VLOOKUP($A$16,Invulformulier!$A$6:$N$10,12,FALSE)","v":2},{"$f":"VLOOKUP($A$16,Invulformulier!$A$6:$N$10,13,FALSE)","v":0},{"$f":"VLOOKUP($A$16,Invulformulier!$A$6:$N$10,14,FALSE)","v":7}]
[2,{"$f":"VLOOKUP(A17,Invulformulier!$A$6:$N$10,2,FALSE)","v":"PA TEAM 3"},null,null,null,{"$f":"VLOOKUP($A$17,Invulformulier!$A$6:$N$10,8,FALSE)","v":11},{"$f":"VLOOKUP($A$17,Invulformulier!$A$6:$N$10,9,FALSE)","v":11},{"$f":"VLOOKUP($A$17,Invulformulier!$A$6:$N$10,10,FALSE)","v":7.0001100000000003},{"$f":"VLOOKUP($A$17,Invulformulier!$A$6:$N$10,11,FALSE)","v":2},{"$f":"VLOOKUP($A$17,Invulformulier!$A$6:$N$10,12,FALSE)","v":1},{"$f":"VLOOKUP($A$17,Invulformulier!$A$6:$N$10,13,FALSE)","v":1},{"$f":"VLOOKUP($A$17,Invulformulier!$A$6:$N$10,14,FALSE)","v":0}]
[3,{"$f":"VLOOKUP(A18,Invulformulier!$A$6:$N$10,2,FALSE)","v":"PA TEAM 1"},null,null,null,{"$f":"VLOOKUP($A$18,Invulformulier!$A$6:$N$10,8,FALSE)","v":11},{"$f":"VLOOKUP($A$18,Invulformulier!$A$6:$N$10,9,FALSE)","v":12},{"$f":"VLOOKUP($A$18,Invulformulier!$A$6:$N$10,10,FALSE)","v":4.9991100000000008},{"$f":"VLOOKUP($A$18,Invulformulier!$A$6:$N$10,11,FALSE)","v":1},{"$f":"VLOOKUP($A$18,Invulformulier!$A$6:$N$10,12,FALSE)","v":2},{"$f":"VLOOKUP($A$18,Invulformulier!$A$6:$N$10,13,FALSE)","v":1},{"$f":"VLOOKUP($A$18,Invulformulier!$A$6:$N$10,14,FALSE)","v":-1}]
[4,{"$f":"VLOOKUP(A19,Invulformulier!$A$6:$N$10,2,FALSE)","v":"PA TEAM 5"},null,null,null,{"$f":"VLOOKUP($A$19,Invulformulier!$A$6:$N$10,8,FALSE)","v":11},{"$f":"VLOOKUP($A$19,Invulformulier!$A$6:$N$10,9,FALSE)","v":17},{"$f":"VLOOKUP($A$19,Invulformulier!$A$6:$N$10,10,FALSE)","v":3.99411},{"$f":"VLOOKUP($A$19,Invulformulier!$A$6:$N$10,11,FALSE)","v":1},{"$f":"VLOOKUP($A$19,Invulformulier!$A$6:$N$10,12,FALSE)","v":1},{"$f":"VLOOKUP($A$19,Invulformulier!$A$6:$N$10,13,FALSE)","v":2},{"$f":"VLOOKUP($A$19,Invulformulier!$A$6:$N$10,14,FALSE)","v":-6}]
[5,{"$f":"VLOOKUP(A20,Invulformulier!$A$6:$N$10,2,FALSE)","v":"PA TEAM 2"},null,null,null,{"$f":"VLOOKUP($A$20,Invulformulier!$A$6:$N$10,8,FALSE)","v":10},{"$f":"VLOOKUP($A$20,Invulformulier!$A$6:$N$10,9,FALSE)","v":10},{"$f":"VLOOKUP($A$20,Invulformulier!$A$6:$N$10,10,FALSE)","v":3.0001000000000002},{"$f":"VLOOKUP($A$20,Invulformulier!$A$6:$N$10,11,FALSE)","v":1},{"$f":"VLOOKUP($A$20,Invulformulier!$A$6:$N$10,12,FALSE)","v":0},{"$f":"VLOOKUP($A$20,Invulformulier!$A$6:$N$10,13,FALSE)","v":3},{"$f":"VLOOKUP($A$20,Invulformulier!$A$6:$N$10,14,FALSE)","v":0}]

{"sheet":"GROEP-2","index":2,"n_rows":20,"n_cols":13,"rows_kept":20,"cut":false,"hidden":false,"merged":[[0,12,0,13],[15,1,15,4],[16,1,16,4],[17,1,17,4],[0,0,0,11],[1,5,1,7],[1,9,1,11],[10,0,10,1],[11,0,11,1],[1,0,1,1],[1,2,1,4],[7,0,7,1],[8,0,8,1],[9,0,9,1],[4,0,4,1],[5,0,5,1],[6,0,6,1],[2,0,2,1],[3,0,3,1],[19,1,19,4],[14,1,14,4],[18,1,18,4]]}
["Stand groep 2",null,null,null,null,null,null,null,null,null,null,null,"SCORES BY:\nOnlineExcelCursus.NL"]
[{"$f":"Invulformulier!AC12","v":"Tijd"},null,{"$f":"Invulformulier!AF12","v":"VELD 2"},null,null,{"$f":"Invulformulier!AT12","v":"Uitslag"},null,null,null,{"$f":"Invulformulier!AX12","v":"Punten"}]
[{"$f":"Invulformulier!AC13","v":"09:00:00"},{"$f":"Invulformulier!AD13","v":"00:00:00"},{"$f":"Invulformulier!AF13","v":"PB TEAM 1"},{"$f":"Invulformulier!AL13","v":"--"},{"$f":"Invulformulier!AM13","v":"PB TEAM 2"},{"$f":"Invulformulier!AT13","v":1},{"$f":"Invulformulier!AU13","v":"--"},{"$f":"Invulformulier!AV13","v":8},null,{"$f":"Invulformulier!AX13","v":0},null,{"$f":"Invulformulier!AZ13","v":3}]
[{"$f":"Invulformulier!AC14","v":"09:20:00"},{"$f":"Invulformulier!AD14","v":"00:00:00"},{"$f":"Invulformulier!AF14","v":"PB TEAM 3"},{"$f":"Invulformulier!AL14","v":"--"},{"$f":"Invulformulier!AM14","v":"PB TEAM 4"},{"$f":"Invulformulier!AT14","v":2},{"$f":"Invulformulier!AU14","v":"--"},{"$f":"Invulformulier!AV14","v":6},null,{"$f":"Invulformulier!AX14","v":0},null,{"$f":"Invulformulier!AZ14","v":3}]
[{"$f":"Invulformulier!AC15","v":"09:40:00"},{"$f":"Invulformulier!AD15","v":"00:00:00"},{"$f":"Invulformulier!AF15","v":"PB TEAM 5"},{"$f":"Invulformulier!AL15","v":"--"},{"$f":"Invulformulier!AM15","v":"PB TEAM 1"},{"$f":"Invulformulier!AT15","v":3},{"$f":"Invulformulier!AU15","v":"--"},{"$f":"Invulformulier!AV15","v":8},null,{"$f":"Invulformulier!AX15","v":0},null,{"$f":"Invulformulier!AZ15","v":3}]
[{"$f":"Invulformulier!AC16","v":"10:00:00"},{"$f":"Invulformulier!AD16","v":"00:00:00"},{"$f":"Invulformulier!AF16","v":"PB TEAM 2"},{"$f":"Invulformulier!AL16","v":"--"},{"$f":"Invulformulier!AM16","v":"PB TEAM 3"},{"$f":"Invulformulier!AT16","v":4},{"$f":"Invulformulier!AU16","v":"--"},{"$f":"Invulformulier!AV16","v":4},null,{"$f":"Invulformulier!AX16","v":1},null,{"$f":"Invulformulier!AZ16","v":1}]
[{"$f":"Invulformulier!AC17","v":"10:20:00"},{"$f":"Invulformulier!AD17","v":"00:00:00"},{"$f":"Invulformulier!AF17","v":"PB TEAM 5"},{"$f":"Invulformulier!AL17","v":"--"},{"$f":"Invulformulier!AM17","v":"PB TEAM 4"},{"$f":"Invulformulier!AT17","v":2},{"$f":"Invulformulier!AU17","v":"--"},{"$f":"Invulformulier!AV17","v":3},null,{"$f":"Invulformulier!AX17","v":0},null,{"$f":"Invulformulier!AZ17","v":3}]
[{"$f":"Invulformulier!AC18","v":"10:40:00"},{"$f":"Invulformulier!AD18","v":"00:00:00"},{"$f":"Invulformulier!AF18","v":"PB TEAM 1"},{"$f":"Invulformulier!AL18","v":"--"},{"$f":"Invulformulier!AM18","v":"PB TEAM 3"},{"$f":"Invulformulier!AT18","v":1},{"$f":"Invulformulier!AU18","v":"--"},{"$f":"Invulformulier!AV18","v":6},null,{"$f":"Invulformulier!AX18","v":0},null,{"$f":"Invulformulier!AZ18","v":3}]
[{"$f":"Invulformulier!AC19","v":"11:00:00"},{"$f":"Invulformulier!AD19","v":"00:00:00"},{"$f":"Invulformulier!AF19","v":"PB TEAM 2"},{"$f":"Invulformulier!AL19","v":"--"},{"$f":"Invulformulier!AM19","v":"PB TEAM 5"},{"$f":"Invulformulier!AT19","v":1},{"$f":"Invulformulier!AU19","v":"--"},{"$f":"Invulformulier!AV19","v":2},null,{"$f":"Invulformulier!AX19","v":0},null,{"$f":"Invulformulier!AZ19","v":3}]
[{"$f":"Invulformulier!AC20","v":"11:20:00"},{"$f":"Invulformulier!AD20","v":"00:00:00"},{"$f":"Invulformulier!AF20","v":"PB TEAM 4"},{"$f":"Invulformulier!AL20","v":"--"},{"$f":"Invulformulier!AM20","v":"PB TEAM 1"},{"$f":"Invulformulier!AT20","v":3},{"$f":"Invulformulier!AU20","v":"--"},{"$f":"Invulformulier!AV20","v":5},null,{"$f":"Invulformulier!AX20","v":0},null,{"$f":"Invulformulier!AZ20","v":3}]
[{"$f":"Invulformulier!AC21","v":"11:40:00"},{"$f":"Invulformulier!AD21","v":"00:00:00"},{"$f":"Invulformulier!AF21","v":"PB TEAM 3"},{"$f":"Invulformulier!AL21","v":"--"},{"$f":"Invulformulier!AM21","v":"PB TEAM 5"},{"$f":"Invulformulier!AT21","v":2},{"$f":"Invulformulier!AU21","v":"--"},{"$f":"Invulformulier!AV21","v":2},null,{"$f":"Invulformulier!AX21","v":1},null,{"$f":"Invulformulier!AZ21","v":1}]
[{"$f":"Invulformulier!AC22","v":"12:00:00"},{"$f":"Invulformulier!AD22","v":"00:00:00"},{"$f":"Invulformulier!AF22","v":"PB TEAM 4"},{"$f":"Invulformulier!AL22","v":"--"},{"$f":"Invulformulier!AM22","v":"PB TEAM 2"},{"$f":"Invulformulier!AT22","v":0},{"$f":"Invulformulier!AU22","v":"--"},{"$f":"Invulformulier!AV22","v":3},null,{"$f":"Invulformulier!AX22","v":0},null,{"$f":"Invulformulier!AZ22","v":3}]
[]
[]
["Stand",{"$f":"Invulformulier!P5","v":"Poule B"},null,null,null,"Voor","Tegen","Punten",{"$f":"Invulformulier!Z3","v":"Gewonnen"},{"$f":"Invulformulier!AA3","v":"Gelijk"},{"$f":"Invulformulier!AB3","v":"Verloren"},{"$f":"Invulformulier!AC3","v":"Saldo"}]
[1,{"$f":"VLOOKUP(A16,Invulformulier!$O$6:$AC$10,2,FALSE)","v":"PB TEAM 2"},null,null,null,{"$f":"VLOOKUP($A16,Invulformulier!$O$6:$AC$10,9,FALSE)","v":16},{"$f":"VLOOKUP($A16,Invulformulier!$O$6:$AC$10,10,FALSE)","v":7},{"$f":"VLOOKUP($A16,Invulformulier!$O$6:$AC$10,11,FALSE)","v":7.0091600000000005},{"$f":"VLOOKUP($A16,Invulformulier!$O$6:$AC$10,12,FALSE)","v":2},{"$f":"VLOOKUP($A16,Invulformulier!$O$6:$AC$10,13,FALSE)","v":1},{"$f":"VLOOKUP($A16,Invulformulier!$O$6:$AC$10,14,FALSE)","v":1},{"$f":"VLOOKUP($A16,Invulformulier!$O$6:$AC$10,15,FALSE)","v":9}]
[2,{"$f":"VLOOKUP(A17,Invulformulier!$O$6:$AC$10,2,FALSE)","v":"PB TEAM 4"},null,null,null,{"$f":"VLOOKUP($A17,Invulformulier!$O$6:$AC$10,9,FALSE)","v":12},{"$f":"VLOOKUP($A17,Invulformulier!$O$6:$AC$10,10,FALSE)","v":12},{"$f":"VLOOKUP($A17,Invulformulier!$O$6:$AC$10,11,FALSE)","v":6.0001199999999999},{"$f":"VLOOKUP($A17,Invulformulier!$O$6:$AC$10,12,FALSE)","v":2},{"$f":"VLOOKUP($A17,Invulformulier!$O$6:$AC$10,13,FALSE)","v":0},{"$f":"VLOOKUP($A17,Invulformulier!$O$6:$AC$10,14,FALSE)","v":2},{"$f":"VLOOKUP($A17,Invulformulier!$O$6:$AC$10,15,FALSE)","v":0}]
[3,{"$f":"VLOOKUP(A18,Invulformulier!$O$6:$AC$10,2,FALSE)","v":"PB TEAM 1"},null,null,null,{"$f":"VLOOKUP($A18,Invulformulier!$O$6:$AC$10,9,FALSE)","v":15},{"$f":"VLOOKUP($A18,Invulformulier!$O$6:$AC$10,10,FALSE)","v":20},{"$f":"VLOOKUP($A18,Invulformulier!$O$6:$AC$10,11,FALSE)","v":5.9951499999999998},{"$f":"VLOOKUP($A18,Invulformulier!$O$6:$AC$10,12,FALSE)","v":2},{"$f":"VLOOKUP($A18,Invulformulier!$O$6:$AC$10,13,FALSE)","v":0},{"$f":"VLOOKUP($A18,Invulformulier!$O$6:$AC$10,14,FALSE)","v":2},{"$f":"VLOOKUP($A18,Invulformulier!$O$6:$AC$10,15,FALSE)","v":-5}]
[4,{"$f":"VLOOKUP(A19,Invulformulier!$O$6:$AC$10,2,FALSE)","v":"PB TEAM 3"},null,null,null,{"$f":"VLOOKUP($A19,Invulformulier!$O$6:$AC$10,9,FALSE)","v":14},{"$f":"VLOOKUP($A19,Invulformulier!$O$6:$AC$10,10,FALSE)","v":13},{"$f":"VLOOKUP($A19,Invulformulier!$O$6:$AC$10,11,FALSE)","v":5.0011400000000004},{"$f":"VLOOKUP($A19,Invulformulier!$O$6:$AC$10,12,FALSE)","v":1},{"$f":"VLOOKUP($A19,Invulformulier!$O$6:$AC$10,13,FALSE)","v":2},{"$f":"VLOOKUP($A19,Invulformulier!$O$6:$AC$10,14,FALSE)","v":1},{"$f":"VLOOKUP($A19,Invulformulier!$O$6:$AC$10,15,FALSE)","v":1}]
[5,{"$f":"VLOOKUP(A20,Invulformulier!$O$6:$AC$10,2,FALSE)","v":"PB TEAM 5"},null,null,null,{"$f":"VLOOKUP($A20,Invulformulier!$O$6:$AC$10,9,FALSE)","v":9},{"$f":"VLOOKUP($A20,Invulformulier!$O$6:$AC$10,10,FALSE)","v":14},{"$f":"VLOOKUP($A20,Invulformulier!$O$6:$AC$10,11,FALSE)","v":3.9950900000000007},{"$f":"VLOOKUP($A20,Invulformulier!$O$6:$AC$10,12,FALSE)","v":1},{"$f":"VLOOKUP($A20,Invulformulier!$O$6:$AC$10,13,FALSE)","v":1},{"$f":"VLOOKUP($A20,Invulformulier!$O$6:$AC$10,14,FALSE)","v":2},{"$f":"VLOOKUP($A20,Invulformulier!$O$6:$AC$10,15,FALSE)","v":-5}]

{"sheet":"GROEP-3","index":3,"n_rows":20,"n_cols":13,"rows_kept":20,"cut":false,"hidden":false,"merged":[[0,12,0,13],[0,0,0,11],[9,0,9,1],[10,0,10,1],[7,0,7,1],[8,0,8,1],[5,0,5,1],[1,9,1,11],[2,0,2,1],[3,0,3,1],[4,0,4,1],[1,0,1,1],[1,5,1,7],[1,2,1,4],[6,0,6,1],[17,1,17,4],[18,1,18,4],[19,1,19,4],[15,1,15,4],[11,0,11,1],[16,1,16,4],[14,1,14,4]]}
["Stand groep 3",null,null,null,null,null,null,null,null,null,null,null,"SCORES BY:\nOnlineExcelCursus.NL"]
[{"$f":"Invulformulier!D24","v":"Tijd"},{"$f":"Invulformulier!E24","v":0},{"$f":"Invulformulier!G24","v":"VELD 3"},null,null,{"$f":"Invulformulier!U24","v":"Uitslag"},{"$f":"Invulformulier!V24","v":0},{"$f":"Invulformulier!W24","v":0},null,{"$f":"Invulformulier!Y24","v":"Punten"}]
[{"$f":"Invulformulier!D25","v":"09:00:00"},{"$f":"Invulformulier!E25","v":"00:00:00"},{"$f":"Invulformulier!G25","v":"PC TEAM 1"},{"$f":"Invulformulier!M25","v":"--"},{"$f":"Invulformulier!N25","v":"PC TEAM 2"},{"$f":"Invulformulier!U25","v":9},{"$f":"Invulformulier!V25","v":"--"},{"$f":"Invulformulier!W25","v":2},null,{"$f":"Invulformulier!Y25","v":3},null,{"$f":"Invulformulier!AA25","v":0}]
[{"$f":"Invulformulier!D26","v":"09:20:00"},{"$f":"Invulformulier!E26","v":"00:00:00"},{"$f":"Invulformulier!G26","v":"PC TEAM 3"},{"$f":"Invulformulier!M26","v":"--"},{"$f":"Invulformulier!N26","v":"PC TEAM 4"},{"$f":"Invulformulier!U26","v":8},{"$f":"Invulformulier!V26","v":"--"},{"$f":"Invulformulier!W26","v":4},null,{"$f":"Invulformulier!Y26","v":3},null,{"$f":"Invulformulier!AA26","v":0}]
[{"$f":"Invulformulier!D27","v":"09:40:00"},{"$f":"Invulformulier!E27","v":"00:00:00"},{"$f":"Invulformulier!G27","v":"PC TEAM 5"},{"$f":"Invulformulier!M27","v":"--"},{"$f":"Invulformulier!N27","v":"PC TEAM 1"},{"$f":"Invulformulier!U27","v":7},{"$f":"Invulformulier!V27","v":"--"},{"$f":"Invulformulier!W27","v":5},null,{"$f":"Invulformulier!Y27","v":3},null,{"$f":"Invulformulier!AA27","v":0}]
[{"$f":"Invulformulier!D28","v":"10:00:00"},{"$f":"Invulformulier!E28","v":"00:00:00"},{"$f":"Invulformulier!G28","v":"PC TEAM 2"},{"$f":"Invulformulier!M28","v":"--"},{"$f":"Invulformulier!N28","v":"PC TEAM 3"},{"$f":"Invulformulier!U28","v":4},{"$f":"Invulformulier!V28","v":"--"},{"$f":"Invulformulier!W28","v":1},null,{"$f":"Invulformulier!Y28","v":3},null,{"$f":"Invulformulier!AA28","v":0}]
[{"$f":"Invulformulier!D29","v":"10:20:00"},{"$f":"Invulformulier!E29","v":"00:00:00"},{"$f":"Invulformulier!G29","v":"PC TEAM 5"},{"$f":"Invulformulier!M29","v":"--"},{"$f":"Invulformulier!N29","v":"PC TEAM 4"},{"$f":"Invulformulier!U29","v":5},{"$f":"Invulformulier!V29","v":"--"},{"$f":"Invulformulier!W29","v":0},null,{"$f":"Invulformulier!Y29","v":3},null,{"$f":"Invulformulier!AA29","v":0}]
[{"$f":"Invulformulier!D30","v":"10:40:00"},{"$f":"Invulformulier!E30","v":"00:00:00"},{"$f":"Invulformulier!G30","v":"PC TEAM 1"},{"$f":"Invulformulier!M30","v":"--"},{"$f":"Invulformulier!N30","v":"PC TEAM 3"},{"$f":"Invulformulier!U30","v":6},{"$f":"Invulformulier!V30","v":"--"},{"$f":"Invulformulier!W30","v":8},null,{"$f":"Invulformulier!Y30","v":0},null,{"$f":"Invulformulier!AA30","v":3}]
[{"$f":"Invulformulier!D31","v":"11:00:00"},{"$f":"Invulformulier!E31","v":"00:00:00"},{"$f":"Invulformulier!G31","v":"PC TEAM 2"},{"$f":"Invulformulier!M31","v":"--"},{"$f":"Invulformulier!N31","v":"PC TEAM 5"},{"$f":"Invulformulier!U31","v":1},{"$f":"Invulformulier!V31","v":"--"},{"$f":"Invulformulier!W31","v":5},null,{"$f":"Invulformulier!Y31","v":0},null,{"$f":"Invulformulier!AA31","v":3}]
[{"$f":"Invulformulier!D32","v":"11:20:00"},{"$f":"Invulformulier!E32","v":"00:00:00"},{"$f":"Invulformulier!G32","v":"PC TEAM 4"},{"$f":"Invulformulier!M32","v":"--"},{"$f":"Invulformulier!N32","v":"PC TEAM 1"},{"$f":"Invulformulier!U32","v":2},{"$f":"Invulformulier!V32","v":"--"},{"$f":"Invulformulier!W32","v":4},null,{"$f":"Invulformulier!Y32","v":0},null,{"$f":"Invulformulier!AA32","v":3}]
[{"$f":"Invulformulier!D33","v":"11:40:00"},{"$f":"Invulformulier!E33","v":"00:00:00"},{"$f":"Invulformulier!G33","v":"PC TEAM 3"},{"$f":"Invulformulier!M33","v":"--"},{"$f":"Invulformulier!N33","v":"PC TEAM 5"},{"$f":"Invulformulier!U33","v":0},{"$f":"Invulformulier!V33","v":"--"},{"$f":"Invulformulier!W33","v":3},null,{"$f":"Invulformulier!Y33","v":0},null,{"$f":"Invulformulier!AA33","v":3}]
[{"$f":"Invulformulier!D34","v":"12:00:00"},{"$f":"Invulformulier!E34","v":"00:00:00"},{"$f":"Invulformulier!G34","v":"PC TEAM 4"},{"$f":"Invulformulier!M34","v":"--"},{"$f":"Invulformulier!N34","v":"PC TEAM 2"},{"$f":"Invulformulier!U34","v":1},{"$f":"Invulformulier!V34","v":"--"},{"$f":"Invulformulier!W34","v":2},null,{"$f":"Invulformulier!Y34","v":0},null,{"$f":"Invulformulier!AA34","v":3}]
[]
[]
[{"$f":"Invulformulier!AD3","v":"Stand"},{"$f":"Invulformulier!AE5","v":"Poule C"},null,null,null,"Voor","Tegen","Punten",{"$f":"Invulformulier!AN3","v":"Gewonnen"},{"$f":"Invulformulier!AO3","v":"Gelijk"},{"$f":"Invulformulier!AP3","v":"Verloren"},{"$f":"Invulformulier!AQ3","v":"Saldo"}]
[1,{"$f":"VLOOKUP(A16,Invulformulier!$AD$6:$AQ$10,2,FALSE)","v":"PC TEAM 5"},null,null,null,{"$f":"VLOOKUP($A16,Invulformulier!$AD$6:$AQ$10,8,FALSE)","v":20},{"$f":"VLOOKUP($A16,Invulformulier!$AD$6:$AQ$10,9,FALSE)","v":6},{"$f":"VLOOKUP($A16,Invulformulier!$AD$6:$AQ$10,10,FALSE)","v":12.014199999999999},{"$f":"VLOOKUP($A16,Invulformulier!$AD$6:$AQ$10,11,FALSE)","v":4},{"$f":"VLOOKUP($A16,Invulformulier!$AD$6:$AQ$10,12,FALSE)","v":0},{"$f":"VLOOKUP($A16,Invulformulier!$AD$6:$AQ$10,13,FALSE)","v":0},{"$f":"VLOOKUP($A16,Invulformulier!$AD$6:$AQ$10,14,FALSE)","v":14}]
[2,{"$f":"VLOOKUP(A17,Invulformulier!$AD$6:$AQ$10,2,FALSE)","v":"PC TEAM 1"},null,null,null,{"$f":"VLOOKUP($A17,Invulformulier!$AD$6:$AQ$10,8,FALSE)","v":24},{"$f":"VLOOKUP($A17,Invulformulier!$AD$6:$AQ$10,9,FALSE)","v":19},{"$f":"VLOOKUP($A17,Invulformulier!$AD$6:$AQ$10,10,FALSE)","v":6.0052399999999997},{"$f":"VLOOKUP($A17,Invulformulier!$AD$6:$AQ$10,11,FALSE)","v":2},{"$f":"VLOOKUP($A17,Invulformulier!$AD$6:$AQ$10,12,FALSE)","v":0},{"$f":"VLOOKUP($A17,Invulformulier!$AD$6:$AQ$10,13,FALSE)","v":2},{"$f":"VLOOKUP($A17,Invulformulier!$AD$6:$AQ$10,14,FALSE)","v":5}]
[3,{"$f":"VLOOKUP(A18,Invulformulier!$AD$6:$AQ$10,2,FALSE)","v":"PC TEAM 3"},null,null,null,{"$f":"VLOOKUP($A18,Invulformulier!$AD$6:$AQ$10,8,FALSE)","v":17},{"$f":"VLOOKUP($A18,Invulformulier!$AD$6:$AQ$10,9,FALSE)","v":17},{"$f":"VLOOKUP($A18,Invulformulier!$AD$6:$AQ$10,10,FALSE)","v":6.0001699999999998},{"$f":"VLOOKUP($A18,Invulformulier!$AD$6:$AQ$10,11,FALSE)","v":2},{"$f":"VLOOKUP($A18,Invulformulier!$AD$6:$AQ$10,12,FALSE)","v":0},{"$f":"VLOOKUP($A18,Invulformulier!$AD$6:$AQ$10,13,FALSE)","v":2},{"$f":"VLOOKUP($A18,Invulformulier!$AD$6:$AQ$10,14,FALSE)","v":0}]
[4,{"$f":"VLOOKUP(A19,Invulformulier!$AD$6:$AQ$10,2,FALSE)","v":"PC TEAM 2"},null,null,null,{"$f":"VLOOKUP($A19,Invulformulier!$AD$6:$AQ$10,8,FALSE)","v":9},{"$f":"VLOOKUP($A19,Invulformulier!$AD$6:$AQ$10,9,FALSE)","v":16},{"$f":"VLOOKUP($A19,Invulformulier!$AD$6:$AQ$10,10,FALSE)","v":5.9930900000000005},{"$f":"VLOOKUP($A19,Invulformulier!$AD$6:$AQ$10,11,FALSE)","v":2},{"$f":"VLOOKUP($A19,Invulformulier!$AD$6:$AQ$10,12,FALSE)","v":0},{"$f":"VLOOKUP($A19,Invulformulier!$AD$6:$AQ$10,13,FALSE)","v":2},{"$f":"VLOOKUP($A19,Invulformulier!$AD$6:$AQ$10,14,FALSE)","v":-7}]
[5,{"$f":"VLOOKUP(A20,Invulformulier!$AD$6:$AQ$10,2,FALSE)","v":"PC TEAM 4"},null,null,null,{"$f":"VLOOKUP($A20,Invulformulier!$AD$6:$AQ$10,8,FALSE)","v":7},{"$f":"VLOOKUP($A20,Invulformulier!$AD$6:$AQ$10,9,FALSE)","v":19},{"$f":"VLOOKUP($A20,Invulformulier!$AD$6:$AQ$10,10,FALSE)","v":-1.193E-2},{"$f":"VLOOKUP($A20,Invulformulier!$AD$6:$AQ$10,11,FALSE)","v":0},{"$f":"VLOOKUP($A20,Invulformulier!$AD$6:$AQ$10,12,FALSE)","v":0},{"$f":"VLOOKUP($A20,Invulformulier!$AD$6:$AQ$10,13,FALSE)","v":4},{"$f":"VLOOKUP($A20,Invulformulier!$AD$6:$AQ$10,14,FALSE)","v":-12}]

{"sheet":"GROEP-4","index":4,"n_rows":20,"n_cols":13,"rows_kept":20,"cut":false,"hidden":false,"merged":[[0,12,0,13],[15,1,15,4],[16,1,16,4],[0,0,0,11],[1,5,1,7],[1,9,1,11],[1,0,1,1],[17,1,17,4],[18,1,18,4],[14,1,14,4],[1,2,1,4],[19,1,19,4],[11,0,11,1],[9,0,9,1],[10,0,10,1],[7,0,7,1],[8,0,8,1],[2,0,2,1],[5,0,5,1],[6,0,6,1],[3,0,3,1],[4,0,4,1]]}
["Stand groep 4",null,null,null,null,null,null,null,null,null,null,null,"SCORES BY:\nOnlineExcelCursus.NL"]
[{"$f":"Invulformulier!AC24","v":"Tijd"},{"$f":"Invulformulier!AD24","v":0},{"$f":"Invulformulier!AF24","v":"VELD 4"},null,null,{"$f":"Invulformulier!AT24","v":"Uitslag"},{"$f":"Invulformulier!AU24","v":0},{"$f":"Invulformulier!AV24","v":0},null,{"$f":"Invulformulier!AX24","v":"Punten"},{"$f":"Invulformulier!AY24","v":0},{"$f":"Invulformulier!AZ24","v":0}]
[{"$f":"Invulformulier!AC25","v":"09:00:00"},{"$f":"Invulformulier!AD25","v":"00:00:00"},{"$f":"Invulformulier!AF25","v":"PD TEAM 1"},{"$f":"Invulformulier!AL25","v":"--"},{"$f":"Invulformulier!AM25","v":"PD TEAM 2"},{"$f":"Invulformulier!AT25","v":1},{"$f":"Invulformulier!AU25","v":"--"},{"$f":"Invulformulier!AV25","v":1},null,{"$f":"Invulformulier!AX25","v":1},null,{"$f":"Invulformulier!AZ25","v":1}]
[{"$f":"Invulformulier!AC26","v":"09:20:00"},{"$f":"Invulformulier!AD26","v":"00:00:00"},{"$f":"Invulformulier!AF26","v":"PD TEAM 3"},{"$f":"Invulformulier!AL26","v":"--"},{"$f":"Invulformulier!AM26","v":"PD TEAM 4"},{"$f":"Invulformulier!AT26","v":1},{"$f":"Invulformulier!AU26","v":"--"},{"$f":"Invulformulier!AV26","v":0},null,{"$f":"Invulformulier!AX26","v":3},null,{"$f":"Invulformulier!AZ26","v":0}]
[{"$f":"Invulformulier!AC27","v":"09:40:00"},{"$f":"Invulformulier!AD27","v":"00:00:00"},{"$f":"Invulformulier!AF27","v":"PD TEAM 5"},{"$f":"Invulformulier!AL27","v":"--"},{"$f":"Invulformulier!AM27","v":"PD TEAM 1"},{"$f":"Invulformulier!AT27","v":1},{"$f":"Invulformulier!AU27","v":"--"},{"$f":"Invulformulier!AV27","v":1},null,{"$f":"Invulformulier!AX27","v":1},null,{"$f":"Invulformulier!AZ27","v":1}]
[{"$f":"Invulformulier!AC28","v":"10:00:00"},{"$f":"Invulformulier!AD28","v":"00:00:00"},{"$f":"Invulformulier!AF28","v":"PD TEAM 2"},{"$f":"Invulformulier!AL28","v":"--"},{"$f":"Invulformulier!AM28","v":"PD TEAM 3"},{"$f":"Invulformulier!AT28","v":1},{"$f":"Invulformulier!AU28","v":"--"},{"$f":"Invulformulier!AV28","v":2},null,{"$f":"Invulformulier!AX28","v":0},null,{"$f":"Invulformulier!AZ28","v":3}]
[{"$f":"Invulformulier!AC29","v":"10:20:00"},{"$f":"Invulformulier!AD29","v":"00:00:00"},{"$f":"Invulformulier!AF29","v":"PD TEAM 5"},{"$f":"Invulformulier!AL29","v":"--"},{"$f":"Invulformulier!AM29","v":"PD TEAM 4"},{"$f":"Invulformulier!AT29","v":2},{"$f":"Invulformulier!AU29","v":"--"},{"$f":"Invulformulier!AV29","v":2},null,{"$f":"Invulformulier!AX29","v":1},null,{"$f":"Invulformulier!AZ29","v":1}]
[{"$f":"Invulformulier!AC30","v":"10:40:00"},{"$f":"Invulformulier!AD30","v":"00:00:00"},{"$f":"Invulformulier!AF30","v":"PD TEAM 1"},{"$f":"Invulformulier!AL30","v":"--"},{"$f":"Invulformulier!AM30","v":"PD TEAM 3"},{"$f":"Invulformulier!AT30","v":2},{"$f":"Invulformulier!AU30","v":"--"},{"$f":"Invulformulier!AV30","v":5},null,{"$f":"Invulformulier!AX30","v":0},null,{"$f":"Invulformulier!AZ30","v":3}]
[{"$f":"Invulformulier!AC31","v":"11:00:00"},{"$f":"Invulformulier!AD31","v":"00:00:00"},{"$f":"Invulformulier!AF31","v":"PD TEAM 2"},{"$f":"Invulformulier!AL31","v":"--"},{"$f":"Invulformulier!AM31","v":"PD TEAM 5"},{"$f":"Invulformulier!AT31","v":3},{"$f":"Invulformulier!AU31","v":"--"},{"$f":"Invulformulier!AV31","v":5},null,{"$f":"Invulformulier!AX31","v":0},null,{"$f":"Invulformulier!AZ31","v":3}]
[{"$f":"Invulformulier!AC32","v":"11:20:00"},{"$f":"Invulformulier!AD32","v":"00:00:00"},{"$f":"Invulformulier!AF32","v":"PD TEAM 4"},{"$f":"Invulformulier!AL32","v":"--"},{"$f":"Invulformulier!AM32","v":"PD TEAM 1"},{"$f":"Invulformulier!AT32","v":3},{"$f":"Invulformulier!AU32","v":"--"},{"$f":"Invulformulier!AV32","v":3},null,{"$f":"Invulformulier!AX32","v":1},null,{"$f":"Invulformulier!AZ32","v":1}]
[{"$f":"Invulformulier!AC33","v":"11:40:00"},{"$f":"Invulformulier!AD33","v":"00:00:00"},{"$f":"Invulformulier!AF33","v":"PD TEAM 3"},{"$f":"Invulformulier!AL33","v":"--"},{"$f":"Invulformulier!AM33","v":"PD TEAM 5"},{"$f":"Invulformulier!AT33","v":3},{"$f":"Invulformulier!AU33","v":"--"},{"$f":"Invulformulier!AV33","v":3},null,{"$f":"Invulformulier!AX33","v":1},null,{"$f":"Invulformulier!AZ33","v":1}]
[{"$f":"Invulformulier!AC34","v":"12:00:00"},{"$f":"Invulformulier!AD34","v":"00:00:00"},{"$f":"Invulformulier!AF34","v":"PD TEAM 4"},{"$f":"Invulformulier!AL34","v":"--"},{"$f":"Invulformulier!AM34","v":"PD TEAM 2"},{"$f":"Invulformulier!AT34","v":5},{"$f":"Invulformulier!AU34","v":"--"},{"$f":"Invulformulier!AV34","v":3},null,{"$f":"Invulformulier!AX34","v":3},null,{"$f":"Invulformulier!AZ34","v":0}]
[]
[]
[{"$f":"Invulformulier!AR3","v":"Stand"},{"$f":"Invulformulier!AS5","v":"Poule D"},null,null,null,"Voor","Tegen","Punten",{"$f":"Invulformulier!BB3","v":"Gewonnen"},{"$f":"Invulformulier!BC3","v":"Gelijk"},{"$f":"Invulformulier!BD3","v":"Verloren"},{"$f":"Invulformulier!BE3","v":"Saldo"}]
[1,{"$f":"VLOOKUP(A16,Invulformulier!$AR$6:$BE$10,2,FALSE)","v":"PD TEAM 3"},null,null,null,{"$f":"VLOOKUP($A16,Invulformulier!$AR$6:$BE$10,8,FALSE)","v":11},{"$f":"VLOOKUP($A16,Invulformulier!$AR$6:$BE$10,9,FALSE)","v":6},{"$f":"VLOOKUP($A16,Invulformulier!$AR$6:$BE$10,10,FALSE)","v":10.005109999999998},{"$f":"VLOOKUP($A16,Invulformulier!$AR$6:$BE$10,11,FALSE)","v":3},{"$f":"VLOOKUP($A16,Invulformulier!$AR$6:$BE$10,12,FALSE)","v":1},{"$f":"VLOOKUP($A16,Invulformulier!$AR$6:$BE$10,13,FALSE)","v":0},{"$f":"VLOOKUP($A16,Invulformulier!$AR$6:$BE$10,14,FALSE)","v":5}]
[2,{"$f":"VLOOKUP(A17,Invulformulier!$AR$6:$BE$10,2,FALSE)","v":"PD TEAM 5"},null,null,null,{"$f":"VLOOKUP($A17,Invulformulier!$AR$6:$BE$10,8,FALSE)","v":11},{"$f":"VLOOKUP($A17,Invulformulier!$AR$6:$BE$10,9,FALSE)","v":9},{"$f":"VLOOKUP($A17,Invulformulier!$AR$6:$BE$10,10,FALSE)","v":6.0021100000000001},{"$f":"VLOOKUP($A17,Invulformulier!$AR$6:$BE$10,11,FALSE)","v":1},{"$f":"VLOOKUP($A17,Invulformulier!$AR$6:$BE$10,12,FALSE)","v":3},{"$f":"VLOOKUP($A17,Invulformulier!$AR$6:$BE$10,13,FALSE)","v":0},{"$f":"VLOOKUP($A17,Invulformulier!$AR$6:$BE$10,14,FALSE)","v":2}]
[3,{"$f":"VLOOKUP(A18,Invulformulier!$AR$6:$BE$10,2,FALSE)","v":"PD TEAM 4"},null,null,null,{"$f":"VLOOKUP($A18,Invulformulier!$AR$6:$BE$10,8,FALSE)","v":10},{"$f":"VLOOKUP($A18,Invulformulier!$AR$6:$BE$10,9,FALSE)","v":9},{"$f":"VLOOKUP($A18,Invulformulier!$AR$6:$BE$10,10,FALSE)","v":5.0010999999999992},{"$f":"VLOOKUP($A18,Invulformulier!$AR$6:$BE$10,11,FALSE)","v":1},{"$f":"VLOOKUP($A18,Invulformulier!$AR$6:$BE$10,12,FALSE)","v":2},{"$f":"VLOOKUP($A18,Invulformulier!$AR$6:$BE$10,13,FALSE)","v":1},{"$f":"VLOOKUP($A18,Invulformulier!$AR$6:$BE$10,14,FALSE)","v":1}]
[4,{"$f":"VLOOKUP(A19,Invulformulier!$AR$6:$BE$10,2,FALSE)","v":"PD TEAM 1"},null,null,null,{"$f":"VLOOKUP($A19,Invulformulier!$AR$6:$BE$10,8,FALSE)","v":7},{"$f":"VLOOKUP($A19,Invulformulier!$AR$6:$BE$10,9,FALSE)","v":10},{"$f":"VLOOKUP($A19,Invulformulier!$AR$6:$BE$10,10,FALSE)","v":2.9970700000000003},{"$f":"VLOOKUP($A19,Invulformulier!$AR$6:$BE$10,11,FALSE)","v":0},{"$f":"VLOOKUP($A19,Invulformulier!$AR$6:$BE$10,12,FALSE)","v":3},{"$f":"VLOOKUP($A19,Invulformulier!$AR$6:$BE$10,13,FALSE)","v":1},{"$f":"VLOOKUP($A19,Invulformulier!$AR$6:$BE$10,14,FALSE)","v":-3}]
[5,{"$f":"VLOOKUP(A20,Invulformulier!$AR$6:$BE$10,2,FALSE)","v":"PD TEAM 2"},null,null,null,{"$f":"VLOOKUP($A20,Invulformulier!$AR$6:$BE$10,8,FALSE)","v":8},{"$f":"VLOOKUP($A20,Invulformulier!$AR$6:$BE$10,9,FALSE)","v":13},{"$f":"VLOOKUP($A20,Invulformulier!$AR$6:$BE$10,10,FALSE)","v":0.99507999999999996},{"$f":"VLOOKUP($A20,Invulformulier!$AR$6:$BE$10,11,FALSE)","v":0},{"$f":"VLOOKUP($A20,Invulformulier!$AR$6:$BE$10,12,FALSE)","v":1},{"$f":"VLOOKUP($A20,Invulformulier!$AR$6:$BE$10,13,FALSE)","v":3},{"$f":"VLOOKUP($A20,Invulformulier!$AR$6:$BE$10,14,FALSE)","v":-5}]

{"sheet":"GROEP-5","index":5,"n_rows":20,"n_cols":13,"rows_kept":20,"cut":false,"hidden":false,"merged":[[7,0,7,1],[0,0,0,11],[0,12,0,13],[1,0,1,1],[1,2,1,4],[1,5,1,7],[1,9,1,11],[2,0,2,1],[3,0,3,1],[4,0,4,1],[5,0,5,1],[6,0,6,1],[8,0,8,1],[9,0,9,1],[10,0,10,1],[11,0,11,1],[14,1,14,4],[15,1,15,4],[16,1,16,4],[17,1,17,4],[18,1,18,4],[19,1,19,4]]}
["Stand groep 5",null,null,null,null,null,null,null,null,null,null,null,"SCORES BY:\nOnlineExcelCursus.NL"]
[{"$f":"Invulformulier!AC24","v":"Tijd"},{"$f":"Invulformulier!AD24","v":0},{"$f":"Invulformulier!AF24","v":"VELD 4"},null,null,{"$f":"Invulformulier!AT24","v":"Uitslag"},{"$f":"Invulformulier!AU24","v":0},{"$f":"Invulformulier!AV24","v":0},null,{"$f":"Invulformulier!AX24","v":"Punten"},{"$f":"Invulformulier!AY24","v":0},{"$f":"Invulformulier!AZ24","v":0}]
[{"$f":"Invulformulier!D38","v":"09:00:00"},{"$f":"Invulformulier!AD25","v":"00:00:00"},{"$f":"Invulformulier!G38","v":"PE TEAM 1"},{"$f":"Invulformulier!AL25","v":"--"},{"$f":"Invulformulier!N38","v":"PE TEAM 2"},{"$f":"Invulformulier!U38","v":2},{"$f":"Invulformulier!AU25","v":"--"},{"$f":"Invulformulier!W38","v":3},null,{"$f":"Invulformulier!Y38","v":0},null,{"$f":"Invulformulier!AA38","v":3}]
[{"$f":"Invulformulier!D39","v":"09:20:00"},{"$f":"Invulformulier!AD26","v":"00:00:00"},{"$f":"Invulformulier!G39","v":"PE TEAM 3"},{"$f":"Invulformulier!AL26","v":"--"},{"$f":"Invulformulier!N39","v":"PE TEAM 4"},{"$f":"Invulformulier!U39","v":3},{"$f":"Invulformulier!AU26","v":"--"},{"$f":"Invulformulier!W39","v":5},null,{"$f":"Invulformulier!Y39","v":0},null,{"$f":"Invulformulier!AA39","v":3}]
[{"$f":"Invulformulier!D40","v":"09:40:00"},{"$f":"Invulformulier!AD27","v":"00:00:00"},{"$f":"Invulformulier!G40","v":"PE TEAM 5"},{"$f":"Invulformulier!AL27","v":"--"},{"$f":"Invulformulier!N40","v":"PE TEAM 1"},{"$f":"Invulformulier!U40","v":6},{"$f":"Invulformulier!AU27","v":"--"},{"$f":"Invulformulier!W40","v":5},null,{"$f":"Invulformulier!Y40","v":3},null,{"$f":"Invulformulier!AA40","v":0}]
[{"$f":"Invulformulier!D41","v":"10:00:00"},{"$f":"Invulformulier!AD28","v":"00:00:00"},{"$f":"Invulformulier!G41","v":"PE TEAM 2"},{"$f":"Invulformulier!AL28","v":"--"},{"$f":"Invulformulier!N41","v":"PE TEAM 3"},{"$f":"Invulformulier!U41","v":0},{"$f":"Invulformulier!AU28","v":"--"},{"$f":"Invulformulier!W41","v":2},null,{"$f":"Invulformulier!Y41","v":0},null,{"$f":"Invulformulier!AA41","v":3}]
[{"$f":"Invulformulier!D42","v":"10:20:00"},{"$f":"Invulformulier!AD29","v":"00:00:00"},{"$f":"Invulformulier!G42","v":"PE TEAM 5"},{"$f":"Invulformulier!AL29","v":"--"},{"$f":"Invulformulier!N42","v":"PE TEAM 4"},{"$f":"Invulformulier!U42","v":1},{"$f":"Invulformulier!AU29","v":"--"},{"$f":"Invulformulier!W42","v":1},null,{"$f":"Invulformulier!Y42","v":1},null,{"$f":"Invulformulier!AA42","v":1}]
[{"$f":"Invulformulier!D43","v":"10:40:00"},{"$f":"Invulformulier!AD30","v":"00:00:00"},{"$f":"Invulformulier!G43","v":"PE TEAM 1"},{"$f":"Invulformulier!AL30","v":"--"},{"$f":"Invulformulier!N43","v":"PE TEAM 3"},{"$f":"Invulformulier!U43","v":2},{"$f":"Invulformulier!AU30","v":"--"},{"$f":"Invulformulier!W43","v":1},null,{"$f":"Invulformulier!Y43","v":3},null,{"$f":"Invulformulier!AA43","v":0}]
[{"$f":"Invulformulier!D44","v":"11:00:00"},{"$f":"Invulformulier!AD31","v":"00:00:00"},{"$f":"Invulformulier!G44","v":"PE TEAM 2"},{"$f":"Invulformulier!AL31","v":"--"},{"$f":"Invulformulier!N44","v":"PE TEAM 5"},{"$f":"Invulformulier!U44","v":4},{"$f":"Invulformulier!AU31","v":"--"},{"$f":"Invulformulier!W44","v":4},null,{"$f":"Invulformulier!Y44","v":1},null,{"$f":"Invulformulier!AA44","v":1}]
[{"$f":"Invulformulier!D45","v":"11:20:00"},{"$f":"Invulformulier!AD32","v":"00:00:00"},{"$f":"Invulformulier!G45","v":"PE TEAM 4"},{"$f":"Invulformulier!AL32","v":"--"},{"$f":"Invulformulier!N45","v":"PE TEAM 1"},{"$f":"Invulformulier!U45","v":5},{"$f":"Invulformulier!AU32","v":"--"},{"$f":"Invulformulier!W45","v":3},null,{"$f":"Invulformulier!Y45","v":3},null,{"$f":"Invulformulier!AA45","v":0}]
[{"$f":"Invulformulier!D46","v":"11:40:00"},{"$f":"Invulformulier!AD33","v":"00:00:00"},{"$f":"Invulformulier!G46","v":"PE TEAM 3"},{"$f":"Invulformulier!AL33","v":"--"},{"$f":"Invulformulier!N46","v":"PE TEAM 5"},{"$f":"Invulformulier!U46","v":3},{"$f":"Invulformulier!AU33","v":"--"},{"$f":"Invulformulier!W46","v":2},null,{"$f":"Invulformulier!Y46","v":3},null,{"$f":"Invulformulier!AA46","v":0}]
[{"$f":"Invulformulier!D47","v":"12:00:00"},{"$f":"Invulformulier!AD34","v":"00:00:00"},{"$f":"Invulformulier!G47","v":"PE TEAM 4"},{"$f":"Invulformulier!AL34","v":"--"},{"$f":"Invulformulier!N47","v":"PE TEAM 2"},{"$f":"Invulformulier!U47","v":0},{"$f":"Invulformulier!AU34","v":"--"},{"$f":"Invulformulier!W47","v":0},null,{"$f":"Invulformulier!Y47","v":1},null,{"$f":"Invulformulier!AA47","v":1}]
[]
[]
[{"$f":"Invulformulier!AR3","v":"Stand"},{"$f":"Invulformulier!BG5","v":"Poule E"},null,null,null,"Voor","Tegen","Punten",{"$f":"Invulformulier!BB3","v":"Gewonnen"},{"$f":"Invulformulier!BC3","v":"Gelijk"},{"$f":"Invulformulier!BD3","v":"Verloren"},{"$f":"Invulformulier!BE3","v":"Saldo"}]
[1,{"$f":"VLOOKUP(A16,Invulformulier!$BF$6:$BS$10,2,FALSE)","v":"PE TEAM 4"},null,null,null,{"$f":"VLOOKUP($A16,Invulformulier!$BF$6:$BS$10,8,FALSE)","v":11},{"$f":"VLOOKUP($A16,Invulformulier!$BF$6:$BS$10,9,FALSE)","v":7},{"$f":"VLOOKUP($A16,Invulformulier!$BF$6:$BS$10,10,FALSE)","v":8.0041099999999989},{"$f":"VLOOKUP($A16,Invulformulier!$BF$6:$BS$10,11,FALSE)","v":2},{"$f":"VLOOKUP($A16,Invulformulier!$BF$6:$BS$10,12,FALSE)","v":2},{"$f":"VLOOKUP($A16,Invulformulier!$BF$6:$BS$10,13,FALSE)","v":0},{"$f":"VLOOKUP($A16,Invulformulier!$BF$6:$BS$10,14,FALSE)","v":4}]
[2,{"$f":"VLOOKUP(A17,Invulformulier!$BF$6:$BS$10,2,FALSE)","v":"PE TEAM 3"},null,null,null,{"$f":"VLOOKUP($A17,Invulformulier!$BF$6:$BS$10,8,FALSE)","v":9},{"$f":"VLOOKUP($A17,Invulformulier!$BF$6:$BS$10,9,FALSE)","v":9},{"$f":"VLOOKUP($A17,Invulformulier!$BF$6:$BS$10,10,FALSE)","v":6.0000900000000001},{"$f":"VLOOKUP($A17,Invulformulier!$BF$6:$BS$10,11,FALSE)","v":2},{"$f":"VLOOKUP($A17,Invulformulier!$BF$6:$BS$10,12,FALSE)","v":0},{"$f":"VLOOKUP($A17,Invulformulier!$BF$6:$BS$10,13,FALSE)","v":2},{"$f":"VLOOKUP($A17,Invulformulier!$BF$6:$BS$10,14,FALSE)","v":0}]
[3,{"$f":"VLOOKUP(A18,Invulformulier!$BF$6:$BS$10,2,FALSE)","v":"PE TEAM 5"},null,null,null,{"$f":"VLOOKUP($A18,Invulformulier!$BF$6:$BS$10,8,FALSE)","v":13},{"$f":"VLOOKUP($A18,Invulformulier!$BF$6:$BS$10,9,FALSE)","v":13},{"$f":"VLOOKUP($A18,Invulformulier!$BF$6:$BS$10,10,FALSE)","v":5.0001300000000004},{"$f":"VLOOKUP($A18,Invulformulier!$BF$6:$BS$10,11,FALSE)","v":1},{"$f":"VLOOKUP($A18,Invulformulier!$BF$6:$BS$10,12,FALSE)","v":2},{"$f":"VLOOKUP($A18,Invulformulier!$BF$6:$BS$10,13,FALSE)","v":1},{"$f":"VLOOKUP($A18,Invulformulier!$BF$6:$BS$10,14,FALSE)","v":0}]
[4,{"$f":"VLOOKUP(A19,Invulformulier!$BF$6:$BS$10,2,FALSE)","v":"PE TEAM 2"},null,null,null,{"$f":"VLOOKUP($A19,Invulformulier!$BF$6:$BS$10,8,FALSE)","v":7},{"$f":"VLOOKUP($A19,Invulformulier!$BF$6:$BS$10,9,FALSE)","v":8},{"$f":"VLOOKUP($A19,Invulformulier!$BF$6:$BS$10,10,FALSE)","v":4.9990699999999997},{"$f":"VLOOKUP($A19,Invulformulier!$BF$6:$BS$10,11,FALSE)","v":1},{"$f":"VLOOKUP($A19,Invulformulier!$BF$6:$BS$10,12,FALSE)","v":2},{"$f":"VLOOKUP($A19,Invulformulier!$BF$6:$BS$10,13,FALSE)","v":1},{"$f":"VLOOKUP($A19,Invulformulier!$BF$6:$BS$10,14,FALSE)","v":-1}]
[5,{"$f":"VLOOKUP(A20,Invulformulier!$BF$6:$BS$10,2,FALSE)","v":"PE TEAM 1"},null,null,null,{"$f":"VLOOKUP($A20,Invulformulier!$BF$6:$BS$10,8,FALSE)","v":12},{"$f":"VLOOKUP($A20,Invulformulier!$BF$6:$BS$10,9,FALSE)","v":15},{"$f":"VLOOKUP($A20,Invulformulier!$BF$6:$BS$10,10,FALSE)","v":2.9971199999999998},{"$f":"VLOOKUP($A20,Invulformulier!$BF$6:$BS$10,11,FALSE)","v":1},{"$f":"VLOOKUP($A20,Invulformulier!$BF$6:$BS$10,12,FALSE)","v":0},{"$f":"VLOOKUP($A20,Invulformulier!$BF$6:$BS$10,13,FALSE)","v":3},{"$f":"VLOOKUP($A20,Invulformulier!$BF$6:$BS$10,14,FALSE)","v":-3}]

{"sheet":"FINALE","index":6,"n_rows":20,"n_cols":13,"rows_kept":20,"cut":false,"hidden":false,"merged":[[7,0,7,1],[0,0,0,11],[0,12,0,13],[1,0,1,1],[1,2,1,4],[1,5,1,7],[1,9,1,11],[2,0,2,1],[3,0,3,1],[4,0,4,1],[5,0,5,1],[6,0,6,1],[8,0,8,1],[9,0,9,1],[10,0,10,1],[11,0,11,1],[14,1,14,4],[15,1,15,4],[16,1,16,4],[17,1,17,4],[18,1,18,4],[19,1,19,4]]}
["FINALE RONDE",null,null,null,null,null,null,null,null,null,null,null,"SCORES BY:\nOnlineExcelCursus.NL"]
[{"$f":"Invulformulier!AC24","v":"Tijd"},{"$f":"Invulformulier!AD24","v":0},{"$f":"Invulformulier!AF24","v":"VELD 4"},null,null,{"$f":"Invulformulier!AT24","v":"Uitslag"},{"$f":"Invulformulier!AU24","v":0},{"$f":"Invulformulier!AV24","v":0},null,{"$f":"Invulformulier!AX24","v":"Punten"},{"$f":"Invulformulier!AY24","v":0},{"$f":"Invulformulier!AZ24","v":0}]
[{"$f":"Invulformulier!AC25","v":"09:00:00"},{"$f":"Invulformulier!AD25","v":"00:00:00"},{"$f":"Invulformulier!AF38","v":"PA TEAM 4"},{"$f":"Invulformulier!AL25","v":"--"},{"$f":"Invulformulier!AM38","v":"PB TEAM 2"},{"$f":"Invulformulier!AT38","v":2},{"$f":"Invulformulier!AU25","v":"--"},{"$f":"Invulformulier!AV38","v":5},null,{"$f":"Invulformulier!AX38","v":0},null,{"$f":"Invulformulier!AZ38","v":3}]
[{"$f":"Invulformulier!AC26","v":"09:20:00"},{"$f":"Invulformulier!AD26","v":"00:00:00"},{"$f":"Invulformulier!AF39","v":"PC TEAM 5"},{"$f":"Invulformulier!AL26","v":"--"},{"$f":"Invulformulier!AM39","v":"PD TEAM 3"},{"$f":"Invulformulier!AT39","v":3},{"$f":"Invulformulier!AU26","v":"--"},{"$f":"Invulformulier!AV39","v":2},null,{"$f":"Invulformulier!AX39","v":3},null,{"$f":"Invulformulier!AZ39","v":0}]
[{"$f":"Invulformulier!AC27","v":"09:40:00"},{"$f":"Invulformulier!AD27","v":"00:00:00"},{"$f":"Invulformulier!AF40","v":"PE TEAM 4"},{"$f":"Invulformulier!AL27","v":"--"},{"$f":"Invulformulier!AM40","v":"PA TEAM 4"},{"$f":"Invulformulier!AT40","v":0},{"$f":"Invulformulier!AU27","v":"--"},{"$f":"Invulformulier!AV40","v":0},null,{"$f":"Invulformulier!AX40","v":1},null,{"$f":"Invulformulier!AZ40","v":1}]
[{"$f":"Invulformulier!AC28","v":"10:00:00"},{"$f":"Invulformulier!AD28","v":"00:00:00"},{"$f":"Invulformulier!AF41","v":"PB TEAM 2"},{"$f":"Invulformulier!AL28","v":"--"},{"$f":"Invulformulier!AM41","v":"PC TEAM 5"},{"$f":"Invulformulier!AT41","v":1},{"$f":"Invulformulier!AU28","v":"--"},{"$f":"Invulformulier!AV41","v":2},null,{"$f":"Invulformulier!AX41","v":0},null,{"$f":"Invulformulier!AZ41","v":3}]
[{"$f":"Invulformulier!AC29","v":"10:20:00"},{"$f":"Invulformulier!AD29","v":"00:00:00"},{"$f":"Invulformulier!AF42","v":"PE TEAM 4"},{"$f":"Invulformulier!AL29","v":"--"},{"$f":"Invulformulier!AM42","v":"PD TEAM 3"},{"$f":"Invulformulier!AT42","v":4},{"$f":"Invulformulier!AU29","v":"--"},{"$f":"Invulformulier!AV42","v":0},null,{"$f":"Invulformulier!AX42","v":3},null,{"$f":"Invulformulier!AZ42","v":0}]
[{"$f":"Invulformulier!AC30","v":"10:40:00"},{"$f":"Invulformulier!AD30","v":"00:00:00"},{"$f":"Invulformulier!AF43","v":"PA TEAM 4"},{"$f":"Invulformulier!AL30","v":"--"},{"$f":"Invulformulier!AM43","v":"PC TEAM 5"},{"$f":"Invulformulier!AT43","v":3},{"$f":"Invulformulier!AU30","v":"--"},{"$f":"Invulformulier!AV43","v":5},null,{"$f":"Invulformulier!AX43","v":0},null,{"$f":"Invulformulier!AZ43","v":3}]
[{"$f":"Invulformulier!AC31","v":"11:00:00"},{"$f":"Invulformulier!AD31","v":"00:00:00"},{"$f":"Invulformulier!AF44","v":"PB TEAM 2"},{"$f":"Invulformulier!AL31","v":"--"},{"$f":"Invulformulier!AM44","v":"PE TEAM 4"},{"$f":"Invulformulier!AT44","v":6},{"$f":"Invulformulier!AU31","v":"--"},{"$f":"Invulformulier!AV44","v":5},null,{"$f":"Invulformulier!AX44","v":3},null,{"$f":"Invulformulier!AZ44","v":0}]
[{"$f":"Invulformulier!AC32","v":"11:20:00"},{"$f":"Invulformulier!AD32","v":"00:00:00"},{"$f":"Invulformulier!AF45","v":"PD TEAM 3"},{"$f":"Invulformulier!AL32","v":"--"},{"$f":"Invulformulier!AM45","v":"PA TEAM 4"},{"$f":"Invulformulier!AT45","v":0},{"$f":"Invulformulier!AU32","v":"--"},{"$f":"Invulformulier!AV45","v":3},null,{"$f":"Invulformulier!AX45","v":0},null,{"$f":"Invulformulier!AZ45","v":3}]
[{"$f":"Invulformulier!AC33","v":"11:40:00"},{"$f":"Invulformulier!AD33","v":"00:00:00"},{"$f":"Invulformulier!AF46","v":"PC TEAM 5"},{"$f":"Invulformulier!AL33","v":"--"},{"$f":"Invulformulier!AM46","v":"PE TEAM 4"},{"$f":"Invulformulier!AT46","v":0},{"$f":"Invulformulier!AU33","v":"--"},{"$f":"Invulformulier!AV46","v":2},null,{"$f":"Invulformulier!AX46","v":0},null,{"$f":"Invulformulier!AZ46","v":3}]
[{"$f":"Invulformulier!AC34","v":"12:00:00"},{"$f":"Invulformulier!AD34","v":"00:00:00"},{"$f":"Invulformulier!AF47","v":"PD TEAM 3"},{"$f":"Invulformulier!AL34","v":"--"},{"$f":"Invulformulier!AM47","v":"PB TEAM 2"},{"$f":"Invulformulier!AT47","v":1},{"$f":"Invulformulier!AU34","v":"--"},{"$f":"Invulformulier!AV47","v":1},null,{"$f":"Invulformulier!AX47","v":1},null,{"$f":"Invulformulier!AZ47","v":1}]
[]
[]
[{"$f":"Invulformulier!AR3","v":"Stand"},{"$f":"Invulformulier!BV5","v":"Finalepoule"},null,null,null,"Voor","Tegen","Punten",{"$f":"Invulformulier!BB3","v":"Gewonnen"},{"$f":"Invulformulier!BC3","v":"Gelijk"},{"$f":"Invulformulier!BD3","v":"Verloren"},{"$f":"Invulformulier!BE3","v":"Saldo"}]
[1,{"$f":"VLOOKUP(A16,Invulformulier!$BU$6:$CH$10,2,FALSE)","v":"PC TEAM 5"},null,null,null,{"$f":"VLOOKUP($A16,Invulformulier!$BU$6:$CH$10,8,FALSE)","v":10},{"$f":"VLOOKUP($A16,Invulformulier!$BU$6:$CH$10,9,FALSE)","v":8},{"$f":"VLOOKUP($A16,Invulformulier!$BU$6:$CH$10,10,FALSE)","v":9.0021000000000004},{"$f":"VLOOKUP($A16,Invulformulier!$BU$6:$CH$10,11,FALSE)","v":3},{"$f":"VLOOKUP($A16,Invulformulier!$BU$6:$CH$10,12,FALSE)","v":0},{"$f":"VLOOKUP($A16,Invulformulier!$BU$6:$CH$10,13,FALSE)","v":1},{"$f":"VLOOKUP($A16,Invulformulier!$BU$6:$CH$10,14,FALSE)","v":2}]
[2,{"$f":"VLOOKUP(A17,Invulformulier!$BU$6:$CH$10,2,FALSE)","v":"PE TEAM 4"},null,null,null,{"$f":"VLOOKUP($A17,Invulformulier!$BU$6:$CH$10,8,FALSE)","v":11},{"$f":"VLOOKUP($A17,Invulformulier!$BU$6:$CH$10,9,FALSE)","v":6},{"$f":"VLOOKUP($A17,Invulformulier!$BU$6:$CH$10,10,FALSE)","v":7.0051100000000002},{"$f":"VLOOKUP($A17,Invulformulier!$BU$6:$CH$10,11,FALSE)","v":2},{"$f":"VLOOKUP($A17,Invulformulier!$BU$6:$CH$10,12,FALSE)","v":1},{"$f":"VLOOKUP($A17,Invulformulier!$BU$6:$CH$10,13,FALSE)","v":1},{"$f":"VLOOKUP($A17,Invulformulier!$BU$6:$CH$10,14,FALSE)","v":5}]
[3,{"$f":"VLOOKUP(A18,Invulformulier!$BU$6:$CH$10,2,FALSE)","v":"PB TEAM 2"},null,null,null,{"$f":"VLOOKUP($A18,Invulformulier!$BU$6:$CH$10,8,FALSE)","v":13},{"$f":"VLOOKUP($A18,Invulformulier!$BU$6:$CH$10,9,FALSE)","v":10},{"$f":"VLOOKUP($A18,Invulformulier!$BU$6:$CH$10,10,FALSE)","v":7.0031300000000005},{"$f":"VLOOKUP($A18,Invulformulier!$BU$6:$CH$10,11,FALSE)","v":2},{"$f":"VLOOKUP($A18,Invulformulier!$BU$6:$CH$10,12,FALSE)","v":1},{"$f":"VLOOKUP($A18,Invulformulier!$BU$6:$CH$10,13,FALSE)","v":1},{"$f":"VLOOKUP($A18,Invulformulier!$BU$6:$CH$10,14,FALSE)","v":3}]
[4,{"$f":"VLOOKUP(A19,Invulformulier!$BU$6:$CH$10,2,FALSE)","v":"PA TEAM 4"},null,null,null,{"$f":"VLOOKUP($A19,Invulformulier!$BU$6:$CH$10,8,FALSE)","v":8},{"$f":"VLOOKUP($A19,Invulformulier!$BU$6:$CH$10,9,FALSE)","v":10},{"$f":"VLOOKUP($A19,Invulformulier!$BU$6:$CH$10,10,FALSE)","v":3.9980800000000003},{"$f":"VLOOKUP($A19,Invulformulier!$BU$6:$CH$10,11,FALSE)","v":1},{"$f":"VLOOKUP($A19,Invulformulier!$BU$6:$CH$10,12,FALSE)","v":1},{"$f":"VLOOKUP($A19,Invulformulier!$BU$6:$CH$10,13,FALSE)","v":2},{"$f":"VLOOKUP($A19,Invulformulier!$BU$6:$CH$10,14,FALSE)","v":-2}]
[5,{"$f":"VLOOKUP(A20,Invulformulier!$BU$6:$CH$10,2,FALSE)","v":"PD TEAM 3"},null,null,null,{"$f":"VLOOKUP($A20,Invulformulier!$BU$6:$CH$10,8,FALSE)","v":3},{"$f":"VLOOKUP($A20,Invulformulier!$BU$6:$CH$10,9,FALSE)","v":11},{"$f":"VLOOKUP($A20,Invulformulier!$BU$6:$CH$10,10,FALSE)","v":0.99202999999999986},{"$f":"VLOOKUP($A20,Invulformulier!$BU$6:$CH$10,11,FALSE)","v":0},{"$f":"VLOOKUP($A20,Invulformulier!$BU$6:$CH$10,12,FALSE)","v":1},{"$f":"VLOOKUP($A20,Invulformulier!$BU$6:$CH$10,13,FALSE)","v":3},{"$f":"VLOOKUP($A20,Invulformulier!$BU$6:$CH$10,14,FALSE)","v":-8}]

{"sheet":"Blad1","index":7,"n_rows":0,"n_cols":0,"rows_kept":0,"cut":false,"hidden":false,"merged":[]}