{"text_format":"1","workbook":"xlsx","n_sheets":12,"sheets":["Voorrondes","Finales","VGROEP-1","VGROEP-2","VGROEP-3","VGROEP-4","VGROEP-5","FGROEP-1","FGROEP-2","FGROEP-3","FGROEP-4","FGROEP-5"],"not_rendered":{"charts":0,"images":7,"macros":1,"external_links":0,"defined_names":0,"comments":0,"pivot_tables":0},"unopened":[],"bounds":{"document_bytes":16777216,"sheet_cells":100000,"rows_first":2000,"rows_last":500,"rows_between":2000,"halvings":0,"cell_chars":16384,"cell_head_chars":4096},"cells_cut":0,"cells_raw":0,"read":"whole","date_system":"1900"}

{"sheet":"Voorrondes","index":0,"n_rows":49,"n_cols":71,"rows_kept":49,"cut":false,"hidden":false,"merged":[[45,28,45,29],[36,28,36,29],[37,28,37,29],[38,28,38,29],[2,69,4,69],[2,70,4,70],[4,58,4,63],[46,28,46,29],[42,28,42,29],[43,28,43,29],[44,28,44,29],[39,28,39,29],[40,28,40,29],[41,28,41,29],[5,58,5,63],[6,58,6,63],[7,58,7,63],[8,58,8,63],[9,58,9,63],[14,38,14,43],[13,38,13,43],[12,38,12,43],[23,31,23,43],[32,28,32,29],[2,71,4,71],[45,3,45,4],[45,6,45,11],[45,13,45,18],[36,3,36,4],[36,6,36,18],[36,20,36,22],[36,24,36,26],[37,3,37,4],[37,6,37,11],[37,13,37,18],[38,3,38,4],[38,6,38,11],[38,13,38,18],[2,56,4,56],[2,42,4,42],[2,53,4,53],[2,54,4,54],[2,55,4,55],[2,28,4,28],[2,39,4,39],[2,40,4,40],[2,41,4,41],[4,44,4,49],[46,3,46,4],[46,6,46,11],[46,13,46,18],[2,57,4,57],[2,67,4,67],[2,68,4,68],[42,3,42,4],[42,6,42,11],[42,13,42,18],[43,3,43,4],[43,6,43,11],[43,13,43,18],[44,3,44,4],[44,6,44,11],[44,13,44,18],[39,3,39,4],[39,6,39,11],[39,13,39,18],[40,3,40,4],[40,6,40,11],[40,13,40,18],[41,3,41,4],[41,6,41,11],[41,13,41,18],[23,6,23,18],[23,28,23,29],[23,20,23,22],[8,44,8,49],[11,45,11,47],[9,30,9,35],[9,44,9,49],[11,49,11,51],[8,30,8,35],[21,28,21,29],[21,38,21,43],[12,28,12,29],[17,31,17,36],[17,38,17,43],[16,38,16,43],[23,49,23,51],[11,24,11,26],[15,38,15,43],[11,28,11,29],[33,3,33,4],[33,13,33,18],[32,13,32,18],[26,3,26,4],[24,3,24,4],[21,6,21,11],[25,3,25,4],[31,3,31,4],[32,3,32,4],[27,3,27,4],[28,3,28,4],[29,3,29,4],[30,3,30,4],[33,6,33,11],[32,6,32,11],[31,6,31,11],[25,6,25,11],[24,6,24,11],[27,13,27,18],[26,13,26,18],[29,6,29,11],[28,6,28,11],[27,6,27,11],[26,6,26,11],[29,13,29,18],[28,13,28,18],[25,13,25,18],[24,13,24,18],[23,3,23,4],[17,3,17,4],[16,31,16,36],[15,31,15,36],[14,31,14,36],[17,6,17,11],[16,6,16,11],[15,6,15,11],[14,6,14,11],[16,13,16,18],[14,28,14,29],[15,28,15,29],[16,28,16,29],[17,28,17,29],[29,28,29,29],[28,28,28,29],[23,24,23,26],[21,13,21,18],[20,6,20,11],[20,13,20,18],[16,3,16,4],[19,13,19,18],[18,13,18,18],[17,13,17,18],[15,13,15,18],[19,6,19,11],[18,6,18,11],[8,1,8,6],[9,1,9,6],[11,3,11,4],[11,6,11,18],[12,3,12,4],[15,3,15,4],[14,3,14,4],[13,3,13,4],[9,15,9,21],[14,13,14,18],[13,6,13,11],[12,6,12,11],[13,13,13,18],[12,13,12,18],[0,0,1,49],[5,1,5,6],[6,1,6,6],[7,1,7,6],[4,1,4,6],[2,0,4,0],[2,12,4,12],[2,11,4,11],[2,10,4,10],[2,27,4,27],[5,44,5,49],[7,44,7,49],[2,14,4,14],[2,29,4,29],[2,43,4,43],[4,15,4,21],[4,30,4,35],[6,30,6,35],[2,13,4,13],[2,25,4,25],[2,26,4,26],[6,44,6,49],[5,15,5,21],[5,30,5,35],[6,15,6,21],[13,31,13,36],[12,31,12,36],[11,20,11,22],[7,15,7,21],[7,30,7,35],[8,15,8,21],[11,31,11,43],[13,28,13,29],[21,3,21,4],[19,3,19,4],[18,3,18,4],[20,3,20,4],[24,31,24,36],[31,38,31,43],[30,38,30,43],[29,38,29,43],[28,38,28,43],[27,38,27,43],[26,38,26,43],[25,38,25,43],[24,38,24,43],[31,31,31,36],[30,31,30,36],[29,31,29,36],[28,31,28,36],[27,31,27,36],[20,31,20,36],[19,31,19,36],[18,31,18,36],[30,6,30,11],[31,13,31,18],[30,13,30,18],[33,28,33,29],[24,28,24,29],[30,28,30,29],[25,28,25,29],[23,45,23,47],[20,38,20,43],[19,38,19,43],[18,38,18,43],[33,38,33,43],[32,38,32,43],[33,31,33,36],[32,31,32,36],[26,31,26,36],[25,31,25,36],[21,31,21,36],[31,28,31,29],[26,28,26,29],[27,28,27,29],[20,28,20,29],[18,28,18,29],[19,28,19,29]]}
["Toernooi 5 poules voorronde + finale poules 'beste nrs …' - Voorrondes",null,null,null,null,null,null,null,null,null,null,null,null,null,null,null,null,null,null,null,null,null,null,null,null,null,null,null,null,null,null,null,null,null,null,null,null,null,null,null,null,null,null,null,null,null,null,null,null,null,{"$f":"COUNTA(U13:W22)","v":30},{"$f":"COUNTA(AT13:AV22)","v":30},{"$f":"COUNTA(U25:W34)","v":30},{"$f":"COUNTA(AT25:AV34)","v":30},{"$f":"COUNTA(U38:W47)","v":30}]
[]
["Stand",null,null,null,null,null,null,null,null,null,"Gewonnen","Gelijk","Verloren","Saldo","Stand",null,null,null,null,null,null,null,null,null,null,"Gewonnen","Gelijk","Verloren","Saldo","Stand",null,null,null,null,null,null,null,null,null,"Gewonnen","Gelijk","Verloren","Saldo","Stand",null,null,null,null,null,null,null,null,null,"Gewonnen","Gelijk","Verloren","Saldo","Stand",null,null,null,null,null,null,null,null,null,"Gewonnen","Gelijk","Verloren","Saldo"]
[]
[null,"Poule A",null,null,null,null,null,"V","T","P",null,null,null,null,null,"Poule B",null,null,null,null,null,null,"V","T","P",null,null,null,null,null,"Poule C",null,null,null,null,null,"V","T","P",null,null,null,null,null,"Poule D",null,null,null,null,null,"V","T","P",null,null,null,null,null,"Poule E",null,null,null,null,null,"V","T","P"]
[{"$f":"RANK(J6,$J$6:$J$10,0)","v":3},"PA TEAM 1",null,null,null,null,null,{"$f":"SUMIF($G$13:$L$22,B6,$U$13:$U$22)+SUMIF($N$13:$S$22,B6,$W$13:$W$22)","v":11},{"$f":"SUMIF($G$13:$L$22,B6,$W$13:$W$22)+SUMIF($N$13:$S$22,B6,$U$13:$U$22)","v":12},{"$f":"(K6*3)+L6+(H6*0.001)-(I6*0.001)+(H6*0.00001)","v":4.9991100000000008},{"$f":"SUMPRODUCT(($G$13:$L$22=B6)*($Y$13:$Y$22=3))+SUMPRODUCT(($N$13:$S$22=B6)*($AA$13:$AA$22=3))","v":1},{"$f":"SUMPRODUCT(($G$13:$L$22=B6)*($Y$13:$Y$22=1))+SUMPRODUCT(($N$13:$S$22=B6)*($AA$13:$AA$22=1))","v":2},{"$f":"SUMPRODUCT(($G$13:$L$22=B6)*($Y$13:$Y$22=0))+SUMPRODUCT(($N$13:$S$22=B6)*($AA$13:$AA$22=0))","v":1},{"$f":"H6-I6","v":-1},{"$f":"RANK(Y6,$Y$6:$Y$10,0)","v":3},"PB TEAM 1",null,null,null,null,null,null,{"$f":"SUMIF($AF$13:$AK$22,P6,$AT$13:$AT$22)+SUMIF($AM$13:$AR$22,P6,$AV$13:$AV$22)","v":15},{"$f":"SUMIF($AF$13:$AK$22,P6,$AV$13:$AV$22)+SUMIF($AM$13:$AR$22,P6,$AT$13:$AT$22)","v":20},{"$f":"(Z6*3)+AA6+(W6*0.001)-(X6*0.001)+(W6*0.00001)","v":5.9951499999999998},{"$f":"SUMPRODUCT(($AF$13:$AK$22=P6)*($AX$13:$AX$22=3))+SUMPRODUCT(($AM$13:$AR$22=P6)*($AZ$13:$AZ$22=3))","v":2},{"$f":"SUMPRODUCT(($AF$13:$AK$22=P6)*($AX$13:$AX$22=1))+SUMPRODUCT(($AM$13:$AR$22=P6)*($AZ$13:$AZ$22=1))","v":0},{"$f":"SUMPRODUCT(($AF$13:$AK$22=P6)*($AX$13:$AX$22=0))+SUMPRODUCT(($AM$13:$AR$22=P6)*($AZ$13:$AZ$22=0))","v":2},{"$f":"W6-X6","v":-5},{"$f":"RANK(AM6,$AM$6:$AM$10,0)","v":2},"PC TEAM 1",null,null,null,null,null,{"$f":"SUMIF($G$25:$L$34,AE6,$U$25:$U$34)+SUMIF($N$25:$S$34,AE6,$W$25:$W$34)","v":24},{"$f":"SUMIF($G$25:$L$34,AE6,$W$25:$W$34)+SUMIF($N$25:$S$34,AE6,$U$25:$U$34)","v":19},{"$f":"(AN6*3)+AO6+(AK6*0.001)-(AL6*0.001)+(AK6*0.00001)","v":6.0052399999999997},{"$f":"SUMPRODUCT(($G$25:$L$34=AE6)*($Y$25:$Y$34=3))+SUMPRODUCT(($N$25:$S$34=AE6)*($AA$25:$AA$34=3))","v":2},{"$f":"SUMPRODUCT(($G$25:$L$34=AE6)*($Y$25:$Y$34=1))+SUMPRODUCT(($N$25:$S$34=AE6)*($AA$25:$AA$34=1))","v":0},{"$f":"SUMPRODUCT(($G$25:$L$34=AE6)*($Y$25:$Y$34=0))+SUMPRODUCT(($N$25:$S$34=AE6)*($AA$25:$AA$34=0))","v":2},{"$f":"AK6-AL6","v":5},{"$f":"RANK(BA6,$BA$6:$BA$10,0)","v":4},"PD TEAM 1",null,null,null,null,null,{"$f":"SUMIF($AF$25:$AK$34,AS6,$AT$25:$AT$34)+SUMIF($AM$25:$AR$34,AS6,$AV$25:$AV$34)","v":7},{"$f":"SUMIF($AF$25:$AK$34,AS6,$AV$25:$AV$34)+SUMIF($AM$25:$AR$34,AS6,$AT$25:$AT$34)","v":10},{"$f":"(BB6*3)+BC6+(AY6*0.001)-(AZ6*0.001)+(AY6*0.00001)","v":2.9970700000000003},{"$f":"SUMPRODUCT(($AF$25:$AK$34=AS6)*($AX$25:$AX$34=3))+SUMPRODUCT(($AM$25:$AR$34=AS6)*($AZ$25:$AZ$34=3))","v":0},{"$f":"SUMPRODUCT(($AF$25:$AK$34=AS6)*($AX$25:$AX$34=1))+SUMPRODUCT(($AM$25:$AR$34=AS6)*($AZ$25:$AZ$34=1))","v":3},{"$f":"SUMPRODUCT(($AF$25:$AK$34=AS6)*($AX$25:$AX$34=0))+SUMPRODUCT(($AM$25:$AR$34=AS6)*($AZ$25:$AZ$34=0))","v":1},{"$f":"AY6-AZ6","v":-3},{"$f":"RANK(BO6,$BO$6:$BO$10,0)","v":5},"PE TEAM 1",null,null,null,null,null,{"$f":"SUMIF($G$38:$L$47,BG6,$U$38:$U$47)+SUMIF($N$38:$S$47,BG6,$W$38:$W$47)","v":12},{"$f":"SUMIF($G$38:$L$47,BG6,$W$38:$W$47)+SUMIF($N$38:$S$47,BG6,$U$38:$U$47)","v":15},{"$f":"(BP6*3)+BQ6+(BM6*0.001)-(BN6*0.001)+(BM6*0.00001)","v":2.9971199999999998},{"$f":"SUMPRODUCT(($G$38:$L$47=BG6)*($Y$38:$Y$47=3))+SUMPRODUCT(($N$38:$S$47=BG6)*($AA$38:$AA$47=3))","v":1},{"$f":"SUMPRODUCT(($G$38:$L$47=BG6)*($Y$38:$Y$47=1))+SUMPRODUCT(($N$38:$S$47=BG6)*($AA$38:$AA$47=1))","v":0},{"$f":"SUMPRODUCT(($G$38:$L$47=BG6)*($Y$38:$Y$47=0))+SUMPRODUCT(($N$38:$S$47=BG6)*($AA$38:$AA$47=0))","v":3},{"$f":"BM6-BN6","v":-3}]
[{"$f":"RANK(J7,$J$6:$J$10,0)","v":5},"PA TEAM 2",null,null,null,null,null,{"$f":"SUMIF($G$13:$L$22,B7,$U$13:$U$22)+SUMIF($N$13:$S$22,B7,$W$13:$W$22)","v":10},{"$f":"SUMIF($G$13:$L$22,B7,$W$13:$W$22)+SUMIF($N$13:$S$22,B7,$U$13:$U$22)","v":10},{"$f":"(K7*3)+L7+(H7*0.001)-(I7*0.001)+(H7*0.00001)","v":3.0001000000000002},{"$f":"SUMPRODUCT(($G$13:$L$22=B7)*($Y$13:$Y$22=3))+SUMPRODUCT(($N$13:$S$22=B7)*($AA$13:$AA$22=3))","v":1},{"$f":"SUMPRODUCT(($G$13:$L$22=B7)*($Y$13:$Y$22=1))+SUMPRODUCT(($N$13:$S$22=B7)*($AA$13:$AA$22=1))","v":0},{"$f":"SUMPRODUCT(($G$13:$L$22=B7)*($Y$13:$Y$22=0))+SUMPRODUCT(($N$13:$S$22=B7)*($AA$13:$AA$22=0))","v":3},{"$f":"H7-I7","v":0},{"$f":"RANK(Y7,$Y$6:$Y$10,0)","v":1},"PB TEAM 2",null,null,null,null,null,null,{"$f":"SUMIF($AF$13:$AK$22,P7,$AT$13:$AT$22)+SUMIF($AM$13:$AR$22,P7,$AV$13:$AV$22)","v":16},{"$f":"SUMIF($AF$13:$AK$22,P7,$AV$13:$AV$22)+SUMIF($AM$13:$AR$22,P7,$AT$13:$AT$22)","v":7},{"$f":"(Z7*3)+AA7+(W7*0.001)-(X7*0.001)+(W7*0.00001)","v":7.0091600000000005},{"$f":"SUMPRODUCT(($AF$13:$AK$22=P7)*($AX$13:$AX$22=3))+SUMPRODUCT(($AM$13:$AR$22=P7)*($AZ$13:$AZ$22=3))","v":2},{"$f":"SUMPRODUCT(($AF$13:$AK$22=P7)*($AX$13:$AX$22=1))+SUMPRODUCT(($AM$13:$AR$22=P7)*($AZ$13:$AZ$22=1))","v":1},{"$f":"SUMPRODUCT(($AF$13:$AK$22=P7)*($AX$13:$AX$22=0))+SUMPRODUCT(($AM$13:$AR$22=P7)*($AZ$13:$AZ$22=0))","v":1},{"$f":"W7-X7","v":9},{"$f":"RANK(AM7,$AM$6:$AM$10,0)","v":4},"PC TEAM 2",null,null,null,null,null,{"$f":"SUMIF($G$25:$L$34,AE7,$U$25:$U$34)+SUMIF($N$25:$S$34,AE7,$W$25:$W$34)","v":9},{"$f":"SUMIF($G$25:$L$34,AE7,$W$25:$W$34)+SUMIF($N$25:$S$34,AE7,$U$25:$U$34)","v":16},{"$f":"(AN7*3)+AO7+(AK7*0.001)-(AL7*0.001)+(AK7*0.00001)","v":5.9930900000000005},{"$f":"SUMPRODUCT(($G$25:$L$34=AE7)*($Y$25:$Y$34=3))+SUMPRODUCT(($N$25:$S$34=AE7)*($AA$25:$AA$34=3))","v":2},{"$f":"SUMPRODUCT(($G$25:$L$34=AE7)*($Y$25:$Y$34=1))+SUMPRODUCT(($N$25:$S$34=AE7)*($AA$25:$AA$34=1))","v":0},{"$f":"SUMPRODUCT(($G$25:$L$34=AE7)*($Y$25:$Y$34=0))+SUMPRODUCT(($N$25:$S$34=AE7)*($AA$25:$AA$34=0))","v":2},{"$f":"AK7-AL7","v":-7},{"$f":"RANK(BA7,$BA$6:$BA$10,0)","v":5},"PD TEAM 2",null,null,null,null,null,{"$f":"SUMIF($AF$25:$AK$34,AS7,$AT$25:$AT$34)+SUMIF($AM$25:$AR$34,AS7,$AV$25:$AV$34)","v":8},{"$f":"SUMIF($AF$25:$AK$34,AS7,$AV$25:$AV$34)+SUMIF($AM$25:$AR$34,AS7,$AT$25:$AT$34)","v":13},{"$f":"(BB7*3)+BC7+(AY7*0.001)-(AZ7*0.001)+(AY7*0.00001)","v":0.99507999999999996},{"$f":"SUMPRODUCT(($AF$25:$AK$34=AS7)*($AX$25:$AX$34=3))+SUMPRODUCT(($AM$25:$AR$34=AS7)*($AZ$25:$AZ$34=3))","v":0},{"$f":"SUMPRODUCT(($AF$25:$AK$34=AS7)*($AX$25:$AX$34=1))+SUMPRODUCT(($AM$25:$AR$34=AS7)*($AZ$25:$AZ$34=1))","v":1},{"$f":"SUMPRODUCT(($AF$25:$AK$34=AS7)*($AX$25:$AX$34=0))+SUMPRODUCT(($AM$25:$AR$34=AS7)*($AZ$25:$AZ$34=0))","v":3},{"$f":"AY7-AZ7","v":-5},{"$f":"RANK(BO7,$BO$6:$BO$10,0)","v":4},"PE TEAM 2",null,null,null,null,null,{"$f":"SUMIF($G$38:$L$47,BG7,$U$38:$U$47)+SUMIF($N$38:$S$47,BG7,$W$38:$W$47)","v":7},{"$f":"SUMIF($G$38:$L$47,BG7,$W$38:$W$47)+SUMIF($N$38:$S$47,BG7,$U$38:$U$47)","v":8},{"$f":"(BP7*3)+BQ7+(BM7*0.001)-(BN7*0.001)+(BM7*0.00001)","v":4.9990699999999997},{"$f":"SUMPRODUCT(($G$38:$L$47=BG7)*($Y$38:$Y$47=3))+SUMPRODUCT(($N$38:$S$47=BG7)*($AA$38:$AA$47=3))","v":1},{"$f":"SUMPRODUCT(($G$38:$L$47=BG7)*($Y$38:$Y$47=1))+SUMPRODUCT(($N$38:$S$47=BG7)*($AA$38:$AA$47=1))","v":2},{"$f":"SUMPRODUCT(($G$38:$L$47=BG7)*($Y$38:$Y$47=0))+SUMPRODUCT(($N$38:$S$47=BG7)*($AA$38:$AA$47=0))","v":1},{"$f":"BM7-BN7","v":-1}]
[{"$f":"RANK(J8,$J$6:$J$10,0)","v":2},"PA TEAM 3",null,null,null,null,null,{"$f":"SUMIF($G$13:$L$22,B8,$U$13:$U$22)+SUMIF($N$13:$S$22,B8,$W$13:$W$22)","v":11},{"$f":"SUMIF($G$13:$L$22,B8,$W$13:$W$22)+SUMIF($N$13:$S$22,B8,$U$13:$U$22)","v":11},7.0001100000000003,{"$f":"SUMPRODUCT(($G$13:$L$22=B8)*($Y$13:$Y$22=3))+SUMPRODUCT(($N$13:$S$22=B8)*($AA$13:$AA$22=3))","v":2},{"$f":"SUMPRODUCT(($G$13:$L$22=B8)*($Y$13:$Y$22=1))+SUMPRODUCT(($N$13:$S$22=B8)*($AA$13:$AA$22=1))","v":1},{"$f":"SUMPRODUCT(($G$13:$L$22=B8)*($Y$13:$Y$22=0))+SUMPRODUCT(($N$13:$S$22=B8)*($AA$13:$AA$22=0))","v":1},{"$f":"H8-I8","v":0},{"$f":"RANK(Y8,$Y$6:$Y$10,0)","v":4},"PB TEAM 3",null,null,null,null,null,null,{"$f":"SUMIF($AF$13:$AK$22,P8,$AT$13:$AT$22)+SUMIF($AM$13:$AR$22,P8,$AV$13:$AV$22)","v":14},{"$f":"SUMIF($AF$13:$AK$22,P8,$AV$13:$AV$22)+SUMIF($AM$13:$AR$22,P8,$AT$13:$AT$22)","v":13},5.0011400000000004,{"$f":"SUMPRODUCT(($AF$13:$AK$22=P8)*($AX$13:$AX$22=3))+SUMPRODUCT(($AM$13:$AR$22=P8)*($AZ$13:$AZ$22=3))","v":1},{"$f":"SUMPRODUCT(($AF$13:$AK$22=P8)*($AX$13:$AX$22=1))+SUMPRODUCT(($AM$13:$AR$22=P8)*($AZ$13:$AZ$22=1))","v":2},{"$f":"SUMPRODUCT(($AF$13:$AK$22=P8)*($AX$13:$AX$22=0))+SUMPRODUCT(($AM$13:$AR$22=P8)*($AZ$13:$AZ$22=0))","v":1},{"$f":"W8-X8","v":1},{"$f":"RANK(AM8,$AM$6:$AM$10,0)","v":3},"PC TEAM 3",null,null,null,null,null,{"$f":"SUMIF($G$25:$L$34,AE8,$U$25:$U$34)+SUMIF($N$25:$S$34,AE8,$W$25:$W$34)","v":17},{"$f":"SUMIF($G$25:$L$34,AE8,$W$25:$W$34)+SUMIF($N$25:$S$34,AE8,$U$25:$U$34)","v":17},6.0001699999999998,{"$f":"SUMPRODUCT(($G$25:$L$34=AE8)*($Y$25:$Y$34=3))+SUMPRODUCT(($N$25:$S$34=AE8)*($AA$25:$AA$34=3))","v":2},{"$f":"SUMPRODUCT(($G$25:$L$34=AE8)*($Y$25:$Y$34=1))+SUMPRODUCT(($N$25:$S$34=AE8)*($AA$25:$AA$34=1))","v":0},{"$f":"SUMPRODUCT(($G$25:$L$34=AE8)*($Y$25:$Y$34=0))+SUMPRODUCT(($N$25:$S$34=AE8)*($AA$25:$AA$34=0))","v":2},{"$f":"AK8-AL8","v":0},{"$f":"RANK(BA8,$BA$6:$BA$10,0)","v":1},"PD TEAM 3",null,null,null,null,null,{"$f":"SUMIF($AF$25:$AK$34,AS8,$AT$25:$AT$34)+SUMIF($AM$25:$AR$34,AS8,$AV$25:$AV$34)","v":11},{"$f":"SUMIF($AF$25:$AK$34,AS8,$AV$25:$AV$34)+SUMIF($AM$25:$AR$34,AS8,$AT$25:$AT$34)","v":6},10.005109999999998,{"$f":"SUMPRODUCT(($AF$25:$AK$34=AS8)*($AX$25:$AX$34=3))+SUMPRODUCT(($AM$25:$AR$34=AS8)*($AZ$25:$AZ$34=3))","v":3},{"$f":"SUMPRODUCT(($AF$25:$AK$34=AS8)*($AX$25:$AX$34=1))+SUMPRODUCT(($AM$25:$AR$34=AS8)*($AZ$25:$AZ$34=1))","v":1},{"$f":"SUMPRODUCT(($AF$25:$AK$34=AS8)*($AX$25:$AX$34=0))+SUMPRODUCT(($AM$25:$AR$34=AS8)*($AZ$25:$AZ$34=0))","v":0},{"$f":"AY8-AZ8","v":5},2,"PE TEAM 3",null,null,null,null,null,{"$f":"SUMIF($G$38:$L$47,BG8,$U$38:$U$47)+SUMIF($N$38:$S$47,BG8,$W$38:$W$47)","v":9},{"$f":"SUMIF($G$38:$L$47,BG8,$W$38:$W$47)+SUMIF($N$38:$S$47,BG8,$U$38:$U$47)","v":9},6.0000900000000001,{"$f":"SUMPRODUCT(($G$38:$L$47=BG8)*($Y$38:$Y$47=3))+SUMPRODUCT(($N$38:$S$47=BG8)*($AA$38:$AA$47=3))","v":2},{"$f":"SUMPRODUCT(($G$38:$L$47=BG8)*($Y$38:$Y$47=1))+SUMPRODUCT(($N$38:$S$47=BG8)*($AA$38:$AA$47=1))","v":0},{"$f":"SUMPRODUCT(($G$38:$L$47=BG8)*($Y$38:$Y$47=0))+SUMPRODUCT(($N$38:$S$47=BG8)*($AA$38:$AA$47=0))","v":2},{"$f":"BM8-BN8","v":0}]
[{"$f":"RANK(J9,$J$6:$J$10,0)","v":1},"PA TEAM 4",null,null,null,null,null,{"$f":"SUMIF($G$13:$L$22,B9,$U$13:$U$22)+SUMIF($N$13:$S$22,B9,$W$13:$W$22)","v":10},{"$f":"SUMIF($G$13:$L$22,B9,$W$13:$W$22)+SUMIF($N$13:$S$22,B9,$U$13:$U$22)","v":3},8.0070999999999994,{"$f":"SUMPRODUCT(($G$13:$L$22=B9)*($Y$13:$Y$22=3))+SUMPRODUCT(($N$13:$S$22=B9)*($AA$13:$AA$22=3))","v":2},{"$f":"SUMPRODUCT(($G$13:$L$22=B9)*($Y$13:$Y$22=1))+SUMPRODUCT(($N$13:$S$22=B9)*($AA$13:$AA$22=1))","v":2},{"$f":"SUMPRODUCT(($G$13:$L$22=B9)*($Y$13:$Y$22=0))+SUMPRODUCT(($N$13:$S$22=B9)*($AA$13:$AA$22=0))","v":0},{"$f":"H9-I9","v":7},{"$f":"RANK(Y9,$Y$6:$Y$10,0)","v":2},"PB TEAM 4",null,null,null,null,null,null,{"$f":"SUMIF($AF$13:$AK$22,P9,$AT$13:$AT$22)+SUMIF($AM$13:$AR$22,P9,$AV$13:$AV$22)","v":12},{"$f":"SUMIF($AF$13:$AK$22,P9,$AV$13:$AV$22)+SUMIF($AM$13:$AR$22,P9,$AT$13:$AT$22)","v":12},6.0001199999999999,{"$f":"SUMPRODUCT(($AF$13:$AK$22=P9)*($AX$13:$AX$22=3))+SUMPRODUCT(($AM$13:$AR$22=P9)*($AZ$13:$AZ$22=3))","v":2},{"$f":"SUMPRODUCT(($AF$13:$AK$22=P9)*($AX$13:$AX$22=1))+SUMPRODUCT(($AM$13:$AR$22=P9)*($AZ$13:$AZ$22=1))","v":0},{"$f":"SUMPRODUCT(($AF$13:$AK$22=P9)*($AX$13:$AX$22=0))+SUMPRODUCT(($AM$13:$AR$22=P9)*($AZ$13:$AZ$22=0))","v":2},{"$f":"W9-X9","v":0},{"$f":"RANK(AM9,$AM$6:$AM$10,0)","v":5},"PC TEAM 4",null,null,null,null,null,{"$f":"SUMIF($G$25:$L$34,AE9,$U$25:$U$34)+SUMIF($N$25:$S$34,AE9,$W$25:$W$34)","v":7},{"$f":"SUMIF($G$25:$L$34,AE9,$W$25:$W$34)+SUMIF($N$25:$S$34,AE9,$U$25:$U$34)","v":19},-1.193E-2,{"$f":"SUMPRODUCT(($G$25:$L$34=AE9)*($Y$25:$Y$34=3))+SUMPRODUCT(($N$25:$S$34=AE9)*($AA$25:$AA$34=3))","v":0},{"$f":"SUMPRODUCT(($G$25:$L$34=AE9)*($Y$25:$Y$34=1))+SUMPRODUCT(($N$25:$S$34=AE9)*($AA$25:$AA$34=1))","v":0},{"$f":"SUMPRODUCT(($G$25:$L$34=AE9)*($Y$25:$Y$34=0))+SUMPRODUCT(($N$25:$S$34=AE9)*($AA$25:$AA$34=0))","v":4},{"$f":"AK9-AL9","v":-12},{"$f":"RANK(BA9,$BA$6:$BA$10,0)","v":3},"PD TEAM 4",null,null,null,null,null,{"$f":"SUMIF($AF$25:$AK$34,AS9,$AT$25:$AT$34)+SUMIF($AM$25:$AR$34,AS9,$AV$25:$AV$34)","v":10},{"$f":"SUMIF($AF$25:$AK$34,AS9,$AV$25:$AV$34)+SUMIF($AM$25:$AR$34,AS9,$AT$25:$AT$34)","v":9},5.0010999999999992,{"$f":"SUMPRODUCT(($AF$25:$AK$34=AS9)*($AX$25:$AX$34=3))+SUMPRODUCT(($AM$25:$AR$34=AS9)*($AZ$25:$AZ$34=3))","v":1},{"$f":"SUMPRODUCT(($AF$25:$AK$34=AS9)*($AX$25:$AX$34=1))+SUMPRODUCT(($AM$25:$AR$34=AS9)*($AZ$25:$AZ$34=1))","v":2},{"$f":"SUMPRODUCT(($AF$25:$AK$34=AS9)*($AX$25:$AX$34=0))+SUMPRODUCT(($AM$25:$AR$34=AS9)*($AZ$25:$AZ$34=0))","v":1},{"$f":"AY9-AZ9","v":1},1,"PE TEAM 4",null,null,null,null,null,{"$f":"SUMIF($G$38:$L$47,BG9,$U$38:$U$47)+SUMIF($N$38:$S$47,BG9,$W$38:$W$47)","v":11},{"$f":"SUMIF($G$38:$L$47,BG9,$W$38:$W$47)+SUMIF($N$38:$S$47,BG9,$U$38:$U$47)","v":7},8.0041099999999989,{"$f":"SUMPRODUCT(($G$38:$L$47=BG9)*($Y$38:$Y$47=3))+SUMPRODUCT(($N$38:$S$47=BG9)*($AA$38:$AA$47=3))","v":2},{"$f":"SUMPRODUCT(($G$38:$L$47=BG9)*($Y$38:$Y$47=1))+SUMPRODUCT(($N$38:$S$47=BG9)*($AA$38:$AA$47=1))","v":2},{"$f":"SUMPRODUCT(($G$38:$L$47=BG9)*($Y$38:$Y$47=0))+SUMPRODUCT(($N$38:$S$47=BG9)*($AA$38:$AA$47=0))","v":0},{"$f":"BM9-BN9","v":4}]
[{"$f":"RANK(J10,$J$6:$J$10,0)","v":4},"PA TEAM 5",null,null,null,null,null,{"$f":"SUMIF($G$13:$L$22,B10,$U$13:$U$22)+SUMIF($N$13:$S$22,B10,$W$13:$W$22)","v":11},{"$f":"SUMIF($G$13:$L$22,B10,$W$13:$W$22)+SUMIF($N$13:$S$22,B10,$U$13:$U$22)","v":17},3.99411,{"$f":"SUMPRODUCT(($G$13:$L$22=B10)*($Y$13:$Y$22=3))+SUMPRODUCT(($N$13:$S$22=B10)*($AA$13:$AA$22=3))","v":1},{"$f":"SUMPRODUCT(($G$13:$L$22=B10)*($Y$13:$Y$22=1))+SUMPRODUCT(($N$13:$S$22=B10)*($AA$13:$AA$22=1))","v":1},{"$f":"SUMPRODUCT(($G$13:$L$22=B10)*($Y$13:$Y$22=0))+SUMPRODUCT(($N$13:$S$22=B10)*($AA$13:$AA$22=0))","v":2},{"$f":"H10-I10","v":-6},{"$f":"RANK(Y10,$Y$6:$Y$10,0)","v":5},"PB TEAM 5",null,null,null,null,null,null,{"$f":"SUMIF($AF$13:$AK$22,P10,$AT$13:$AT$22)+SUMIF($AM$13:$AR$22,P10,$AV$13:$AV$22)","v":9},{"$f":"SUMIF($AF$13:$AK$22,P10,$AV$13:$AV$22)+SUMIF($AM$13:$AR$22,P10,$AT$13:$AT$22)","v":14},3.9950900000000007,{"$f":"SUMPRODUCT(($AF$13:$AK$22=P10)*($AX$13:$AX$22=3))+SUMPRODUCT(($AM$13:$AR$22=P10)*($AZ$13:$AZ$22=3))","v":1},{"$f":"SUMPRODUCT(($AF$13:$AK$22=P10)*($AX$13:$AX$22=1))+SUMPRODUCT(($AM$13:$AR$22=P10)*($AZ$13:$AZ$22=1))","v":1},{"$f":"SUMPRODUCT(($AF$13:$AK$22=P10)*($AX$13:$AX$22=0))+SUMPRODUCT(($AM$13:$AR$22=P10)*($AZ$13:$AZ$22=0))","v":2},{"$f":"W10-X10","v":-5},{"$f":"RANK(AM10,$AM$6:$AM$10,0)","v":1},"PC TEAM 5",null,null,null,null,null,{"$f":"SUMIF($G$25:$L$34,AE10,$U$25:$U$34)+SUMIF($N$25:$S$34,AE10,$W$25:$W$34)","v":20},{"$f":"SUMIF($G$25:$L$34,AE10,$W$25:$W$34)+SUMIF($N$25:$S$34,AE10,$U$25:$U$34)","v":6},12.014199999999999,{"$f":"SUMPRODUCT(($G$25:$L$34=AE10)*($Y$25:$Y$34=3))+SUMPRODUCT(($N$25:$S$34=AE10)*($AA$25:$AA$34=3))","v":4},{"$f":"SUMPRODUCT(($G$25:$L$34=AE10)*($Y$25:$Y$34=1))+SUMPRODUCT(($N$25:$S$34=AE10)*($AA$25:$AA$34=1))","v":0},{"$f":"SUMPRODUCT(($G$25:$L$34=AE10)*($Y$25:$Y$34=0))+SUMPRODUCT(($N$25:$S$34=AE10)*($AA$25:$AA$34=0))","v":0},{"$f":"AK10-AL10","v":14},{"$f":"RANK(BA10,$BA$6:$BA$10,0)","v":2},"PD TEAM 5",null,null,null,null,null,{"$f":"SUMIF($AF$25:$AK$34,AS10,$AT$25:$AT$34)+SUMIF($AM$25:$AR$34,AS10,$AV$25:$AV$34)","v":11},{"$f":"SUMIF($AF$25:$AK$34,AS10,$AV$25:$AV$34)+SUMIF($AM$25:$AR$34,AS10,$AT$25:$AT$34)","v":9},6.0021100000000001,{"$f":"SUMPRODUCT(($AF$25:$AK$34=AS10)*($AX$25:$AX$34=3))+SUMPRODUCT(($AM$25:$AR$34=AS10)*($AZ$25:$AZ$34=3))","v":1},{"$f":"SUMPRODUCT(($AF$25:$AK$34=AS10)*($AX$25:$AX$34=1))+SUMPRODUCT(($AM$25:$AR$34=AS10)*($AZ$25:$AZ$34=1))","v":3},{"$f":"SUMPRODUCT(($AF$25:$AK$34=AS10)*($AX$25:$AX$34=0))+SUMPRODUCT(($AM$25:$AR$34=AS10)*($AZ$25:$AZ$34=0))","v":0},{"$f":"AY10-AZ10","v":2},3,"PE TEAM 5",null,null,null,null,null,{"$f":"SUMIF($G$38:$L$47,BG10,$U$38:$U$47)+SUMIF($N$38:$S$47,BG10,$W$38:$W$47)","v":13},{"$f":"SUMIF($G$38:$L$47,BG10,$W$38:$W$47)+SUMIF($N$38:$S$47,BG10,$U$38:$U$47)","v":13},5.0001300000000004,{"$f":"SUMPRODUCT(($G$38:$L$47=BG10)*($Y$38:$Y$47=3))+SUMPRODUCT(($N$38:$S$47=BG10)*($AA$38:$AA$47=3))","v":1},{"$f":"SUMPRODUCT(($G$38:$L$47=BG10)*($Y$38:$Y$47=1))+SUMPRODUCT(($N$38:$S$47=BG10)*($AA$38:$AA$47=1))","v":2},{"$f":"SUMPRODUCT(($G$38:$L$47=BG10)*($Y$38:$Y$47=0))+SUMPRODUCT(($N$38:$S$47=BG10)*($AA$38:$AA$47=0))","v":1},{"$f":"BM10-BN10","v":0}]
[]
[null,null,null,"Tijd",null,null,"VELD 1",null,null,null,null,null,null,null,null,null,null,null,null,null,"Uitslag",null,null,null,"Punten",null,null,null,"Tijd",null,null,"VELD 2",null,null,null,null,null,null,null,null,null,null,null,null,null,"Uitslag",null,null,null,"Punten"]
[null,null,null,"09:00:00",null,null,{"$f":"B6","v":"PA TEAM 1"},null,null,null,null,null,"--",{"$f":"B7","v":"PA TEAM 2"},null,null,null,null,null,null,3,"--",2,null,{"$f":"IF(U13=\"\",\"\",IF(U13>W13,3,IF(U13=W13,1,0)))","v":3},null,{"$f":"IF(W13=\"\",\"\",IF(W13>U13,3,IF(W13=U13,1,0)))","v":0},null,"09:00:00",null,null,{"$f":"P6","v":"PB TEAM 1"},null,null,null,null,null,"--",{"$f":"P7","v":"PB TEAM 2"},null,null,null,null,null,null,1,"--",8,null,{"$f":"IF(AT13=\"\",\"\",IF(AT13>AV13,3,IF(AT13=AV13,1,0)))","v":0},null,{"$f":"IF(AV13=\"\",\"\",IF(AV13>AT13,3,IF(AV13=AT13,1,0)))","v":3}]
[null,null,null,"09:20:00",null,null,{"$f":"B8","v":"PA TEAM 3"},null,null,null,null,null,"--",{"$f":"B9","v":"PA TEAM 4"},null,null,null,null,null,null,0,"--",0,null,{"$f":"IF(U14=\"\",\"\",IF(U14>W14,3,IF(U14=W14,1,0)))","v":1},null,{"$f":"IF(W14=\"\",\"\",IF(W14>U14,3,IF(W14=U14,1,0)))","v":1},null,"09:20:00",null,null,{"$f":"P8","v":"PB TEAM 3"},null,null,null,null,null,"--",{"$f":"P9","v":"PB TEAM 4"},null,null,null,null,null,null,2,"--",6,null,{"$f":"IF(AT14=\"\",\"\",IF(AT14>AV14,3,IF(AT14=AV14,1,0)))","v":0},null,{"$f":"IF(AV14=\"\",\"\",IF(AV14>AT14,3,IF(AV14=AT14,1,0)))","v":3}]
[null,null,null,"09:40:00",null,null,{"$f":"B10","v":"PA TEAM 5"},null,null,null,null,null,"--",{"$f":"B6","v":"PA TEAM 1"},null,null,null,null,null,null,5,"--",5,null,{"$f":"IF(U15=\"\",\"\",IF(U15>W15,3,IF(U15=W15,1,0)))","v":1},null,1,null,"09:40:00",null,null,{"$f":"P10","v":"PB TEAM 5"},null,null,null,null,null,"--",{"$f":"P6","v":"PB TEAM 1"},null,null,null,null,null,null,3,"--",8,null,{"$f":"IF(AT15=\"\",\"\",IF(AT15>AV15,3,IF(AT15=AV15,1,0)))","v":0},null,3]
[null,null,null,"10:00:00",null,null,{"$f":"B7","v":"PA TEAM 2"},null,null,null,null,null,"--",{"$f":"B8","v":"PA TEAM 3"},null,null,null,null,null,null,6,"--",3,null,3,null,0,null,"10:00:00",null,null,{"$f":"P7","v":"PB TEAM 2"},null,null,null,null,null,"--",{"$f":"P8","v":"PB TEAM 3"},null,null,null,null,null,null,4,"--",4,null,1,null,1]
[null,null,null,"10:20:00",null,null,{"$f":"B10","v":"PA TEAM 5"},null,null,null,null,null,"--",{"$f":"B9","v":"PA TEAM 4"},null,null,null,null,null,null,2,"--",8,null,0,null,3,null,"10:20:00",null,null,{"$f":"P10","v":"PB TEAM 5"},null,null,null,null,null,"--",{"$f":"P9","v":"PB TEAM 4"},null,null,null,null,null,null,2,"--",3,null,0,null,3]
[null,null,null,"10:40:00",null,null,{"$f":"B6","v":"PA TEAM 1"},null,null,null,null,null,"--",{"$f":"B8","v":"PA TEAM 3"},null,null,null,null,null,null,3,"--",5,null,0,null,3,null,"10:40:00",null,null,{"$f":"P6","v":"PB TEAM 1"},null,null,null,null,null,"--",{"$f":"P8","v":"PB TEAM 3"},null,null,null,null,null,null,1,"--",6,null,0,null,3]
[null,null,null,"11:00:00",null,null,{"$f":"B7","v":"PA TEAM 2"},null,null,null,null,null,"--",{"$f":"B10","v":"PA TEAM 5"},null,null,null,null,null,null,1,"--",2,null,0,null,3,null,"11:00:00",null,null,{"$f":"P7","v":"PB TEAM 2"},null,null,null,null,null,"--",{"$f":"P10","v":"PB TEAM 5"},null,null,null,null,null,null,1,"--",2,null,0,null,3]
[null,null,null,"11:20:00",null,null,{"$f":"B9","v":"PA TEAM 4"},null,null,null,null,null,"--",{"$f":"B6","v":"PA TEAM 1"},null,null,null,null,null,null,0,"--",0,null,1,null,1,null,"11:20:00",null,null,{"$f":"P9","v":"PB TEAM 4"},null,null,null,null,null,"--",{"$f":"P6","v":"PB TEAM 1"},null,null,null,null,null,null,3,"--",5,null,0,null,3]
[null,null,null,"11:40:00",null,null,{"$f":"B8","v":"PA TEAM 3"},null,null,null,null,null,"--",{"$f":"B10","v":"PA TEAM 5"},null,null,null,null,null,null,3,"--",2,null,3,null,0,null,"11:40:00",null,null,{"$f":"P8","v":"PB TEAM 3"},null,null,null,null,null,"--",{"$f":"P10","v":"PB TEAM 5"},null,null,null,null,null,null,2,"--",2,null,1,null,1]
[null,null,null,"12:00:00",null,null,{"$f":"B9","v":"PA TEAM 4"},null,null,null,null,null,"--",{"$f":"B7","v":"PA TEAM 2"},null,null,null,null,null,null,2,"--",1,null,3,null,0,null,"12:00:00",null,null,{"$f":"P9","v":"PB TEAM 4"},null,null,null,null,null,"--",{"$f":"P7","v":"PB TEAM 2"},null,null,null,null,null,null,0,"--",3,null,0,null,3]
[]
[null,null,null,"Tijd",null,null,"VELD 3",null,null,null,null,null,null,null,null,null,null,null,null,null,"Uitslag",null,null,null,"Punten",null,null,null,"Tijd",null,null,"VELD 4",null,null,null,null,null,null,null,null,null,null,null,null,null,"Uitslag",null,null,null,"Punten"]
[null,null,null,"09:00:00",null,null,{"$f":"AE6","v":"PC TEAM 1"},null,null,null,null,null,"--",{"$f":"AE7","v":"PC TEAM 2"},null,null,null,null,null,null,9,"--",2,null,{"$f":"IF(U25=\"\",\"\",IF(U25>W25,3,IF(U25=W25,1,0)))","v":3},null,{"$f":"IF(W25=\"\",\"\",IF(W25>U25,3,IF(W25=U25,1,0)))","v":0},null,"09:00:00",null,null,{"$f":"AS6","v":"PD TEAM 1"},null,null,null,null,null,"--",{"$f":"AS7","v":"PD TEAM 2"},null,null,null,null,null,null,1,"--",1,null,{"$f":"IF(AT25=\"\",\"\",IF(AT25>AV25,3,IF(AT25=AV25,1,0)))","v":1},null,{"$f":"IF(AV25=\"\",\"\",IF(AV25>AT25,3,IF(AV25=AT25,1,0)))","v":1}]
[null,null,null,"09:20:00",null,null,{"$f":"AE8","v":"PC TEAM 3"},null,null,null,null,null,"--",{"$f":"AE9","v":"PC TEAM 4"},null,null,null,null,null,null,8,"--",4,null,{"$f":"IF(U26=\"\",\"\",IF(U26>W26,3,IF(U26=W26,1,0)))","v":3},null,{"$f":"IF(W26=\"\",\"\",IF(W26>U26,3,IF(W26=U26,1,0)))","v":0},null,"09:20:00",null,null,{"$f":"AS8","v":"PD TEAM 3"},null,null,null,null,null,"--",{"$f":"AS9","v":"PD TEAM 4"},null,null,null,null,null,null,1,"--",0,null,{"$f":"IF(AT26=\"\",\"\",IF(AT26>AV26,3,IF(AT26=AV26,1,0)))","v":3},null,{"$f":"IF(AV26=\"\",\"\",IF(AV26>AT26,3,IF(AV26=AT26,1,0)))","v":0}]
[null,null,null,"09:40:00",null,null,{"$f":"AE10","v":"PC TEAM 5"},null,null,null,null,null,"--",{"$f":"AE6","v":"PC TEAM 1"},null,null,null,null,null,null,7,"--",5,null,{"$f":"IF(U27=\"\",\"\",IF(U27>W27,3,IF(U27=W27,1,0)))","v":3},null,0,null,"09:40:00",null,null,{"$f":"AS10","v":"PD TEAM 5"},null,null,null,null,null,"--",{"$f":"AS6","v":"PD TEAM 1"},null,null,null,null,null,null,1,"--",1,null,{"$f":"IF(AT27=\"\",\"\",IF(AT27>AV27,3,IF(AT27=AV27,1,0)))","v":1},null,1]
[null,null,null,"10:00:00",null,null,{"$f":"AE7","v":"PC TEAM 2"},null,null,null,null,null,"--",{"$f":"AE8","v":"PC TEAM 3"},null,null,null,null,null,null,4,"--",1,null,3,null,0,null,"10:00:00",null,null,{"$f":"AS7","v":"PD TEAM 2"},null,null,null,null,null,"--",{"$f":"AS8","v":"PD TEAM 3"},null,null,null,null,null,null,1,"--",2,null,0,null,3]
[null,null,null,"10:20:00",null,null,{"$f":"AE10","v":"PC TEAM 5"},null,null,null,null,null,"--",{"$f":"AE9","v":"PC TEAM 4"},null,null,null,null,null,null,5,"--",0,null,3,null,0,null,"10:20:00",null,null,{"$f":"AS10","v":"PD TEAM 5"},null,null,null,null,null,"--",{"$f":"AS9","v":"PD TEAM 4"},null,null,null,null,null,null,2,"--",2,null,1,null,1]
[null,null,null,"10:40:00",null,null,{"$f":"AE6","v":"PC TEAM 1"},null,null,null,null,null,"--",{"$f":"AE8","v":"PC TEAM 3"},null,null,null,null,null,null,6,"--",8,null,0,null,3,null,"10:40:00",null,null,{"$f":"AS6","v":"PD TEAM 1"},null,null,null,null,null,"--",{"$f":"AS8","v":"PD TEAM 3"},null,null,null,null,null,null,2,"--",5,null,0,null,3]
[null,null,null,"11:00:00",null,null,{"$f":"AE7","v":"PC TEAM 2"},null,null,null,null,null,"--",{"$f":"AE10","v":"PC TEAM 5"},null,null,null,null,null,null,1,"--",5,null,0,null,3,null,"11:00:00",null,null,{"$f":"AS7","v":"PD TEAM 2"},null,null,null,null,null,"--",{"$f":"AS10","v":"PD TEAM 5"},null,null,null,null,null,null,3,"--",5,null,0,null,3]
[null,null,null,"11:20:00",null,null,{"$f":"AE9","v":"PC TEAM 4"},null,null,null,null,null,"--",{"$f":"AE6","v":"PC TEAM 1"},null,null,null,null,null,null,2,"--",4,null,0,null,3,null,"11:20:00",null,null,{"$f":"AS9","v":"PD TEAM 4"},null,null,null,null,null,"--",{"$f":"AS6","v":"PD TEAM 1"},null,null,null,null,null,null,3,"--",3,null,1,null,1]
[null,null,null,"11:40:00",null,null,{"$f":"AE8","v":"PC TEAM 3"},null,null,null,null,null,"--",{"$f":"AE10","v":"PC TEAM 5"},null,null,null,null,null,null,0,"--",3,null,0,null,3,null,"11:40:00",null,null,{"$f":"AS8","v":"PD TEAM 3"},null,null,null,null,null,"--",{"$f":"AS10","v":"PD TEAM 5"},null,null,null,null,null,null,3,"--",3,null,1,null,1]
[null,null,null,"12:00:00",null,null,{"$f":"AE9","v":"PC TEAM 4"},null,null,null,null,null,"--",{"$f":"AE7","v":"PC TEAM 2"},null,null,null,null,null,null,1,"--",2,null,0,null,3,null,"12:00:00",null,null,{"$f":"AS9","v":"PD TEAM 4"},null,null,null,null,null,"--",{"$f":"AS7","v":"PD TEAM 2"},null,null,null,null,null,null,5,"--",3,null,3,null,0]
[]
[]
[null,null,null,"Tijd",null,null,"VELD 5",null,null,null,null,null,null,null,null,null,null,null,null,null,"Uitslag",null,null,null,"Punten"]
[null,null,null,"09:00:00",null,null,{"$f":"BG6","v":"PE TEAM 1"},null,null,null,null,null,"--",{"$f":"BG7","v":"PE TEAM 2"},null,null,null,null,null,null,2,"--",3,null,{"$f":"IF(U38=\"\",\"\",IF(U38>W38,3,IF(U38=W38,1,0)))","v":0},null,{"$f":"IF(W38=\"\",\"\",IF(W38>U38,3,IF(W38=U38,1,0)))","v":3}]
[null,null,null,"09:20:00",null,null,{"$f":"BG8","v":"PE TEAM 3"},null,null,null,null,null,"--",{"$f":"BG9","v":"PE TEAM 4"},null,null,null,null,null,null,3,"--",5,null,{"$f":"IF(U39=\"\",\"\",IF(U39>W39,3,IF(U39=W39,1,0)))","v":0},null,{"$f":"IF(W39=\"\",\"\",IF(W39>U39,3,IF(W39=U39,1,0)))","v":3}]
[null,null,null,"09:40:00",null,null,{"$f":"BG10","v":"PE TEAM 5"},null,null,null,null,null,"--",{"$f":"BG6","v":"PE TEAM 1"},null,null,null,null,null,null,6,"--",5,null,{"$f":"IF(U40=\"\",\"\",IF(U40>W40,3,IF(U40=W40,1,0)))","v":3},null,0]
[null,null,null,"10:00:00",null,null,{"$f":"BG7","v":"PE TEAM 2"},null,null,null,null,null,"--",{"$f":"BG8","v":"PE TEAM 3"},null,null,null,null,null,null,0,"--",2,null,0,null,3]
[null,null,null,"10:20:00",null,null,{"$f":"BG10","v":"PE TEAM 5"},null,null,null,null,null,"--",{"$f":"BG9","v":"PE TEAM 4"},null,null,null,null,null,null,1,"--",1,null,1,null,1]
[null,null,null,"10:40:00",null,null,{"$f":"BG6","v":"PE TEAM 1"},null,null,null,null,null,"--",{"$f":"BG8","v":"PE TEAM 3"},null,null,null,null,null,null,2,"--",1,null,3,null,0]
[null,null,null,"11:00:00",null,null,{"$f":"BG7","v":"PE TEAM 2"},null,null,null,null,null,"--",{"$f":"BG10","v":"PE TEAM 5"},null,null,null,null,null,null,4,"--",4,null,1,null,1]
[null,null,null,"11:20:00",null,null,{"$f":"BG9","v":"PE TEAM 4"},null,null,null,null,null,"--",{"$f":"BG6","v":"PE TEAM 1"},null,null,null,null,null,null,5,"--",3,null,3,null,0]
[null,null,null,"11:40:00",null,null,{"$f":"BG8","v":"PE TEAM 3"},null,null,null,null,null,"--",{"$f":"BG10","v":"PE TEAM 5"},null,null,null,null,null,null,3,"--",2,null,3,null,0]
[null,null,null,"12:00:00",null,null,{"$f":"BG9","v":"PE TEAM 4"},null,null,null,null,null,"--",{"$f":"BG7","v":"PE TEAM 2"},null,null,null,null,null,null,0,"--",0,null,1,null,1]
[]
[null,null,null,"(zie verder op het volgende blad)"]

{"sheet":"Finales","index":1,"n_rows":49,"n_cols":71,"rows_kept":49,"cut":false,"hidden":false,"merged":[[46,3,46,4],[46,6,46,11],[46,13,46,18],[46,28,46,29],[44,3,44,4],[44,6,44,11],[44,13,44,18],[44,28,44,29],[45,3,45,4],[45,6,45,11],[45,13,45,18],[45,28,45,29],[42,3,42,4],[42,6,42,11],[42,13,42,18],[42,28,42,29],[43,3,43,4],[43,6,43,11],[43,13,43,18],[43,28,43,29],[40,3,40,4],[40,6,40,11],[40,13,40,18],[40,28,40,29],[41,3,41,4],[41,6,41,11],[41,13,41,18],[41,28,41,29],[38,3,38,4],[38,6,38,11],[38,13,38,18],[38,28,38,29],[39,3,39,4],[39,6,39,11],[39,13,39,18],[39,28,39,29],[36,3,36,4],[36,6,36,18],[36,20,36,22],[36,24,36,26],[36,28,36,29],[37,3,37,4],[37,6,37,11],[37,13,37,18],[37,28,37,29],[33,3,33,4],[33,6,33,11],[33,13,33,18],[33,28,33,29],[33,31,33,36],[33,38,33,43],[32,3,32,4],[32,6,32,11],[32,13,32,18],[32,28,32,29],[32,31,32,36],[32,38,32,43],[31,3,31,4],[31,6,31,11],[31,13,31,18],[31,28,31,29],[31,31,31,36],[31,38,31,43],[30,3,30,4],[30,6,30,11],[30,13,30,18],[30,28,30,29],[30,31,30,36],[30,38,30,43],[29,3,29,4],[29,6,29,11],[29,13,29,18],[29,28,29,29],[29,31,29,36],[29,38,29,43],[28,3,28,4],[28,6,28,11],[28,13,28,18],[28,28,28,29],[28,31,28,36],[28,38,28,43],[27,3,27,4],[27,6,27,11],[27,13,27,18],[27,28,27,29],[27,31,27,36],[27,38,27,43],[26,3,26,4],[26,6,26,11],[26,13,26,18],[26,28,26,29],[26,31,26,36],[26,38,26,43],[25,3,25,4],[25,6,25,11],[25,13,25,18],[25,28,25,29],[25,31,25,36],[25,38,25,43],[23,45,23,47],[23,49,23,51],[24,3,24,4],[24,6,24,11],[24,13,24,18],[24,28,24,29],[24,31,24,36],[24,38,24,43],[23,3,23,4],[23,6,23,18],[23,20,23,22],[23,24,23,26],[23,28,23,29],[23,31,23,43],[21,3,21,4],[21,6,21,11],[21,13,21,18],[21,28,21,29],[21,31,21,36],[21,38,21,43],[20,3,20,4],[20,6,20,11],[20,13,20,18],[20,28,20,29],[20,31,20,36],[20,38,20,43],[19,3,19,4],[19,6,19,11],[19,13,19,18],[19,28,19,29],[19,31,19,36],[19,38,19,43],[18,3,18,4],[18,6,18,11],[18,13,18,18],[18,28,18,29],[18,31,18,36],[18,38,18,43],[17,3,17,4],[17,6,17,11],[17,13,17,18],[17,28,17,29],[17,31,17,36],[17,38,17,43],[16,3,16,4],[16,6,16,11],[16,13,16,18],[16,28,16,29],[16,31,16,36],[16,38,16,43],[15,3,15,4],[15,6,15,11],[15,13,15,18],[15,28,15,29],[15,31,15,36],[15,38,15,43],[14,3,14,4],[14,6,14,11],[14,13,14,18],[14,28,14,29],[14,31,14,36],[14,38,14,43],[13,3,13,4],[13,6,13,11],[13,13,13,18],[13,28,13,29],[13,31,13,36],[13,38,13,43],[11,31,11,43],[11,45,11,47],[11,49,11,51],[12,3,12,4],[12,6,12,11],[12,13,12,18],[12,28,12,29],[12,31,12,36],[12,38,12,43],[9,1,9,6],[9,15,9,21],[9,30,9,35],[9,44,9,49],[9,58,9,63],[11,3,11,4],[11,6,11,18],[11,20,11,22],[11,24,11,26],[11,28,11,29],[7,1,7,6],[7,15,7,21],[7,30,7,35],[7,44,7,49],[7,58,7,63],[8,1,8,6],[8,15,8,21],[8,30,8,35],[8,44,8,49],[8,58,8,63],[5,1,5,6],[5,15,5,21],[5,30,5,35],[5,44,5,49],[5,58,5,63],[6,1,6,6],[6,15,6,21],[6,30,6,35],[6,44,6,49],[6,58,6,63],[2,67,4,67],[2,68,4,68],[2,69,4,69],[2,70,4,70],[2,71,4,71],[4,1,4,6],[4,15,4,21],[4,30,4,35],[4,44,4,49],[4,58,4,63],[2,43,4,43],[2,53,4,53],[2,54,4,54],[2,55,4,55],[2,56,4,56],[2,57,4,57],[2,28,4,28],[2,29,4,29],[2,39,4,39],[2,40,4,40],[2,41,4,41],[2,42,4,42],[0,0,1,49],[2,0,4,0],[2,10,4,10],[2,11,4,11],[2,12,4,12],[2,13,4,13],[2,14,4,14],[2,25,4,25],[2,26,4,26],[2,27,4,27]]}
["Toernooi 5 poules voorronde + finale poules 'beste nrs …' - Finales",null,null,null,null,null,null,null,null,null,null,null,null,null,null,null,null,null,null,null,null,null,null,null,null,null,null,null,null,null,null,null,null,null,null,null,null,null,null,null,null,null,null,null,null,null,null,null,null,null,{"$f":"COUNTA(U13:W22)","v":10},{"$f":"COUNTA(AT13:AV22)","v":10},{"$f":"COUNTA(U25:W34)","v":10},{"$f":"COUNTA(AT25:AV34)","v":10},{"$f":"COUNTA(U38:W47)","v":10}]
[]
["Stand",null,null,null,null,null,null,null,null,null,"Gewonnen","Gelijk","Verloren","Saldo","Stand",null,null,null,null,null,null,null,null,null,null,"Gewonnen","Gelijk","Verloren","Saldo","Stand",null,null,null,null,null,null,null,null,null,"Gewonnen","Gelijk","Verloren","Saldo","Stand",null,null,null,null,null,null,null,null,null,"Gewonnen","Gelijk","Verloren","Saldo","Stand",null,null,null,null,null,null,null,null,null,"Gewonnen","Gelijk","Verloren","Saldo"]
[]
[null,"Poule A",null,null,null,null,null,"V","T","P",null,null,null,null,null,"Poule B",null,null,null,null,null,null,"V","T","P",null,null,null,null,null,"Poule C",null,null,null,null,null,"V","T","P",null,null,null,null,null,"Poule D",null,null,null,null,null,"V","T","P",null,null,null,null,null,"Poule E",null,null,null,null,null,"V","T","P"]
[{"$f":"RANK(J6,$J$6:$J$10,0)","v":1},{"$f":"VLOOKUP(1,Voorrondes!$A$6:$G$10,2,FALSE)","v":"PA TEAM 4"},null,null,null,null,null,{"$f":"SUMIF($G$13:$L$22,B6,$U$13:$U$22)+SUMIF($N$13:$S$22,B6,$W$13:$W$22)","v":0},{"$f":"SUMIF($G$13:$L$22,B6,$W$13:$W$22)+SUMIF($N$13:$S$22,B6,$U$13:$U$22)","v":0},{"$f":"(K6*3)+L6+(H6*0.001)-(I6*0.001)+(H6*0.00001)","v":0},{"$f":"SUMPRODUCT(($G$13:$L$22=B6)*($Y$13:$Y$22=3))+SUMPRODUCT(($N$13:$S$22=B6)*($AA$13:$AA$22=3))","v":0},{"$f":"SUMPRODUCT(($G$13:$L$22=B6)*($Y$13:$Y$22=1))+SUMPRODUCT(($N$13:$S$22=B6)*($AA$13:$AA$22=1))","v":0},{"$f":"SUMPRODUCT(($G$13:$L$22=B6)*($Y$13:$Y$22=0))+SUMPRODUCT(($N$13:$S$22=B6)*($AA$13:$AA$22=0))","v":0},{"$f":"H6-I6","v":0},{"$f":"RANK(Y6,$Y$6:$Y$10,0)","v":1},{"$f":"VLOOKUP(2,Voorrondes!$A$6:$G$10,2,FALSE)","v":"PA TEAM 3"},null,null,null,null,null,null,{"$f":"SUMIF($AF$13:$AK$22,P6,$AT$13:$AT$22)+SUMIF($AM$13:$AR$22,P6,$AV$13:$AV$22)","v":0},{"$f":"SUMIF($AF$13:$AK$22,P6,$AV$13:$AV$22)+SUMIF($AM$13:$AR$22,P6,$AT$13:$AT$22)","v":0},{"$f":"(Z6*3)+AA6+(W6*0.001)-(X6*0.001)+(W6*0.00001)","v":0},{"$f":"SUMPRODUCT(($AF$13:$AK$22=P6)*($AX$13:$AX$22=3))+SUMPRODUCT(($AM$13:$AR$22=P6)*($AZ$13:$AZ$22=3))","v":0},{"$f":"SUMPRODUCT(($AF$13:$AK$22=P6)*($AX$13:$AX$22=1))+SUMPRODUCT(($AM$13:$AR$22=P6)*($AZ$13:$AZ$22=1))","v":0},{"$f":"SUMPRODUCT(($AF$13:$AK$22=P6)*($AX$13:$AX$22=0))+SUMPRODUCT(($AM$13:$AR$22=P6)*($AZ$13:$AZ$22=0))","v":0},{"$f":"W6-X6","v":0},{"$f":"RANK(AM6,$AM$6:$AM$10,0)","v":1},{"$f":"VLOOKUP(3,Voorrondes!$A$6:$G$10,2,FALSE)","v":"PA TEAM 1"},null,null,null,null,null,{"$f":"SUMIF($G$25:$L$34,AE6,$U$25:$U$34)+SUMIF($N$25:$S$34,AE6,$W$25:$W$34)","v":0},{"$f":"SUMIF($G$25:$L$34,AE6,$W$25:$W$34)+SUMIF($N$25:$S$34,AE6,$U$25:$U$34)","v":0},{"$f":"(AN6*3)+AO6+(AK6*0.001)-(AL6*0.001)+(AK6*0.00001)","v":0},{"$f":"SUMPRODUCT(($G$25:$L$34=AE6)*($Y$25:$Y$34=3))+SUMPRODUCT(($N$25:$S$34=AE6)*($AA$25:$AA$34=3))","v":0},{"$f":"SUMPRODUCT(($G$25:$L$34=AE6)*($Y$25:$Y$34=1))+SUMPRODUCT(($N$25:$S$34=AE6)*($AA$25:$AA$34=1))","v":0},{"$f":"SUMPRODUCT(($G$25:$L$34=AE6)*($Y$25:$Y$34=0))+SUMPRODUCT(($N$25:$S$34=AE6)*($AA$25:$AA$34=0))","v":0},{"$f":"AK6-AL6","v":0},{"$f":"RANK(BA6,$BA$6:$BA$10,0)","v":1},{"$f":"VLOOKUP(4,Voorrondes!$A$6:$G$10,2,FALSE)","v":"PA TEAM 5"},null,null,null,null,null,{"$f":"SUMIF($AF$25:$AK$34,AS6,$AT$25:$AT$34)+SUMIF($AM$25:$AR$34,AS6,$AV$25:$AV$34)","v":0},{"$f":"SUMIF($AF$25:$AK$34,AS6,$AV$25:$AV$34)+SUMIF($AM$25:$AR$34,AS6,$AT$25:$AT$34)","v":0},{"$f":"(BB6*3)+BC6+(AY6*0.001)-(AZ6*0.001)+(AY6*0.00001)","v":0},{"$f":"SUMPRODUCT(($AF$25:$AK$34=AS6)*($AX$25:$AX$34=3))+SUMPRODUCT(($AM$25:$AR$34=AS6)*($AZ$25:$AZ$34=3))","v":0},{"$f":"SUMPRODUCT(($AF$25:$AK$34=AS6)*($AX$25:$AX$34=1))+SUMPRODUCT(($AM$25:$AR$34=AS6)*($AZ$25:$AZ$34=1))","v":0},{"$f":"SUMPRODUCT(($AF$25:$AK$34=AS6)*($AX$25:$AX$34=0))+SUMPRODUCT(($AM$25:$AR$34=AS6)*($AZ$25:$AZ$34=0))","v":0},{"$f":"AY6-AZ6","v":0},{"$f":"RANK(BO6,$BO$6:$BO$10,0)","v":1},{"$f":"VLOOKUP(5,Voorrondes!$A$6:$G$10,2,FALSE)","v":"PA TEAM 2"},null,null,null,null,null,{"$f":"SUMIF($G$38:$L$47,BG6,$U$38:$U$47)+SUMIF($N$38:$S$47,BG6,$W$38:$W$47)","v":0},{"$f":"SUMIF($G$38:$L$47,BG6,$W$38:$W$47)+SUMIF($N$38:$S$47,BG6,$U$38:$U$47)","v":0},{"$f":"(BP6*3)+BQ6+(BM6*0.001)-(BN6*0.001)+(BM6*0.00001)","v":0},{"$f":"SUMPRODUCT(($G$38:$L$47=BG6)*($Y$38:$Y$47=3))+SUMPRODUCT(($N$38:$S$47=BG6)*($AA$38:$AA$47=3))","v":0},{"$f":"SUMPRODUCT(($G$38:$L$47=BG6)*($Y$38:$Y$47=1))+SUMPRODUCT(($N$38:$S$47=BG6)*($AA$38:$AA$47=1))","v":0},{"$f":"SUMPRODUCT(($G$38:$L$47=BG6)*($Y$38:$Y$47=0))+SUMPRODUCT(($N$38:$S$47=BG6)*($AA$38:$AA$47=0))","v":0},{"$f":"BM6-BN6","v":0}]
[{"$f":"RANK(J7,$J$6:$J$10,0)","v":1},{"$f":"VLOOKUP(1,Voorrondes!$O$6:$V$10,2,FALSE)","v":"PB TEAM 2"},null,null,null,null,null,{"$f":"SUMIF($G$13:$L$22,B7,$U$13:$U$22)+SUMIF($N$13:$S$22,B7,$W$13:$W$22)","v":0},{"$f":"SUMIF($G$13:$L$22,B7,$W$13:$W$22)+SUMIF($N$13:$S$22,B7,$U$13:$U$22)","v":0},{"$f":"(K7*3)+L7+(H7*0.001)-(I7*0.001)+(H7*0.00001)","v":0},{"$f":"SUMPRODUCT(($G$13:$L$22=B7)*($Y$13:$Y$22=3))+SUMPRODUCT(($N$13:$S$22=B7)*($AA$13:$AA$22=3))","v":0},{"$f":"SUMPRODUCT(($G$13:$L$22=B7)*($Y$13:$Y$22=1))+SUMPRODUCT(($N$13:$S$22=B7)*($AA$13:$AA$22=1))","v":0},{"$f":"SUMPRODUCT(($G$13:$L$22=B7)*($Y$13:$Y$22=0))+SUMPRODUCT(($N$13:$S$22=B7)*($AA$13:$AA$22=0))","v":0},{"$f":"H7-I7","v":0},{"$f":"RANK(Y7,$Y$6:$Y$10,0)","v":1},{"$f":"VLOOKUP(2,Voorrondes!$O$6:$V$10,2,FALSE)","v":"PB TEAM 4"},null,null,null,null,null,null,{"$f":"SUMIF($AF$13:$AK$22,P7,$AT$13:$AT$22)+SUMIF($AM$13:$AR$22,P7,$AV$13:$AV$22)","v":0},{"$f":"SUMIF($AF$13:$AK$22,P7,$AV$13:$AV$22)+SUMIF($AM$13:$AR$22,P7,$AT$13:$AT$22)","v":0},{"$f":"(Z7*3)+AA7+(W7*0.001)-(X7*0.001)+(W7*0.00001)","v":0},{"$f":"SUMPRODUCT(($AF$13:$AK$22=P7)*($AX$13:$AX$22=3))+SUMPRODUCT(($AM$13:$AR$22=P7)*($AZ$13:$AZ$22=3))","v":0},{"$f":"SUMPRODUCT(($AF$13:$AK$22=P7)*($AX$13:$AX$22=1))+SUMPRODUCT(($AM$13:$AR$22=P7)*($AZ$13:$AZ$22=1))","v":0},{"$f":"SUMPRODUCT(($AF$13:$AK$22=P7)*($AX$13:$AX$22=0))+SUMPRODUCT(($AM$13:$AR$22=P7)*($AZ$13:$AZ$22=0))","v":0},{"$f":"W7-X7","v":0},{"$f":"RANK(AM7,$AM$6:$AM$10,0)","v":1},{"$f":"VLOOKUP(3,Voorrondes!$O$6:$V$10,2,FALSE)","v":"PB TEAM 1"},null,null,null,null,null,{"$f":"SUMIF($G$25:$L$34,AE7,$U$25:$U$34)+SUMIF($N$25:$S$34,AE7,$W$25:$W$34)","v":0},{"$f":"SUMIF($G$25:$L$34,AE7,$W$25:$W$34)+SUMIF($N$25:$S$34,AE7,$U$25:$U$34)","v":0},{"$f":"(AN7*3)+AO7+(AK7*0.001)-(AL7*0.001)+(AK7*0.00001)","v":0},{"$f":"SUMPRODUCT(($G$25:$L$34=AE7)*($Y$25:$Y$34=3))+SUMPRODUCT(($N$25:$S$34=AE7)*($AA$25:$AA$34=3))","v":0},{"$f":"SUMPRODUCT(($G$25:$L$34=AE7)*($Y$25:$Y$34=1))+SUMPRODUCT(($N$25:$S$34=AE7)*($AA$25:$AA$34=1))","v":0},{"$f":"SUMPRODUCT(($G$25:$L$34=AE7)*($Y$25:$Y$34=0))+SUMPRODUCT(($N$25:$S$34=AE7)*($AA$25:$AA$34=0))","v":0},{"$f":"AK7-AL7","v":0},{"$f":"RANK(BA7,$BA$6:$BA$10,0)","v":1},{"$f":"VLOOKUP(4,Voorrondes!$O$6:$V$10,2,FALSE)","v":"PB TEAM 3"},null,null,null,null,null,{"$f":"SUMIF($AF$25:$AK$34,AS7,$AT$25:$AT$34)+SUMIF($AM$25:$AR$34,AS7,$AV$25:$AV$34)","v":0},{"$f":"SUMIF($AF$25:$AK$34,AS7,$AV$25:$AV$34)+SUMIF($AM$25:$AR$34,AS7,$AT$25:$AT$34)","v":0},{"$f":"(BB7*3)+BC7+(AY7*0.001)-(AZ7*0.001)+(AY7*0.00001)","v":0},{"$f":"SUMPRODUCT(($AF$25:$AK$34=AS7)*($AX$25:$AX$34=3))+SUMPRODUCT(($AM$25:$AR$34=AS7)*($AZ$25:$AZ$34=3))","v":0},{"$f":"SUMPRODUCT(($AF$25:$AK$34=AS7)*($AX$25:$AX$34=1))+SUMPRODUCT(($AM$25:$AR$34=AS7)*($AZ$25:$AZ$34=1))","v":0},{"$f":"SUMPRODUCT(($AF$25:$AK$34=AS7)*($AX$25:$AX$34=0))+SUMPRODUCT(($AM$25:$AR$34=AS7)*($AZ$25:$AZ$34=0))","v":0},{"$f":"AY7-AZ7","v":0},{"$f":"RANK(BO7,$BO$6:$BO$10,0)","v":1},{"$f":"VLOOKUP(5,Voorrondes!$O$6:$V$10,2,FALSE)","v":"PB TEAM 5"},null,null,null,null,null,{"$f":"SUMIF($G$38:$L$47,BG7,$U$38:$U$47)+SUMIF($N$38:$S$47,BG7,$W$38:$W$47)","v":0},{"$f":"SUMIF($G$38:$L$47,BG7,$W$38:$W$47)+SUMIF($N$38:$S$47,BG7,$U$38:$U$47)","v":0},{"$f":"(BP7*3)+BQ7+(BM7*0.001)-(BN7*0.001)+(BM7*0.00001)","v":0},{"$f":"SUMPRODUCT(($G$38:$L$47=BG7)*($Y$38:$Y$47=3))+SUMPRODUCT(($N$38:$S$47=BG7)*($AA$38:$AA$47=3))","v":0},{"$f":"SUMPRODUCT(($G$38:$L$47=BG7)*($Y$38:$Y$47=1))+SUMPRODUCT(($N$38:$S$47=BG7)*($AA$38:$AA$47=1))","v":0},{"$f":"SUMPRODUCT(($G$38:$L$47=BG7)*($Y$38:$Y$47=0))+SUMPRODUCT(($N$38:$S$47=BG7)*($AA$38:$AA$47=0))","v":0},{"$f":"BM7-BN7","v":0}]
[{"$f":"RANK(J8,$J$6:$J$10,0)","v":1},{"$f":"VLOOKUP(1,Voorrondes!$AD$6:$AJ$10,2,FALSE)","v":"PC TEAM 5"},null,null,null,null,null,{"$f":"SUMIF($G$13:$L$22,B8,$U$13:$U$22)+SUMIF($N$13:$S$22,B8,$W$13:$W$22)","v":0},{"$f":"SUMIF($G$13:$L$22,B8,$W$13:$W$22)+SUMIF($N$13:$S$22,B8,$U$13:$U$22)","v":0},0,{"$f":"SUMPRODUCT(($G$13:$L$22=B8)*($Y$13:$Y$22=3))+SUMPRODUCT(($N$13:$S$22=B8)*($AA$13:$AA$22=3))","v":0},{"$f":"SUMPRODUCT(($G$13:$L$22=B8)*($Y$13:$Y$22=1))+SUMPRODUCT(($N$13:$S$22=B8)*($AA$13:$AA$22=1))","v":0},{"$f":"SUMPRODUCT(($G$13:$L$22=B8)*($Y$13:$Y$22=0))+SUMPRODUCT(($N$13:$S$22=B8)*($AA$13:$AA$22=0))","v":0},{"$f":"H8-I8","v":0},{"$f":"RANK(Y8,$Y$6:$Y$10,0)","v":1},{"$f":"VLOOKUP(2,Voorrondes!$AD$6:$AJ$10,2,FALSE)","v":"PC TEAM 1"},null,null,null,null,null,null,{"$f":"SUMIF($AF$13:$AK$22,P8,$AT$13:$AT$22)+SUMIF($AM$13:$AR$22,P8,$AV$13:$AV$22)","v":0},{"$f":"SUMIF($AF$13:$AK$22,P8,$AV$13:$AV$22)+SUMIF($AM$13:$AR$22,P8,$AT$13:$AT$22)","v":0},0,{"$f":"SUMPRODUCT(($AF$13:$AK$22=P8)*($AX$13:$AX$22=3))+SUMPRODUCT(($AM$13:$AR$22=P8)*($AZ$13:$AZ$22=3))","v":0},{"$f":"SUMPRODUCT(($AF$13:$AK$22=P8)*($AX$13:$AX$22=1))+SUMPRODUCT(($AM$13:$AR$22=P8)*($AZ$13:$AZ$22=1))","v":0},{"$f":"SUMPRODUCT(($AF$13:$AK$22=P8)*($AX$13:$AX$22=0))+SUMPRODUCT(($AM$13:$AR$22=P8)*($AZ$13:$AZ$22=0))","v":0},{"$f":"W8-X8","v":0},{"$f":"RANK(AM8,$AM$6:$AM$10,0)","v":1},{"$f":"VLOOKUP(3,Voorrondes!$AD$6:$AJ$10,2,FALSE)","v":"PC TEAM 3"},null,null,null,null,null,{"$f":"SUMIF($G$25:$L$34,AE8,$U$25:$U$34)+SUMIF($N$25:$S$34,AE8,$W$25:$W$34)","v":0},{"$f":"SUMIF($G$25:$L$34,AE8,$W$25:$W$34)+SUMIF($N$25:$S$34,AE8,$U$25:$U$34)","v":0},0,{"$f":"SUMPRODUCT(($G$25:$L$34=AE8)*($Y$25:$Y$34=3))+SUMPRODUCT(($N$25:$S$34=AE8)*($AA$25:$AA$34=3))","v":0},{"$f":"SUMPRODUCT(($G$25:$L$34=AE8)*($Y$25:$Y$34=1))+SUMPRODUCT(($N$25:$S$34=AE8)*($AA$25:$AA$34=1))","v":0},{"$f":"SUMPRODUCT(($G$25:$L$34=AE8)*($Y$25:$Y$34=0))+SUMPRODUCT(($N$25:$S$34=AE8)*($AA$25:$AA$34=0))","v":0},{"$f":"AK8-AL8","v":0},{"$f":"RANK(BA8,$BA$6:$BA$10,0)","v":1},{"$f":"VLOOKUP(4,Voorrondes!$AD$6:$AJ$10,2,FALSE)","v":"PC TEAM 2"},null,null,null,null,null,{"$f":"SUMIF($AF$25:$AK$34,AS8,$AT$25:$AT$34)+SUMIF($AM$25:$AR$34,AS8,$AV$25:$AV$34)","v":0},{"$f":"SUMIF($AF$25:$AK$34,AS8,$AV$25:$AV$34)+SUMIF($AM$25:$AR$34,AS8,$AT$25:$AT$34)","v":0},0,{"$f":"SUMPRODUCT(($AF$25:$AK$34=AS8)*($AX$25:$AX$34=3))+SUMPRODUCT(($AM$25:$AR$34=AS8)*($AZ$25:$AZ$34=3))","v":0},{"$f":"SUMPRODUCT(($AF$25:$AK$34=AS8)*($AX$25:$AX$34=1))+SUMPRODUCT(($AM$25:$AR$34=AS8)*($AZ$25:$AZ$34=1))","v":0},{"$f":"SUMPRODUCT(($AF$25:$AK$34=AS8)*($AX$25:$AX$34=0))+SUMPRODUCT(($AM$25:$AR$34=AS8)*($AZ$25:$AZ$34=0))","v":0},{"$f":"AY8-AZ8","v":0},1,{"$f":"VLOOKUP(5,Voorrondes!$AD$6:$AJ$10,2,FALSE)","v":"PC TEAM 4"},null,null,null,null,null,{"$f":"SUMIF($G$38:$L$47,BG8,$U$38:$U$47)+SUMIF($N$38:$S$47,BG8,$W$38:$W$47)","v":0},{"$f":"SUMIF($G$38:$L$47,BG8,$W$38:$W$47)+SUMIF($N$38:$S$47,BG8,$U$38:$U$47)","v":0},0,{"$f":"SUMPRODUCT(($G$38:$L$47=BG8)*($Y$38:$Y$47=3))+SUMPRODUCT(($N$38:$S$47=BG8)*($AA$38:$AA$47=3))","v":0},{"$f":"SUMPRODUCT(($G$38:$L$47=BG8)*($Y$38:$Y$47=1))+SUMPRODUCT(($N$38:$S$47=BG8)*($AA$38:$AA$47=1))","v":0},{"$f":"SUMPRODUCT(($G$38:$L$47=BG8)*($Y$38:$Y$47=0))+SUMPRODUCT(($N$38:$S$47=BG8)*($AA$38:$AA$47=0))","v":0},{"$f":"BM8-BN8","v":0}]
[{"$f":"RANK(J9,$J$6:$J$10,0)","v":1},{"$f":"VLOOKUP(1,Voorrondes!$AR$6:$AX$10,2,FALSE)","v":"PD TEAM 3"},null,null,null,null,null,{"$f":"SUMIF($G$13:$L$22,B9,$U$13:$U$22)+SUMIF($N$13:$S$22,B9,$W$13:$W$22)","v":0},{"$f":"SUMIF($G$13:$L$22,B9,$W$13:$W$22)+SUMIF($N$13:$S$22,B9,$U$13:$U$22)","v":0},0,{"$f":"SUMPRODUCT(($G$13:$L$22=B9)*($Y$13:$Y$22=3))+SUMPRODUCT(($N$13:$S$22=B9)*($AA$13:$AA$22=3))","v":0},{"$f":"SUMPRODUCT(($G$13:$L$22=B9)*($Y$13:$Y$22=1))+SUMPRODUCT(($N$13:$S$22=B9)*($AA$13:$AA$22=1))","v":0},{"$f":"SUMPRODUCT(($G$13:$L$22=B9)*($Y$13:$Y$22=0))+SUMPRODUCT(($N$13:$S$22=B9)*($AA$13:$AA$22=0))","v":0},{"$f":"H9-I9","v":0},{"$f":"RANK(Y9,$Y$6:$Y$10,0)","v":1},{"$f":"VLOOKUP(2,Voorrondes!$AR$6:$AX$10,2,FALSE)","v":"PD TEAM 5"},null,null,null,null,null,null,{"$f":"SUMIF($AF$13:$AK$22,P9,$AT$13:$AT$22)+SUMIF($AM$13:$AR$22,P9,$AV$13:$AV$22)","v":0},{"$f":"SUMIF($AF$13:$AK$22,P9,$AV$13:$AV$22)+SUMIF($AM$13:$AR$22,P9,$AT$13:$AT$22)","v":0},0,{"$f":"SUMPRODUCT(($AF$13:$AK$22=P9)*($AX$13:$AX$22=3))+SUMPRODUCT(($AM$13:$AR$22=P9)*($AZ$13:$AZ$22=3))","v":0},{"$f":"SUMPRODUCT(($AF$13:$AK$22=P9)*($AX$13:$AX$22=1))+SUMPRODUCT(($AM$13:$AR$22=P9)*($AZ$13:$AZ$22=1))","v":0},{"$f":"SUMPRODUCT(($AF$13:$AK$22=P9)*($AX$13:$AX$22=0))+SUMPRODUCT(($AM$13:$AR$22=P9)*($AZ$13:$AZ$22=0))","v":0},{"$f":"W9-X9","v":0},{"$f":"RANK(AM9,$AM$6:$AM$10,0)","v":1},{"$f":"VLOOKUP(3,Voorrondes!$AR$6:$AX$10,2,FALSE)","v":"PD TEAM 4"},null,null,null,null,null,{"$f":"SUMIF($G$25:$L$34,AE9,$U$25:$U$34)+SUMIF($N$25:$S$34,AE9,$W$25:$W$34)","v":0},{"$f":"SUMIF($G$25:$L$34,AE9,$W$25:$W$34)+SUMIF($N$25:$S$34,AE9,$U$25:$U$34)","v":0},0,{"$f":"SUMPRODUCT(($G$25:$L$34=AE9)*($Y$25:$Y$34=3))+SUMPRODUCT(($N$25:$S$34=AE9)*($AA$25:$AA$34=3))","v":0},{"$f":"SUMPRODUCT(($G$25:$L$34=AE9)*($Y$25:$Y$34=1))+SUMPRODUCT(($N$25:$S$34=AE9)*($AA$25:$AA$34=1))","v":0},{"$f":"SUMPRODUCT(($G$25:$L$34=AE9)*($Y$25:$Y$34=0))+SUMPRODUCT(($N$25:$S$34=AE9)*($AA$25:$AA$34=0))","v":0},{"$f":"AK9-AL9","v":0},{"$f":"RANK(BA9,$BA$6:$BA$10,0)","v":1},{"$f":"VLOOKUP(4,Voorrondes!$AR$6:$AX$10,2,FALSE)","v":"PD TEAM 1"},null,null,null,null,null,{"$f":"SUMIF($AF$25:$AK$34,AS9,$AT$25:$AT$34)+SUMIF($AM$25:$AR$34,AS9,$AV$25:$AV$34)","v":0},{"$f":"SUMIF($AF$25:$AK$34,AS9,$AV$25:$AV$34)+SUMIF($AM$25:$AR$34,AS9,$AT$25:$AT$34)","v":0},0,{"$f":"SUMPRODUCT(($AF$25:$AK$34=AS9)*($AX$25:$AX$34=3))+SUMPRODUCT(($AM$25:$AR$34=AS9)*($AZ$25:$AZ$34=3))","v":0},{"$f":"SUMPRODUCT(($AF$25:$AK$34=AS9)*($AX$25:$AX$34=1))+SUMPRODUCT(($AM$25:$AR$34=AS9)*($AZ$25:$AZ$34=1))","v":0},{"$f":"SUMPRODUCT(($AF$25:$AK$34=AS9)*($AX$25:$AX$34=0))+SUMPRODUCT(($AM$25:$AR$34=AS9)*($AZ$25:$AZ$34=0))","v":0},{"$f":"AY9-AZ9","v":0},1,{"$f":"VLOOKUP(5,Voorrondes!$AR$6:$AX$10,2,FALSE)","v":"PD TEAM 2"},null,null,null,null,null,{"$f":"SUMIF($G$38:$L$47,BG9,$U$38:$U$47)+SUMIF($N$38:$S$47,BG9,$W$38:$W$47)","v":0},{"$f":"SUMIF($G$38:$L$47,BG9,$W$38:$W$47)+SUMIF($N$38:$S$47,BG9,$U$38:$U$47)","v":0},0,{"$f":"SUMPRODUCT(($G$38:$L$47=BG9)*($Y$38:$Y$47=3))+SUMPRODUCT(($N$38:$S$47=BG9)*($AA$38:$AA$47=3))","v":0},{"$f":"SUMPRODUCT(($G$38:$L$47=BG9)*($Y$38:$Y$47=1))+SUMPRODUCT(($N$38:$S$47=BG9)*($AA$38:$AA$47=1))","v":0},{"$f":"SUMPRODUCT(($G$38:$L$47=BG9)*($Y$38:$Y$47=0))+SUMPRODUCT(($N$38:$S$47=BG9)*($AA$38:$AA$47=0))","v":0},{"$f":"BM9-BN9","v":0}]
[{"$f":"RANK(J10,$J$6:$J$10,0)","v":1},{"$f":"VLOOKUP(1,Voorrondes!$BF$6:$BL$10,2,FALSE)","v":"PE TEAM 4"},null,null,null,null,null,{"$f":"SUMIF($G$13:$L$22,B10,$U$13:$U$22)+SUMIF($N$13:$S$22,B10,$W$13:$W$22)","v":0},{"$f":"SUMIF($G$13:$L$22,B10,$W$13:$W$22)+SUMIF($N$13:$S$22,B10,$U$13:$U$22)","v":0},0,{"$f":"SUMPRODUCT(($G$13:$L$22=B10)*($Y$13:$Y$22=3))+SUMPRODUCT(($N$13:$S$22=B10)*($AA$13:$AA$22=3))","v":0},{"$f":"SUMPRODUCT(($G$13:$L$22=B10)*($Y$13:$Y$22=1))+SUMPRODUCT(($N$13:$S$22=B10)*($AA$13:$AA$22=1))","v":0},{"$f":"SUMPRODUCT(($G$13:$L$22=B10)*($Y$13:$Y$22=0))+SUMPRODUCT(($N$13:$S$22=B10)*($AA$13:$AA$22=0))","v":0},{"$f":"H10-I10","v":0},{"$f":"RANK(Y10,$Y$6:$Y$10,0)","v":1},{"$f":"VLOOKUP(2,Voorrondes!$BF$6:$BL$10,2,FALSE)","v":"PE TEAM 3"},null,null,null,null,null,null,{"$f":"SUMIF($AF$13:$AK$22,P10,$AT$13:$AT$22)+SUMIF($AM$13:$AR$22,P10,$AV$13:$AV$22)","v":0},{"$f":"SUMIF($AF$13:$AK$22,P10,$AV$13:$AV$22)+SUMIF($AM$13:$AR$22,P10,$AT$13:$AT$22)","v":0},0,{"$f":"SUMPRODUCT(($AF$13:$AK$22=P10)*($AX$13:$AX$22=3))+SUMPRODUCT(($AM$13:$AR$22=P10)*($AZ$13:$AZ$22=3))","v":0},{"$f":"SUMPRODUCT(($AF$13:$AK$22=P10)*($AX$13:$AX$22=1))+SUMPRODUCT(($AM$13:$AR$22=P10)*($AZ$13:$AZ$22=1))","v":0},{"$f":"SUMPRODUCT(($AF$13:$AK$22=P10)*($AX$13:$AX$22=0))+SUMPRODUCT(($AM$13:$AR$22=P10)*($AZ$13:$AZ$22=0))","v":0},{"$f":"W10-X10","v":0},{"$f":"RANK(AM10,$AM$6:$AM$10,0)","v":1},{"$f":"VLOOKUP(3,Voorrondes!$BF$6:$BL$10,2,FALSE)","v":"PE TEAM 5"},null,null,null,null,null,{"$f":"SUMIF($G$25:$L$34,AE10,$U$25:$U$34)+SUMIF($N$25:$S$34,AE10,$W$25:$W$34)","v":0},{"$f":"SUMIF($G$25:$L$34,AE10,$W$25:$W$34)+SUMIF($N$25:$S$34,AE10,$U$25:$U$34)","v":0},0,{"$f":"SUMPRODUCT(($G$25:$L$34=AE10)*($Y$25:$Y$34=3))+SUMPRODUCT(($N$25:$S$34=AE10)*($AA$25:$AA$34=3))","v":0},{"$f":"SUMPRODUCT(($G$25:$L$34=AE10)*($Y$25:$Y$34=1))+SUMPRODUCT(($N$25:$S$34=AE10)*($AA$25:$AA$34=1))","v":0},{"$f":"SUMPRODUCT(($G$25:$L$34=AE10)*($Y$25:$Y$34=0))+SUMPRODUCT(($N$25:$S$34=AE10)*($AA$25:$AA$34=0))","v":0},{"$f":"AK10-AL10","v":0},{"$f":"RANK(BA10,$BA$6:$BA$10,0)","v":1},{"$f":"VLOOKUP(4,Voorrondes!$BF$6:$BL$10,2,FALSE)","v":"PE TEAM 2"},null,null,null,null,null,{"$f":"SUMIF($AF$25:$AK$34,AS10,$AT$25:$AT$34)+SUMIF($AM$25:$AR$34,AS10,$AV$25:$AV$34)","v":0},{"$f":"SUMIF($AF$25:$AK$34,AS10,$AV$25:$AV$34)+SUMIF($AM$25:$AR$34,AS10,$AT$25:$AT$34)","v":0},0,{"$f":"SUMPRODUCT(($AF$25:$AK$34=AS10)*($AX$25:$AX$34=3))+SUMPRODUCT(($AM$25:$AR$34=AS10)*($AZ$25:$AZ$34=3))","v":0},{"$f":"SUMPRODUCT(($AF$25:$AK$34=AS10)*($AX$25:$AX$34=1))+SUMPRODUCT(($AM$25:$AR$34=AS10)*($AZ$25:$AZ$34=1))","v":0},{"$f":"SUMPRODUCT(($AF$25:$AK$34=AS10)*($AX$25:$AX$34=0))+SUMPRODUCT(($AM$25:$AR$34=AS10)*($AZ$25:$AZ$34=0))","v":0},{"$f":"AY10-AZ10","v":0},1,{"$f":"VLOOKUP(5,Voorrondes!$BF$6:$BL$10,2,FALSE)","v":"PE TEAM 1"},null,null,null,null,null,{"$f":"SUMIF($G$38:$L$47,BG10,$U$38:$U$47)+SUMIF($N$38:$S$47,BG10,$W$38:$W$47)","v":0},{"$f":"SUMIF($G$38:$L$47,BG10,$W$38:$W$47)+SUMIF($N$38:$S$47,BG10,$U$38:$U$47)","v":0},0,{"$f":"SUMPRODUCT(($G$38:$L$47=BG10)*($Y$38:$Y$47=3))+SUMPRODUCT(($N$38:$S$47=BG10)*($AA$38:$AA$47=3))","v":0},{"$f":"SUMPRODUCT(($G$38:$L$47=BG10)*($Y$38:$Y$47=1))+SUMPRODUCT(($N$38:$S$47=BG10)*($AA$38:$AA$47=1))","v":0},{"$f":"SUMPRODUCT(($G$38:$L$47=BG10)*($Y$38:$Y$47=0))+SUMPRODUCT(($N$38:$S$47=BG10)*($AA$38:$AA$47=0))","v":0},{"$f":"BM10-BN10","v":0}]
[]
[null,null,null,"Tijd",null,null,"VELD 1",null,null,null,null,null,null,null,null,null,null,null,null,null,"Uitslag",null,null,null,"Punten",null,null,null,"Tijd",null,null,"VELD 2",null,null,null,null,null,null,null,null,null,null,null,null,null,"Uitslag",null,null,null,"Punten"]
[null,null,null,"09:00:00",null,null,{"$f":"B6","v":"PA TEAM 4"},null,null,null,null,null,"--",{"$f":"B7","v":"PB TEAM 2"},null,null,null,null,null,null,null,"--",null,null,{"$f":"IF(U13=\"\",\"\",IF(U13>W13,3,IF(U13=W13,1,0)))","v":""},null,{"$f":"IF(W13=\"\",\"\",IF(W13>U13,3,IF(W13=U13,1,0)))","v":""},null,"09:00:00",null,null,{"$f":"P6","v":"PA TEAM 3"},null,null,null,null,null,"--",{"$f":"P7","v":"PB TEAM 4"},null,null,null,null,null,null,null,"--",null,null,{"$f":"IF(AT13=\"\",\"\",IF(AT13>AV13,3,IF(AT13=AV13,1,0)))","v":""},null,{"$f":"IF(AV13=\"\",\"\",IF(AV13>AT13,3,IF(AV13=AT13,1,0)))","v":""}]
[null,null,null,"09:20:00",null,null,{"$f":"B8","v":"PC TEAM 5"},null,null,null,null,null,"--",{"$f":"B9","v":"PD TEAM 3"},null,null,null,null,null,null,null,"--",null,null,{"$f":"IF(U14=\"\",\"\",IF(U14>W14,3,IF(U14=W14,1,0)))","v":""},null,{"$f":"IF(W14=\"\",\"\",IF(W14>U14,3,IF(W14=U14,1,0)))","v":""},null,"09:20:00",null,null,{"$f":"P8","v":"PC TEAM 1"},null,null,null,null,null,"--",{"$f":"P9","v":"PD TEAM 5"},null,null,null,null,null,null,null,"--",null,null,{"$f":"IF(AT14=\"\",\"\",IF(AT14>AV14,3,IF(AT14=AV14,1,0)))","v":""},null,{"$f":"IF(AV14=\"\",\"\",IF(AV14>AT14,3,IF(AV14=AT14,1,0)))","v":""}]
[null,null,null,"09:40:00",null,null,{"$f":"B10","v":"PE TEAM 4"},null,null,null,null,null,"--",{"$f":"B6","v":"PA TEAM 4"},null,null,null,null,null,null,null,"--",null,null,{"$f":"IF(U15=\"\",\"\",IF(U15>W15,3,IF(U15=W15,1,0)))","v":""},null,"",null,"09:40:00",null,null,{"$f":"P10","v":"PE TEAM 3"},null,null,null,null,null,"--",{"$f":"P6","v":"PA TEAM 3"},null,null,null,null,null,null,null,"--",null,null,{"$f":"IF(AT15=\"\",\"\",IF(AT15>AV15,3,IF(AT15=AV15,1,0)))","v":""},null,""]
[null,null,null,"10:00:00",null,null,{"$f":"B7","v":"PB TEAM 2"},null,null,null,null,null,"--",{"$f":"B8","v":"PC TEAM 5"},null,null,null,null,null,null,null,"--",null,null,"",null,"",null,"10:00:00",null,null,{"$f":"P7","v":"PB TEAM 4"},null,null,null,null,null,"--",{"$f":"P8","v":"PC TEAM 1"},null,null,null,null,null,null,null,"--",null,null,"",null,""]
[null,null,null,"10:20:00",null,null,{"$f":"B10","v":"PE TEAM 4"},null,null,null,null,null,"--",{"$f":"B9","v":"PD TEAM 3"},null,null,null,null,null,null,null,"--",null,null,"",null,"",null,"10:20:00",null,null,{"$f":"P10","v":"PE TEAM 3"},null,null,null,null,null,"--",{"$f":"P9","v":"PD TEAM 5"},null,null,null,null,null,null,null,"--",null,null,"",null,""]
[null,null,null,"10:40:00",null,null,{"$f":"B6","v":"PA TEAM 4"},null,null,null,null,null,"--",{"$f":"B8","v":"PC TEAM 5"},null,null,null,null,null,null,null,"--",null,null,"",null,"",null,"10:40:00",null,null,{"$f":"P6","v":"PA TEAM 3"},null,null,null,null,null,"--",{"$f":"P8","v":"PC TEAM 1"},null,null,null,null,null,null,null,"--",null,null,"",null,""]
[null,null,null,"11:00:00",null,null,{"$f":"B7","v":"PB TEAM 2"},null,null,null,null,null,"--",{"$f":"B10","v":"PE TEAM 4"},null,null,null,null,null,null,null,"--",null,null,"",null,"",null,"11:00:00",null,null,{"$f":"P7","v":"PB TEAM 4"},null,null,null,null,null,"--",{"$f":"P10","v":"PE TEAM 3"},null,null,null,null,null,null,null,"--",null,null,"",null,""]
[null,null,null,"11:20:00",null,null,{"$f":"B9","v":"PD TEAM 3"},null,null,null,null,null,"--",{"$f":"B6","v":"PA TEAM 4"},null,null,null,null,null,null,null,"--",null,null,"",null,"",null,"11:20:00",null,null,{"$f":"P9","v":"PD TEAM 5"},null,null,null,null,null,"--",{"$f":"P6","v":"PA TEAM 3"},null,null,null,null,null,null,null,"--",null,null,"",null,""]
[null,null,null,"11:40:00",null,null,{"$f":"B8","v":"PC TEAM 5"},null,null,null,null,null,"--",{"$f":"B10","v":"PE TEAM 4"},null,null,null,null,null,null,null,"--",null,null,"",null,"",null,"11:40:00",null,null,{"$f":"P8","v":"PC TEAM 1"},null,null,null,null,null,"--",{"$f":"P10","v":"PE TEAM 3"},null,null,null,null,null,null,null,"--",null,null,"",null,""]
[null,null,null,"12:00:00",null,null,{"$f":"B9","v":"PD TEAM 3"},null,null,null,null,null,"--",{"$f":"B7","v":"PB TEAM 2"},null,null,null,null,null,null,null,"--",null,null,"",null,"",null,"12:00:00",null,null,{"$f":"P9","v":"PD TEAM 5"},null,null,null,null,null,"--",{"$f":"P7","v":"PB TEAM 4"},null,null,null,null,null,null,null,"--",null,null,"",null,""]
[]
[null,null,null,"Tijd",null,null,"VELD 3",null,null,null,null,null,null,null,null,null,null,null,null,null,"Uitslag",null,null,null,"Punten",null,null,null,"Tijd",null,null,"VELD 4",null,null,null,null,null,null,null,null,null,null,null,null,null,"Uitslag",null,null,null,"Punten"]
[null,null,null,"09:00:00",null,null,{"$f":"AE6","v":"PA TEAM 1"},null,null,null,null,null,"--",{"$f":"AE7","v":"PB TEAM 1"},null,null,null,null,null,null,null,"--",null,null,{"$f":"IF(U25=\"\",\"\",IF(U25>W25,3,IF(U25=W25,1,0)))","v":""},null,{"$f":"IF(W25=\"\",\"\",IF(W25>U25,3,IF(W25=U25,1,0)))","v":""},null,"09:00:00",null,null,{"$f":"AS6","v":"PA TEAM 5"},null,null,null,null,null,"--",{"$f":"AS7","v":"PB TEAM 3"},null,null,null,null,null,null,null,"--",null,null,{"$f":"IF(AT25=\"\",\"\",IF(AT25>AV25,3,IF(AT25=AV25,1,0)))","v":""},null,{"$f":"IF(AV25=\"\",\"\",IF(AV25>AT25,3,IF(AV25=AT25,1,0)))","v":""}]
[null,null,null,"09:20:00",null,null,{"$f":"AE8","v":"PC TEAM 3"},null,null,null,null,null,"--",{"$f":"AE9","v":"PD TEAM 4"},null,null,null,null,null,null,null,"--",null,null,{"$f":"IF(U26=\"\",\"\",IF(U26>W26,3,IF(U26=W26,1,0)))","v":""},null,{"$f":"IF(W26=\"\",\"\",IF(W26>U26,3,IF(W26=U26,1,0)))","v":""},null,"09:20:00",null,null,{"$f":"AS8","v":"PC TEAM 2"},null,null,null,null,null,"--",{"$f":"AS9","v":"PD TEAM 1"},null,null,null,null,null,null,null,"--",null,null,{"$f":"IF(AT26=\"\",\"\",IF(AT26>AV26,3,IF(AT26=AV26,1,0)))","v":""},null,{"$f":"IF(AV26=\"\",\"\",IF(AV26>AT26,3,IF(AV26=AT26,1,0)))","v":""}]
[null,null,null,"09:40:00",null,null,{"$f":"AE10","v":"PE TEAM 5"},null,null,null,null,null,"--",{"$f":"AE6","v":"PA TEAM 1"},null,null,null,null,null,null,null,"--",null,null,{"$f":"IF(U27=\"\",\"\",IF(U27>W27,3,IF(U27=W27,1,0)))","v":""},null,"",null,"09:40:00",null,null,{"$f":"AS10","v":"PE TEAM 2"},null,null,null,null,null,"--",{"$f":"AS6","v":"PA TEAM 5"},null,null,null,null,null,null,null,"--",null,null,{"$f":"IF(AT27=\"\",\"\",IF(AT27>AV27,3,IF(AT27=AV27,1,0)))","v":""},null,""]
[null,null,null,"10:00:00",null,null,{"$f":"AE7","v":"PB TEAM 1"},null,null,null,null,null,"--",{"$f":"AE8","v":"PC TEAM 3"},null,null,null,null,null,null,null,"--",null,null,"",null,"",null,"10:00:00",null,null,{"$f":"AS7","v":"PB TEAM 3"},null,null,null,null,null,"--",{"$f":"AS8","v":"PC TEAM 2"},null,null,null,null,null,null,null,"--",null,null,"",null,""]
[null,null,null,"10:20:00",null,null,{"$f":"AE10","v":"PE TEAM 5"},null,null,null,null,null,"--",{"$f":"AE9","v":"PD TEAM 4"},null,null,null,null,null,null,null,"--",null,null,"",null,"",null,"10:20:00",null,null,{"$f":"AS10","v":"PE TEAM 2"},null,null,null,null,null,"--",{"$f":"AS9","v":"PD TEAM 1"},null,null,null,null,null,null,null,"--",null,null,"",null,""]
[null,null,null,"10:40:00",null,null,{"$f":"AE6","v":"PA TEAM 1"},null,null,null,null,null,"--",{"$f":"AE8","v":"PC TEAM 3"},null,null,null,null,null,null,null,"--",null,null,"",null,"",null,"10:40:00",null,null,{"$f":"AS6","v":"PA TEAM 5"},null,null,null,null,null,"--",{"$f":"AS8","v":"PC TEAM 2"},null,null,null,null,null,null,null,"--",null,null,"",null,""]
[null,null,null,"11:00:00",null,null,{"$f":"AE7","v":"PB TEAM 1"},null,null,null,null,null,"--",{"$f":"AE10","v":"PE TEAM 5"},null,null,null,null,null,null,null,"--",null,null,"",null,"",null,"11:00:00",null,null,{"$f":"AS7","v":"PB TEAM 3"},null,null,null,null,null,"--",{"$f":"AS10","v":"PE TEAM 2"},null,null,null,null,null,null,null,"--",null,null,"",null,""]
[null,null,null,"11:20:00",null,null,{"$f":"AE9","v":"PD TEAM 4"},null,null,null,null,null,"--",{"$f":"AE6","v":"PA TEAM 1"},null,null,null,null,null,null,null,"--",null,null,"",null,"",null,"11:20:00",null,null,{"$f":"AS9","v":"PD TEAM 1"},null,null,null,null,null,"--",{"$f":"AS6","v":"PA TEAM 5"},null,null,null,null,null,null,null,"--",null,null,"",null,""]
[null,null,null,"11:40:00",null,null,{"$f":"AE8","v":"PC TEAM 3"},null,null,null,null,null,"--",{"$f":"AE10","v":"PE TEAM 5"},null,null,null,null,null,null,null,"--",null,null,"",null,"",null,"11:40:00",null,null,{"$f":"AS8","v":"PC TEAM 2"},null,null,null,null,null,"--",{"$f":"AS10","v":"PE TEAM 2"},null,null,null,null,null,null,null,"--",null,null,"",null,""]
[null,null,null,"12:00:00",null,null,{"$f":"AE9","v":"PD TEAM 4"},null,null,null,null,null,"--",{"$f":"AE7","v":"PB TEAM 1"},null,null,null,null,null,null,null,"--",null,null,"",null,"",null,"12:00:00",null,null,{"$f":"AS9","v":"PD TEAM 1"},null,null,null,null,null,"--",{"$f":"AS7","v":"PB TEAM 3"},null,null,null,null,null,null,null,"--",null,null,"",null,""]
[]
[]
[null,null,null,"Tijd",null,null,"VELD 5",null,null,null,null,null,null,null,null,null,null,null,null,null,"Uitslag",null,null,null,"Punten",null,null,null,"Tijd"]
[null,null,null,"09:00:00",null,null,{"$f":"BG6","v":"PA TEAM 2"},null,null,null,null,null,"--",{"$f":"BG7","v":"PB TEAM 5"},null,null,null,null,null,null,null,"--",null,null,{"$f":"IF(U38=\"\",\"\",IF(U38>W38,3,IF(U38=W38,1,0)))","v":""},null,{"$f":"IF(W38=\"\",\"\",IF(W38>U38,3,IF(W38=U38,1,0)))","v":""},null,"09:00:00"]
[null,null,null,"09:20:00",null,null,{"$f":"BG8","v":"PC TEAM 4"},null,null,null,null,null,"--",{"$f":"BG9","v":"PD TEAM 2"},null,null,null,null,null,null,null,"--",null,null,{"$f":"IF(U39=\"\",\"\",IF(U39>W39,3,IF(U39=W39,1,0)))","v":""},null,{"$f":"IF(W39=\"\",\"\",IF(W39>U39,3,IF(W39=U39,1,0)))","v":""},null,"09:20:00"]
[null,null,null,"09:40:00",null,null,{"$f":"BG10","v":"PE TEAM 1"},null,null,null,null,null,"--",{"$f":"BG6","v":"PA TEAM 2"},null,null,null,null,null,null,null,"--",null,null,{"$f":"IF(U40=\"\",\"\",IF(U40>W40,3,IF(U40=W40,1,0)))","v":""},null,"",null,"09:40:00"]
[null,null,null,"10:00:00",null,null,{"$f":"BG7","v":"PB TEAM 5"},null,null,null,null,null,"--",{"$f":"BG8","v":"PC TEAM 4"},null,null,null,null,null,null,null,"--",null,null,"",null,"",null,"10:00:00"]
[null,null,null,"10:20:00",null,null,{"$f":"BG10","v":"PE TEAM 1"},null,null,null,null,null,"--",{"$f":"BG9","v":"PD TEAM 2"},null,null,null,null,null,null,null,"--",null,null,"",null,"",null,"10:20:00"]
[null,null,null,"10:40:00",null,null,{"$f":"BG6","v":"PA TEAM 2"},null,null,null,null,null,"--",{"$f":"BG8","v":"PC TEAM 4"},null,null,null,null,null,null,null,"--",null,null,"",null,"",null,"10:40:00"]
[null,null,null,"11:00:00",null,null,{"$f":"BG7","v":"PB TEAM 5"},null,null,null,null,null,"--",{"$f":"BG10","v":"PE TEAM 1"},null,null,null,null,null,null,null,"--",null,null,"",null,"",null,"11:00:00"]
[null,null,null,"11:20:00",null,null,{"$f":"BG9","v":"PD TEAM 2"},null,null,null,null,null,"--",{"$f":"BG6","v":"PA TEAM 2"},null,null,null,null,null,null,null,"--",null,null,"",null,"",null,"11:20:00"]
[null,null,null,"11:40:00",null,null,{"$f":"BG8","v":"PC TEAM 4"},null,null,null,null,null,"--",{"$f":"BG10","v":"PE TEAM 1"},null,null,null,null,null,null,null,"--",null,null,"",null,"",null,"11:40:00"]
[null,null,null,"12:00:00",null,null,{"$f":"BG9","v":"PD TEAM 2"},null,null,null,null,null,"--",{"$f":"BG7","v":"PB TEAM 5"},null,null,null,null,null,null,null,"--",null,null,"",null,"",null,"12:00:00"]
[]
[null,null,null,"(zie verder op het volgende blad)"]

{"sheet":"VGROEP-1","index":2,"n_rows":20,"n_cols":13,"rows_kept":20,"cut":false,"hidden":false,"merged":[[19,14,19,19],[15,14,15,19],[16,14,16,19],[17,14,17,19],[18,14,18,19],[19,1,19,4],[6,0,6,1],[11,0,11,1],[8,0,8,1],[9,0,9,1],[10,0,10,1],[0,12,0,13],[0,0,0,11],[16,1,16,4],[17,1,17,4],[18,1,18,4],[1,0,1,1],[1,2,1,4],[1,5,1,7],[4,0,4,1],[5,0,5,1],[7,0,7,1],[1,9,1,11],[14,1,14,4],[15,1,15,4],[2,0,2,1],[3,0,3,1]]}
["Groep 1\nVoorronde",null,null,null,null,null,null,null,null,null,null,null,"SCORES BY:\nOnlineExcelCursus.NL"]
[{"$f":"Voorrondes!D12","v":"Tijd"},{"$f":"Voorrondes!E12","v":0},{"$f":"Voorrondes!G12","v":"VELD 1"},null,null,{"$f":"Voorrondes!U12","v":"Uitslag"},null,null,null,{"$f":"Voorrondes!Y12","v":"Punten"}]
[{"$f":"Voorrondes!D13","v":"09:00:00"},{"$f":"Voorrondes!E13","v":"00:00:00"},{"$f":"Voorrondes!G13","v":"PA TEAM 1"},{"$f":"Voorrondes!M13","v":"--"},{"$f":"Voorrondes!N13","v":"PA TEAM 2"},{"$f":"Voorrondes!U13","v":3},{"$f":"Voorrondes!V13","v":"--"},{"$f":"Voorrondes!W13","v":2},null,{"$f":"Voorrondes!Y13","v":3},null,{"$f":"Voorrondes!AA13","v":0}]
[{"$f":"Voorrondes!D14","v":"09:20:00"},{"$f":"Voorrondes!E14","v":"00:00:00"},{"$f":"Voorrondes!G14","v":"PA TEAM 3"},{"$f":"Voorrondes!M14","v":"--"},{"$f":"Voorrondes!N14","v":"PA TEAM 4"},{"$f":"Voorrondes!U14","v":0},{"$f":"Voorrondes!V14","v":"--"},{"$f":"Voorrondes!W14","v":0},null,{"$f":"Voorrondes!Y14","v":1},null,{"$f":"Voorrondes!AA14","v":1}]
[{"$f":"Voorrondes!D15","v":"09:40:00"},{"$f":"Voorrondes!E15","v":"00:00:00"},{"$f":"Voorrondes!G15","v":"PA TEAM 5"},{"$f":"Voorrondes!M15","v":"--"},{"$f":"Voorrondes!N15","v":"PA TEAM 1"},{"$f":"Voorrondes!U15","v":5},{"$f":"Voorrondes!V15","v":"--"},{"$f":"Voorrondes!W15","v":5},null,{"$f":"Voorrondes!Y15","v":1},null,{"$f":"Voorrondes!AA15","v":1}]
[{"$f":"Voorrondes!D16","v":"10:00:00"},{"$f":"Voorrondes!E16","v":"00:00:00"},{"$f":"Voorrondes!G16","v":"PA TEAM 2"},{"$f":"Voorrondes!M16","v":"--"},{"$f":"Voorrondes!N16","v":"PA TEAM 3"},{"$f":"Voorrondes!U16","v":6},{"$f":"Voorrondes!V16","v":"--"},{"$f":"Voorrondes!W16","v":3},null,{"$f":"Voorrondes!Y16","v":3},null,{"$f":"Voorrondes!AA16","v":0}]
[{"$f":"Voorrondes!D17","v":"10:20:00"},{"$f":"Voorrondes!E17","v":"00:00:00"},{"$f":"Voorrondes!G17","v":"PA TEAM 5"},{"$f":"Voorrondes!M17","v":"--"},{"$f":"Voorrondes!N17","v":"PA TEAM 4"},{"$f":"Voorrondes!U17","v":2},{"$f":"Voorrondes!V17","v":"--"},{"$f":"Voorrondes!W17","v":8},null,{"$f":"Voorrondes!Y17","v":0},null,{"$f":"Voorrondes!AA17","v":3}]
[{"$f":"Voorrondes!D18","v":"10:40:00"},{"$f":"Voorrondes!E18","v":"00:00:00"},{"$f":"Voorrondes!G18","v":"PA TEAM 1"},{"$f":"Voorrondes!M18","v":"--"},{"$f":"Voorrondes!N18","v":"PA TEAM 3"},{"$f":"Voorrondes!U18","v":3},{"$f":"Voorrondes!V18","v":"--"},{"$f":"Voorrondes!W18","v":5},null,{"$f":"Voorrondes!Y18","v":0},null,{"$f":"Voorrondes!AA18","v":3}]
[{"$f":"Voorrondes!D19","v":"11:00:00"},{"$f":"Voorrondes!E19","v":"00:00:00"},{"$f":"Voorrondes!G19","v":"PA TEAM 2"},{"$f":"Voorrondes!M19","v":"--"},{"$f":"Voorrondes!N19","v":"PA TEAM 5"},{"$f":"Voorrondes!U19","v":1},{"$f":"Voorrondes!V19","v":"--"},{"$f":"Voorrondes!W19","v":2},null,{"$f":"Voorrondes!Y19","v":0},null,{"$f":"Voorrondes!AA19","v":3}]
[{"$f":"Voorrondes!D20","v":"11:20:00"},{"$f":"Voorrondes!E20","v":"00:00:00"},{"$f":"Voorrondes!G20","v":"PA TEAM 4"},{"$f":"Voorrondes!M20","v":"--"},{"$f":"Voorrondes!N20","v":"PA TEAM 1"},{"$f":"Voorrondes!U20","v":0},{"$f":"Voorrondes!V20","v":"--"},{"$f":"Voorrondes!W20","v":0},null,{"$f":"Voorrondes!Y20","v":1},null,{"$f":"Voorrondes!AA20","v":1}]
[{"$f":"Voorrondes!D21","v":"11:40:00"},{"$f":"Voorrondes!E21","v":"00:00:00"},{"$f":"Voorrondes!G21","v":"PA TEAM 3"},{"$f":"Voorrondes!M21","v":"--"},{"$f":"Voorrondes!N21","v":"PA TEAM 5"},{"$f":"Voorrondes!U21","v":3},{"$f":"Voorrondes!V21","v":"--"},{"$f":"Voorrondes!W21","v":2},null,{"$f":"Voorrondes!Y21","v":3},null,{"$f":"Voorrondes!AA21","v":0}]
[{"$f":"Voorrondes!D22","v":"12:00:00"},{"$f":"Voorrondes!E22","v":"00:00:00"},{"$f":"Voorrondes!G22","v":"PA TEAM 4"},{"$f":"Voorrondes!M22","v":"--"},{"$f":"Voorrondes!N22","v":"PA TEAM 2"},{"$f":"Voorrondes!U22","v":2},{"$f":"Voorrondes!V22","v":"--"},{"$f":"Voorrondes!W22","v":1},null,{"$f":"Voorrondes!Y22","v":3},null,{"$f":"Voorrondes!AA22","v":0}]
[]
[]
[{"$f":"Voorrondes!A3","v":"Stand"},{"$f":"Voorrondes!B5","v":"Poule A"},null,null,null,"Voor","Tegen","Punten",{"$f":"Voorrondes!K3","v":"Gewonnen"},{"$f":"Voorrondes!L3","v":"Gelijk"},{"$f":"Voorrondes!M3","v":"Verloren"},{"$f":"Voorrondes!N3","v":"Saldo"}]
[1,{"$f":"VLOOKUP(A16,Voorrondes!$A$6:$N$10,2,FALSE)","v":"PA TEAM 4"},null,null,null,{"$f":"VLOOKUP($A$16,Voorrondes!$A$6:$N$10,8,FALSE)","v":10},{"$f":"VLOOKUP($A$16,Voorrondes!$A$6:$N$10,9,FALSE)","v":3},{"$f":"VLOOKUP($A$16,Voorrondes!$A$6:$N$10,10,FALSE)","v":8.0070999999999994},{"$f":"VLOOKUP($A$16,Voorrondes!$A$6:$N$10,11,FALSE)","v":2},{"$f":"VLOOKUP($A$16,Voorrondes!$A$6:$N$10,12,FALSE)","v":2},{"$f":"VLOOKUP($A$16,Voorrondes!$A$6:$N$10,13,FALSE)","v":0},{"$f":"VLOOKUP($A$16,Voorrondes!$A$6:$N$10,14,FALSE)","v":7}]
[2,{"$f":"VLOOKUP(A17,Voorrondes!$A$6:$N$10,2,FALSE)","v":"PA TEAM 3"},null,null,null,{"$f":"VLOOKUP($A$17,Voorrondes!$A$6:$N$10,8,FALSE)","v":11},{"$f":"VLOOKUP($A$17,Voorrondes!$A$6:$N$10,9,FALSE)","v":11},{"$f":"VLOOKUP($A$17,Voorrondes!$A$6:$N$10,10,FALSE)","v":7.0001100000000003},{"$f":"VLOOKUP($A$17,Voorrondes!$A$6:$N$10,11,FALSE)","v":2},{"$f":"VLOOKUP($A$17,Voorrondes!$A$6:$N$10,12,FALSE)","v":1},{"$f":"VLOOKUP($A$17,Voorrondes!$A$6:$N$10,13,FALSE)","v":1},{"$f":"VLOOKUP($A$17,Voorrondes!$A$6:$N$10,14,FALSE)","v":0}]
[3,{"$f":"VLOOKUP(A18,Voorrondes!$A$6:$N$10,2,FALSE)","v":"PA TEAM 1"},null,null,null,{"$f":"VLOOKUP($A$18,Voorrondes!$A$6:$N$10,8,FALSE)","v":11},{"$f":"VLOOKUP($A$18,Voorrondes!$A$6:$N$10,9,FALSE)","v":12},{"$f":"VLOOKUP($A$18,Voorrondes!$A$6:$N$10,10,FALSE)","v":4.9991100000000008},{"$f":"VLOOKUP($A$18,Voorrondes!$A$6:$N$10,11,FALSE)","v":1},{"$f":"VLOOKUP($A$18,Voorrondes!$A$6:$N$10,12,FALSE)","v":2},{"$f":"VLOOKUP($A$18,Voorrondes!$A$6:$N$10,13,FALSE)","v":1},{"$f":"VLOOKUP($A$18,Voorrondes!$A$6:$N$10,14,FALSE)","v":-1}]
[4,{"$f":"VLOOKUP(A19,Voorrondes!$A$6:$N$10,2,FALSE)","v":"PA TEAM 5"},null,null,null,{"$f":"VLOOKUP($A$19,Voorrondes!$A$6:$N$10,8,FALSE)","v":11},{"$f":"VLOOKUP($A$19,Voorrondes!$A$6:$N$10,9,FALSE)","v":17},{"$f":"VLOOKUP($A$19,Voorrondes!$A$6:$N$10,10,FALSE)","v":3.99411},{"$f":"VLOOKUP($A$19,Voorrondes!$A$6:$N$10,11,FALSE)","v":1},{"$f":"VLOOKUP($A$19,Voorrondes!$A$6:$N$10,12,FALSE)","v":1},{"$f":"VLOOKUP($A$19,Voorrondes!$A$6:$N$10,13,FALSE)","v":2},{"$f":"VLOOKUP($A$19,Voorrondes!$A$6:$N$10,14,FALSE)","v":-6}]
[5,{"$f":"VLOOKUP(A20,Voorrondes!$A$6:$N$10,2,FALSE)","v":"PA TEAM 2"},null,null,null,{"$f":"VLOOKUP($A$20,Voorrondes!$A$6:$N$10,8,FALSE)","v":10},{"$f":"VLOOKUP($A$20,Voorrondes!$A$6:$N$10,9,FALSE)","v":10},{"$f":"VLOOKUP($A$20,Voorrondes!$A$6:$N$10,10,FALSE)","v":3.0001000000000002},{"$f":"VLOOKUP($A$20,Voorrondes!$A$6:$N$10,11,FALSE)","v":1},{"$f":"VLOOKUP($A$20,Voorrondes!$A$6:$N$10,12,FALSE)","v":0},{"$f":"VLOOKUP($A$20,Voorrondes!$A$6:$N$10,13,FALSE)","v":3},{"$f":"VLOOKUP($A$20,Voorrondes!$A$6:$N$10,14,FALSE)","v":0}]

{"sheet":"VGROEP-2","index":3,"n_rows":20,"n_cols":13,"rows_kept":20,"cut":false,"hidden":false,"merged":[[6,0,6,1],[2,0,2,1],[3,0,3,1],[19,1,19,4],[14,1,14,4],[18,1,18,4],[0,12,0,13],[15,1,15,4],[16,1,16,4],[17,1,17,4],[0,0,0,11],[1,5,1,7],[1,9,1,11],[10,0,10,1],[11,0,11,1],[1,0,1,1],[1,2,1,4],[7,0,7,1],[8,0,8,1],[9,0,9,1],[4,0,4,1],[5,0,5,1]]}
["Groep 2\nVoorronde",null,null,null,null,null,null,null,null,null,null,null,"SCORES BY:\nOnlineExcelCursus.NL"]
[{"$f":"Voorrondes!AC12","v":"Tijd"},null,{"$f":"Voorrondes!AF12","v":"VELD 2"},null,null,{"$f":"Voorrondes!AT12","v":"Uitslag"},null,null,null,{"$f":"Voorrondes!AX12","v":"Punten"}]
[{"$f":"Voorrondes!AC13","v":"09:00:00"},{"$f":"Voorrondes!AD13","v":"00:00:00"},{"$f":"Voorrondes!AF13","v":"PB TEAM 1"},{"$f":"Voorrondes!AL13","v":"--"},{"$f":"Voorrondes!AM13","v":"PB TEAM 2"},{"$f":"Voorrondes!AT13","v":1},{"$f":"Voorrondes!AU13","v":"--"},{"$f":"Voorrondes!AV13","v":8},null,{"$f":"Voorrondes!AX13","v":0},null,{"$f":"Voorrondes!AZ13","v":3}]
[{"$f":"Voorrondes!AC14","v":"09:20:00"},{"$f":"Voorrondes!AD14","v":"00:00:00"},{"$f":"Voorrondes!AF14","v":"PB TEAM 3"},{"$f":"Voorrondes!AL14","v":"--"},{"$f":"Voorrondes!AM14","v":"PB TEAM 4"},{"$f":"Voorrondes!AT14","v":2},{"$f":"Voorrondes!AU14","v":"--"},{"$f":"Voorrondes!AV14","v":6},null,{"$f":"Voorrondes!AX14","v":0},null,{"$f":"Voorrondes!AZ14","v":3}]
[{"$f":"Voorrondes!AC15","v":"09:40:00"},{"$f":"Voorrondes!AD15","v":"00:00:00"},{"$f":"Voorrondes!AF15","v":"PB TEAM 5"},{"$f":"Voorrondes!AL15","v":"--"},{"$f":"Voorrondes!AM15","v":"PB TEAM 1"},{"$f":"Voorrondes!AT15","v":3},{"$f":"Voorrondes!AU15","v":"--"},{"$f":"Voorrondes!AV15","v":8},null,{"$f":"Voorrondes!AX15","v":0},null,{"$f":"Voorrondes!AZ15","v":3}]
[{"$f":"Voorrondes!AC16","v":"10:00:00"},{"$f":"Voorrondes!AD16","v":"00:00:00"},{"$f":"Voorrondes!AF16","v":"PB TEAM 2"},{"$f":"Voorrondes!AL16","v":"--"},{"$f":"Voorrondes!AM16","v":"PB TEAM 3"},{"$f":"Voorrondes!AT16","v":4},{"$f":"Voorrondes!AU16","v":"--"},{"$f":"Voorrondes!AV16","v":4},null,{"$f":"Voorrondes!AX16","v":1},null,{"$f":"Voorrondes!AZ16","v":1}]
[{"$f":"Voorrondes!AC17","v":"10:20:00"},{"$f":"Voorrondes!AD17","v":"00:00:00"},{"$f":"Voorrondes!AF17","v":"PB TEAM 5"},{"$f":"Voorrondes!AL17","v":"--"},{"$f":"Voorrondes!AM17","v":"PB TEAM 4"},{"$f":"Voorrondes!AT17","v":2},{"$f":"Voorrondes!AU17","v":"--"},{"$f":"Voorrondes!AV17","v":3},null,{"$f":"Voorrondes!AX17","v":0},null,{"$f":"Voorrondes!AZ17","v":3}]
[{"$f":"Voorrondes!AC18","v":"10:40:00"},{"$f":"Voorrondes!AD18","v":"00:00:00"},{"$f":"Voorrondes!AF18","v":"PB TEAM 1"},{"$f":"Voorrondes!AL18","v":"--"},{"$f":"Voorrondes!AM18","v":"PB TEAM 3"},{"$f":"Voorrondes!AT18","v":1},{"$f":"Voorrondes!AU18","v":"--"},{"$f":"Voorrondes!AV18","v":6},null,{"$f":"Voorrondes!AX18","v":0},null,{"$f":"Voorrondes!AZ18","v":3}]
[{"$f":"Voorrondes!AC19","v":"11:00:00"},{"$f":"Voorrondes!AD19","v":"00:00:00"},{"$f":"Voorrondes!AF19","v":"PB TEAM 2"},{"$f":"Voorrondes!AL19","v":"--"},{"$f":"Voorrondes!AM19","v":"PB TEAM 5"},{"$f":"Voorrondes!AT19","v":1},{"$f":"Voorrondes!AU19","v":"--"},{"$f":"Voorrondes!AV19","v":2},null,{"$f":"Voorrondes!AX19","v":0},null,{"$f":"Voorrondes!AZ19","v":3}]
[{"$f":"Voorrondes!AC20","v":"11:20:00"},{"$f":"Voorrondes!AD20","v":"00:00:00"},{"$f":"Voorrondes!AF20","v":"PB TEAM 4"},{"$f":"Voorrondes!AL20","v":"--"},{"$f":"Voorrondes!AM20","v":"PB TEAM 1"},{"$f":"Voorrondes!AT20","v":3},{"$f":"Voorrondes!AU20","v":"--"},{"$f":"Voorrondes!AV20","v":5},null,{"$f":"Voorrondes!AX20","v":0},null,{"$f":"Voorrondes!AZ20","v":3}]
[{"$f":"Voorrondes!AC21","v":"11:40:00"},{"$f":"Voorrondes!AD21","v":"00:00:00"},{"$f":"Voorrondes!AF21","v":"PB TEAM 3"},{"$f":"Voorrondes!AL21","v":"--"},{"$f":"Voorrondes!AM21","v":"PB TEAM 5"},{"$f":"Voorrondes!AT21","v":2},{"$f":"Voorrondes!AU21","v":"--"},{"$f":"Voorrondes!AV21","v":2},null,{"$f":"Voorrondes!AX21","v":1},null,{"$f":"Voorrondes!AZ21","v":1}]
[{"$f":"Voorrondes!AC22","v":"12:00:00"},{"$f":"Voorrondes!AD22","v":"00:00:00"},{"$f":"Voorrondes!AF22","v":"PB TEAM 4"},{"$f":"Voorrondes!AL22","v":"--"},{"$f":"Voorrondes!AM22","v":"PB TEAM 2"},{"$f":"Voorrondes!AT22","v":0},{"$f":"Voorrondes!AU22","v":"--"},{"$f":"Voorrondes!AV22","v":3},null,{"$f":"Voorrondes!AX22","v":0},null,{"$f":"Voorrondes!AZ22","v":3}]
[]
[]
["Stand",{"$f":"Voorrondes!P5","v":"Poule B"},null,null,null,"Voor","Tegen","Punten",{"$f":"Voorrondes!Z3","v":"Gewonnen"},{"$f":"Voorrondes!AA3","v":"Gelijk"},{"$f":"Voorrondes!AB3","v":"Verloren"},{"$f":"Voorrondes!AC3","v":"Saldo"}]
[1,{"$f":"VLOOKUP(A16,Voorrondes!$O$6:$AC$10,2,FALSE)","v":"PB TEAM 2"},null,null,null,{"$f":"VLOOKUP($A16,Voorrondes!$O$6:$AC$10,9,FALSE)","v":16},{"$f":"VLOOKUP($A16,Voorrondes!$O$6:$AC$10,10,FALSE)","v":7},{"$f":"VLOOKUP($A16,Voorrondes!$O$6:$AC$10,11,FALSE)","v":7.0091600000000005},{"$f":"VLOOKUP($A16,Voorrondes!$O$6:$AC$10,12,FALSE)","v":2},{"$f":"VLOOKUP($A16,Voorrondes!$O$6:$AC$10,13,FALSE)","v":1},{"$f":"VLOOKUP($A16,Voorrondes!$O$6:$AC$10,14,FALSE)","v":1},{"$f":"VLOOKUP($A16,Voorrondes!$O$6:$AC$10,15,FALSE)","v":9}]
[2,{"$f":"VLOOKUP(A17,Voorrondes!$O$6:$AC$10,2,FALSE)","v":"PB TEAM 4"},null,null,null,{"$f":"VLOOKUP($A17,Voorrondes!$O$6:$AC$10,9,FALSE)","v":12},{"$f":"VLOOKUP($A17,Voorrondes!$O$6:$AC$10,10,FALSE)","v":12},{"$f":"VLOOKUP($A17,Voorrondes!$O$6:$AC$10,11,FALSE)","v":6.0001199999999999},{"$f":"VLOOKUP($A17,Voorrondes!$O$6:$AC$10,12,FALSE)","v":2},{"$f":"VLOOKUP($A17,Voorrondes!$O$6:$AC$10,13,FALSE)","v":0},{"$f":"VLOOKUP($A17,Voorrondes!$O$6:$AC$10,14,FALSE)","v":2},{"$f":"VLOOKUP($A17,Voorrondes!$O$6:$AC$10,15,FALSE)","v":0}]
[3,{"$f":"VLOOKUP(A18,Voorrondes!$O$6:$AC$10,2,FALSE)","v":"PB TEAM 1"},null,null,null,{"$f":"VLOOKUP($A18,Voorrondes!$O$6:$AC$10,9,FALSE)","v":15},{"$f":"VLOOKUP($A18,Voorrondes!$O$6:$AC$10,10,FALSE)","v":20},{"$f":"VLOOKUP($A18,Voorrondes!$O$6:$AC$10,11,FALSE)","v":5.9951499999999998},{"$f":"VLOOKUP($A18,Voorrondes!$O$6:$AC$10,12,FALSE)","v":2},{"$f":"VLOOKUP($A18,Voorrondes!$O$6:$AC$10,13,FALSE)","v":0},{"$f":"VLOOKUP($A18,Voorrondes!$O$6:$AC$10,14,FALSE)","v":2},{"$f":"VLOOKUP($A18,Voorrondes!$O$6:$AC$10,15,FALSE)","v":-5}]
[4,{"$f":"VLOOKUP(A19,Voorrondes!$O$6:$AC$10,2,FALSE)","v":"PB TEAM 3"},null,null,null,{"$f":"VLOOKUP($A19,Voorrondes!$O$6:$AC$10,9,FALSE)","v":14},{"$f":"VLOOKUP($A19,Voorrondes!$O$6:$AC$10,10,FALSE)","v":13},{"$f":"VLOOKUP($A19,Voorrondes!$O$6:$AC$10,11,FALSE)","v":5.0011400000000004},{"$f":"VLOOKUP($A19,Voorrondes!$O$6:$AC$10,12,FALSE)","v":1},{"$f":"VLOOKUP($A19,Voorrondes!$O$6:$AC$10,13,FALSE)","v":2},{"$f":"VLOOKUP($A19,Voorrondes!$O$6:$AC$10,14,FALSE)","v":1},{"$f":"VLOOKUP($A19,Voorrondes!$O$6:$AC$10,15,FALSE)","v":1}]
[5,{"$f":"VLOOKUP(A20,Voorrondes!$O$6:$AC$10,2,FALSE)","v":"PB TEAM 5"},null,null,null,{"$f":"VLOOKUP($A20,Voorrondes!$O$6:$AC$10,9,FALSE)","v":9},{"$f":"VLOOKUP($A20,Voorrondes!$O$6:$AC$10,10,FALSE)","v":14},{"$f":"VLOOKUP($A20,Voorrondes!$O$6:$AC$10,11,FALSE)","v":3.9950900000000007},{"$f":"VLOOKUP($A20,Voorrondes!$O$6:$AC$10,12,FALSE)","v":1},{"$f":"VLOOKUP($A20,Voorrondes!$O$6:$AC$10,13,FALSE)","v":1},{"$f":"VLOOKUP($A20,Voorrondes!$O$6:$AC$10,14,FALSE)","v":2},{"$f":"VLOOKUP($A20,Voorrondes!$O$6:$AC$10,15,FALSE)","v":-5}]

{"sheet":"VGROEP-3","index":4,"n_rows":20,"n_cols":13,"rows_kept":20,"cut":false,"hidden":false,"merged":[[17,1,17,4],[18,1,18,4],[19,1,19,4],[15,1,15,4],[11,0,11,1],[16,1,16,4],[14,1,14,4],[0,12,0,13],[0,0,0,11],[9,0,9,1],[10,0,10,1],[7,0,7,1],[8,0,8,1],[5,0,5,1],[1,9,1,11],[2,0,2,1],[3,0,3,1],[4,0,4,1],[1,0,1,1],[1,5,1,7],[1,2,1,4],[6,0,6,1]]}
["Groep 3\nVoorronde",null,null,null,null,null,null,null,null,null,null,null,"SCORES BY:\nOnlineExcelCursus.NL"]
[{"$f":"Voorrondes!D24","v":"Tijd"},{"$f":"Voorrondes!E24","v":0},{"$f":"Voorrondes!G24","v":"VELD 3"},null,null,{"$f":"Voorrondes!U24","v":"Uitslag"},{"$f":"Voorrondes!V24","v":0},{"$f":"Voorrondes!W24","v":0},null,{"$f":"Voorrondes!Y24","v":"Punten"}]
[{"$f":"Voorrondes!D25","v":"09:00:00"},{"$f":"Voorrondes!E25","v":"00:00:00"},{"$f":"Voorrondes!G25","v":"PC TEAM 1"},{"$f":"Voorrondes!M25","v":"--"},{"$f":"Voorrondes!N25","v":"PC TEAM 2"},{"$f":"Voorrondes!U25","v":9},{"$f":"Voorrondes!V25","v":"--"},{"$f":"Voorrondes!W25","v":2},null,{"$f":"Voorrondes!Y25","v":3},null,{"$f":"Voorrondes!AA25","v":0}]
[{"$f":"Voorrondes!D26","v":"09:20:00"},{"$f":"Voorrondes!E26","v":"00:00:00"},{"$f":"Voorrondes!G26","v":"PC TEAM 3"},{"$f":"Voorrondes!M26","v":"--"},{"$f":"Voorrondes!N26","v":"PC TEAM 4"},{"$f":"Voorrondes!U26","v":8},{"$f":"Voorrondes!V26","v":"--"},{"$f":"Voorrondes!W26","v":4},null,{"$f":"Voorrondes!Y26","v":3},null,{"$f":"Voorrondes!AA26","v":0}]
[{"$f":"Voorrondes!D27","v":"09:40:00"},{"$f":"Voorrondes!E27","v":"00:00:00"},{"$f":"Voorrondes!G27","v":"PC TEAM 5"},{"$f":"Voorrondes!M27","v":"--"},{"$f":"Voorrondes!N27","v":"PC TEAM 1"},{"$f":"Voorrondes!U27","v":7},{"$f":"Voorrondes!V27","v":"--"},{"$f":"Voorrondes!W27","v":5},null,{"$f":"Voorrondes!Y27","v":3},null,{"$f":"Voorrondes!AA27","v":0}]
[{"$f":"Voorrondes!D28","v":"10:00:00"},{"$f":"Voorrondes!E28","v":"00:00:00"},{"$f":"Voorrondes!G28","v":"PC TEAM 2"},{"$f":"Voorrondes!M28","v":"--"},{"$f":"Voorrondes!N28","v":"PC TEAM 3"},{"$f":"Voorrondes!U28","v":4},{"$f":"Voorrondes!V28","v":"--"},{"$f":"Voorrondes!W28","v":1},null,{"$f":"Voorrondes!Y28","v":3},null,{"$f":"Voorrondes!AA28","v":0}]
[{"$f":"Voorrondes!D29","v":"10:20:00"},{"$f":"Voorrondes!E29","v":"00:00:00"},{"$f":"Voorrondes!G29","v":"PC TEAM 5"},{"$f":"Voorrondes!M29","v":"--"},{"$f":"Voorrondes!N29","v":"PC TEAM 4"},{"$f":"Voorrondes!U29","v":5},{"$f":"Voorrondes!V29","v":"--"},{"$f":"Voorrondes!W29","v":0},null,{"$f":"Voorrondes!Y29","v":3},null,{"$f":"Voorrondes!AA29","v":0}]
[{"$f":"Voorrondes!D30","v":"10:40:00"},{"$f":"Voorrondes!E30","v":"00:00:00"},{"$f":"Voorrondes!G30","v":"PC TEAM 1"},{"$f":"Voorrondes!M30","v":"--"},{"$f":"Voorrondes!N30","v":"PC TEAM 3"},{"$f":"Voorrondes!U30","v":6},{"$f":"Voorrondes!V30","v":"--"},{"$f":"Voorrondes!W30","v":8},null,{"$f":"Voorrondes!Y30","v":0},null,{"$f":"Voorrondes!AA30","v":3}]
[{"$f":"Voorrondes!D31","v":"11:00:00"},{"$f":"Voorrondes!E31","v":"00:00:00"},{"$f":"Voorrondes!G31","v":"PC TEAM 2"},{"$f":"Voorrondes!M31","v":"--"},{"$f":"Voorrondes!N31","v":"PC TEAM 5"},{"$f":"Voorrondes!U31","v":1},{"$f":"Voorrondes!V31","v":"--"},{"$f":"Voorrondes!W31","v":5},null,{"$f":"Voorrondes!Y31","v":0},null,{"$f":"Voorrondes!AA31","v":3}]
[{"$f":"Voorrondes!D32","v":"11:20:00"},{"$f":"Voorrondes!E32","v":"00:00:00"},{"$f":"Voorrondes!G32","v":"PC TEAM 4"},{"$f":"Voorrondes!M32","v":"--"},{"$f":"Voorrondes!N32","v":"PC TEAM 1"},{"$f":"Voorrondes!U32","v":2},{"$f":"Voorrondes!V32","v":"--"},{"$f":"Voorrondes!W32","v":4},null,{"$f":"Voorrondes!Y32","v":0},null,{"$f":"Voorrondes!AA32","v":3}]
[{"$f":"Voorrondes!D33","v":"11:40:00"},{"$f":"Voorrondes!E33","v":"00:00:00"},{"$f":"Voorrondes!G33","v":"PC TEAM 3"},{"$f":"Voorrondes!M33","v":"--"},{"$f":"Voorrondes!N33","v":"PC TEAM 5"},{"$f":"Voorrondes!U33","v":0},{"$f":"Voorrondes!V33","v":"--"},{"$f":"Voorrondes!W33","v":3},null,{"$f":"Voorrondes!Y33","v":0},null,{"$f":"Voorrondes!AA33","v":3}]
[{"$f":"Voorrondes!D34","v":"12:00:00"},{"$f":"Voorrondes!E34","v":"00:00:00"},{"$f":"Voorrondes!G34","v":"PC TEAM 4"},{"$f":"Voorrondes!M34","v":"--"},{"$f":"Voorrondes!N34","v":"PC TEAM 2"},{"$f":"Voorrondes!U34","v":1},{"$f":"Voorrondes!V34","v":"--"},{"$f":"Voorrondes!W34","v":2},null,{"$f":"Voorrondes!Y34","v":0},null,{"$f":"Voorrondes!AA34","v":3}]
[]
[]
[{"$f":"Voorrondes!AD3","v":"Stand"},{"$f":"Voorrondes!AE5","v":"Poule C"},null,null,null,"Voor","Tegen","Punten",{"$f":"Voorrondes!AN3","v":"Gewonnen"},{"$f":"Voorrondes!AO3","v":"Gelijk"},{"$f":"Voorrondes!AP3","v":"Verloren"},{"$f":"Voorrondes!AQ3","v":"Saldo"}]
[1,{"$f":"VLOOKUP(A16,Voorrondes!$AD$6:$AQ$10,2,FALSE)","v":"PC TEAM 5"},null,null,null,{"$f":"VLOOKUP($A16,Voorrondes!$AD$6:$AQ$10,8,FALSE)","v":20},{"$f":"VLOOKUP($A16,Voorrondes!$AD$6:$AQ$10,9,FALSE)","v":6},{"$f":"VLOOKUP($A16,Voorrondes!$AD$6:$AQ$10,10,FALSE)","v":12.014199999999999},{"$f":"VLOOKUP($A16,Voorrondes!$AD$6:$AQ$10,11,FALSE)","v":4},{"$f":"VLOOKUP($A16,Voorrondes!$AD$6:$AQ$10,12,FALSE)","v":0},{"$f":"VLOOKUP($A16,Voorrondes!$AD$6:$AQ$10,13,FALSE)","v":0},{"$f":"VLOOKUP($A16,Voorrondes!$AD$6:$AQ$10,14,FALSE)","v":14}]
[2,{"$f":"VLOOKUP(A17,Voorrondes!$AD$6:$AQ$10,2,FALSE)","v":"PC TEAM 1"},null,null,null,{"$f":"VLOOKUP($A17,Voorrondes!$AD$6:$AQ$10,8,FALSE)","v":24},{"$f":"VLOOKUP($A17,Voorrondes!$AD$6:$AQ$10,9,FALSE)","v":19},{"$f":"VLOOKUP($A17,Voorrondes!$AD$6:$AQ$10,10,FALSE)","v":6.0052399999999997},{"$f":"VLOOKUP($A17,Voorrondes!$AD$6:$AQ$10,11,FALSE)","v":2},{"$f":"VLOOKUP($A17,Voorrondes!$AD$6:$AQ$10,12,FALSE)","v":0},{"$f":"VLOOKUP($A17,Voorrondes!$AD$6:$AQ$10,13,FALSE)","v":2},{"$f":"VLOOKUP($A17,Voorrondes!$AD$6:$AQ$10,14,FALSE)","v":5}]
[3,{"$f":"VLOOKUP(A18,Voorrondes!$AD$6:$AQ$10,2,FALSE)","v":"PC TEAM 3"},null,null,null,{"$f":"VLOOKUP($A18,Voorrondes!$AD$6:$AQ$10,8,FALSE)","v":17},{"$f":"VLOOKUP($A18,Voorrondes!$AD$6:$AQ$10,9,FALSE)","v":17},{"$f":"VLOOKUP($A18,Voorrondes!$AD$6:$AQ$10,10,FALSE)","v":6.0001699999999998},{"$f":"VLOOKUP($A18,Voorrondes!$AD$6:$AQ$10,11,FALSE)","v":2},{"$f":"VLOOKUP($A18,Voorrondes!$AD$6:$AQ$10,12,FALSE)","v":0},{"$f":"VLOOKUP($A18,Voorrondes!$AD$6:$AQ$10,13,FALSE)","v":2},{"$f":"VLOOKUP($A18,Voorrondes!$AD$6:$AQ$10,14,FALSE)","v":0}]
[4,{"$f":"VLOOKUP(A19,Voorrondes!$AD$6:$AQ$10,2,FALSE)","v":"PC TEAM 2"},null,null,null,{"$f":"VLOOKUP($A19,Voorrondes!$AD$6:$AQ$10,8,FALSE)","v":9},{"$f":"VLOOKUP($A19,Voorrondes!$AD$6:$AQ$10,9,FALSE)","v":16},{"$f":"VLOOKUP($A19,Voorrondes!$AD$6:$AQ$10,10,FALSE)","v":5.9930900000000005},{"$f":"VLOOKUP($A19,Voorrondes!$AD$6:$AQ$10,11,FALSE)","v":2},{"$f":"VLOOKUP($A19,Voorrondes!$AD$6:$AQ$10,12,FALSE)","v":0},{"$f":"VLOOKUP($A19,Voorrondes!$AD$6:$AQ$10,13,FALSE)","v":2},{"$f":"VLOOKUP($A19,Voorrondes!$AD$6:$AQ$10,14,FALSE)","v":-7}]
[5,{"$f":"VLOOKUP(A20,Voorrondes!$AD$6:$AQ$10,2,FALSE)","v":"PC TEAM 4"},null,null,null,{"$f":"VLOOKUP($A20,Voorrondes!$AD$6:$AQ$10,8,FALSE)","v":7},{"$f":"VLOOKUP($A20,Voorrondes!$AD$6:$AQ$10,9,FALSE)","v":19},{"$f":"VLOOKUP($A20,Voorrondes!$AD$6:$AQ$10,10,FALSE)","v":-1.193E-2},{"$f":"VLOOKUP($A20,Voorrondes!$AD$6:$AQ$10,11,FALSE)","v":0},{"$f":"VLOOKUP($A20,Voorrondes!$AD$6:$AQ$10,12,FALSE)","v":0},{"$f":"VLOOKUP($A20,Voorrondes!$AD$6:$AQ$10,13,FALSE)","v":4},{"$f":"VLOOKUP($A20,Voorrondes!$AD$6:$AQ$10,14,FALSE)","v":-12}]

{"sheet":"VGROEP-4","index":5,"n_rows":20,"n_cols":13,"rows_kept":20,"cut":false,"hidden":false,"merged":[[16,1,16,4],[17,1,17,4],[18,1,18,4],[19,1,19,4],[8,0,8,1],[9,0,9,1],[10,0,10,1],[11,0,11,1],[14,1,14,4],[15,1,15,4],[7,0,7,1],[0,0,0,11],[0,12,0,13],[1,0,1,1],[1,2,1,4],[1,5,1,7],[1,9,1,11],[2,0,2,1],[3,0,3,1],[4,0,4,1],[5,0,5,1],[6,0,6,1]]}
["Groep 4\nVoorronde",null,null,null,null,null,null,null,null,null,null,null,"SCORES BY:\nOnlineExcelCursus.NL"]
["Tijd",0,"VELD 4",null,null,"Uitslag",0,0,null,"Punten",0,0]
[{"$f":"Voorrondes!AC25","v":"09:00:00"},"00:00:00",{"$f":"Voorrondes!AF25","v":"PD TEAM 1"},{"$f":"Voorrondes!AL25","v":"--"},{"$f":"Voorrondes!AM25","v":"PD TEAM 2"},{"$f":"Voorrondes!AT25","v":1},{"$f":"Voorrondes!AU25","v":"--"},{"$f":"Voorrondes!AV25","v":1},null,{"$f":"Voorrondes!AX25","v":1},null,{"$f":"Voorrondes!AZ25","v":1}]
[{"$f":"Voorrondes!AC26","v":"09:20:00"},{"$error":"#REF!"},{"$f":"Voorrondes!AF26","v":"PD TEAM 3"},{"$f":"Voorrondes!AL26","v":"--"},{"$f":"Voorrondes!AM26","v":"PD TEAM 4"},{"$f":"Voorrondes!AT26","v":1},{"$f":"Voorrondes!AU26","v":"--"},{"$f":"Voorrondes!AV26","v":0},null,{"$f":"Voorrondes!AX26","v":3},null,{"$f":"Voorrondes!AZ26","v":0}]
[{"$f":"Voorrondes!AC27","v":"09:40:00"},{"$error":"#REF!"},{"$f":"Voorrondes!AF27","v":"PD TEAM 5"},{"$f":"Voorrondes!AL27","v":"--"},{"$f":"Voorrondes!AM27","v":"PD TEAM 1"},{"$f":"Voorrondes!AT27","v":1},{"$f":"Voorrondes!AU27","v":"--"},{"$f":"Voorrondes!AV27","v":1},null,{"$f":"Voorrondes!AX27","v":1},null,{"$f":"Voorrondes!AZ27","v":1}]
[{"$f":"Voorrondes!AC28","v":"10:00:00"},{"$error":"#REF!"},{"$f":"Voorrondes!AF28","v":"PD TEAM 2"},{"$f":"Voorrondes!AL28","v":"--"},{"$f":"Voorrondes!AM28","v":"PD TEAM 3"},{"$f":"Voorrondes!AT28","v":1},{"$f":"Voorrondes!AU28","v":"--"},{"$f":"Voorrondes!AV28","v":2},null,{"$f":"Voorrondes!AX28","v":0},null,{"$f":"Voorrondes!AZ28","v":3}]
[{"$f":"Voorrondes!AC29","v":"10:20:00"},{"$error":"#REF!"},{"$f":"Voorrondes!AF29","v":"PD TEAM 5"},{"$f":"Voorrondes!AL29","v":"--"},{"$f":"Voorrondes!AM29","v":"PD TEAM 4"},{"$f":"Voorrondes!AT29","v":2},{"$f":"Voorrondes!AU29","v":"--"},{"$f":"Voorrondes!AV29","v":2},null,{"$f":"Voorrondes!AX29","v":1},null,{"$f":"Voorrondes!AZ29","v":1}]
[{"$f":"Voorrondes!AC30","v":"10:40:00"},{"$error":"#REF!"},{"$f":"Voorrondes!AF30","v":"PD TEAM 1"},{"$f":"Voorrondes!AL30","v":"--"},{"$f":"Voorrondes!AM30","v":"PD TEAM 3"},{"$f":"Voorrondes!AT30","v":2},{"$f":"Voorrondes!AU30","v":"--"},{"$f":"Voorrondes!AV30","v":5},null,{"$f":"Voorrondes!AX30","v":0},null,{"$f":"Voorrondes!AZ30","v":3}]
[{"$f":"Voorrondes!AC31","v":"11:00:00"},{"$error":"#REF!"},{"$f":"Voorrondes!AF31","v":"PD TEAM 2"},{"$f":"Voorrondes!AL31","v":"--"},{"$f":"Voorrondes!AM31","v":"PD TEAM 5"},{"$f":"Voorrondes!AT31","v":3},{"$f":"Voorrondes!AU31","v":"--"},{"$f":"Voorrondes!AV31","v":5},null,{"$f":"Voorrondes!AX31","v":0},null,{"$f":"Voorrondes!AZ31","v":3}]
[{"$f":"Voorrondes!AC32","v":"11:20:00"},{"$error":"#REF!"},{"$f":"Voorrondes!AF32","v":"PD TEAM 4"},{"$f":"Voorrondes!AL32","v":"--"},{"$f":"Voorrondes!AM32","v":"PD TEAM 1"},{"$f":"Voorrondes!AT32","v":3},{"$f":"Voorrondes!AU32","v":"--"},{"$f":"Voorrondes!AV32","v":3},null,{"$f":"Voorrondes!AX32","v":1},null,{"$f":"Voorrondes!AZ32","v":1}]
[{"$f":"Voorrondes!AC33","v":"11:40:00"},{"$error":"#REF!"},{"$f":"Voorrondes!AF33","v":"PD TEAM 3"},{"$f":"Voorrondes!AL33","v":"--"},{"$f":"Voorrondes!AM33","v":"PD TEAM 5"},{"$f":"Voorrondes!AT33","v":3},{"$f":"Voorrondes!AU33","v":"--"},{"$f":"Voorrondes!AV33","v":3},null,{"$f":"Voorrondes!AX33","v":1},null,{"$f":"Voorrondes!AZ33","v":1}]
[{"$f":"Voorrondes!AC34","v":"12:00:00"},{"$error":"#REF!"},{"$f":"Voorrondes!AF34","v":"PD TEAM 4"},{"$f":"Voorrondes!AL34","v":"--"},{"$f":"Voorrondes!AM34","v":"PD TEAM 2"},{"$f":"Voorrondes!AT34","v":5},{"$f":"Voorrondes!AU34","v":"--"},{"$f":"Voorrondes!AV34","v":3},null,{"$f":"Voorrondes!AX34","v":3},null,{"$f":"Voorrondes!AZ34","v":0}]
[]
[]
["Stand","Poule D",null,null,null,"Voor","Tegen","Punten","Gewonnen","Gelijk","Verloren","Saldo"]
[1,{"$f":"VLOOKUP(A16,Voorrondes!$AR$6:$BE$10,2,FALSE)","v":"PD TEAM 3"},null,null,null,{"$f":"VLOOKUP($A16,Voorrondes!$AR$6:$BE$10,8,FALSE)","v":11},{"$f":"VLOOKUP($A16,Voorrondes!$AR$6:$BE$10,9,FALSE)","v":6},{"$f":"VLOOKUP($A16,Voorrondes!$AR$6:$BE$10,10,FALSE)","v":10.005109999999998},{"$f":"VLOOKUP($A16,Voorrondes!$AR$6:$BE$10,11,FALSE)","v":3},{"$f":"VLOOKUP($A16,Voorrondes!$AR$6:$BE$10,12,FALSE)","v":1},{"$f":"VLOOKUP($A16,Voorrondes!$AR$6:$BE$10,13,FALSE)","v":0},{"$f":"VLOOKUP($A16,Voorrondes!$AR$6:$BE$10,14,FALSE)","v":5}]
[2,{"$f":"VLOOKUP(A17,Voorrondes!$AR$6:$BE$10,2,FALSE)","v":"PD TEAM 5"},null,null,null,{"$f":"VLOOKUP($A17,Voorrondes!$AR$6:$BE$10,8,FALSE)","v":11},{"$f":"VLOOKUP($A17,Voorrondes!$AR$6:$BE$10,9,FALSE)","v":9},{"$f":"VLOOKUP($A17,Voorrondes!$AR$6:$BE$10,10,FALSE)","v":6.0021100000000001},{"$f":"VLOOKUP($A17,Voorrondes!$AR$6:$BE$10,11,FALSE)","v":1},{"$f":"VLOOKUP($A17,Voorrondes!$AR$6:$BE$10,12,FALSE)","v":3},{"$f":"VLOOKUP($A17,Voorrondes!$AR$6:$BE$10,13,FALSE)","v":0},{"$f":"VLOOKUP($A17,Voorrondes!$AR$6:$BE$10,14,FALSE)","v":2}]
[3,{"$f":"VLOOKUP(A18,Voorrondes!$AR$6:$BE$10,2,FALSE)","v":"PD TEAM 4"},null,null,null,{"$f":"VLOOKUP($A18,Voorrondes!$AR$6:$BE$10,8,FALSE)","v":10},{"$f":"VLOOKUP($A18,Voorrondes!$AR$6:$BE$10,9,FALSE)","v":9},{"$f":"VLOOKUP($A18,Voorrondes!$AR$6:$BE$10,10,FALSE)","v":5.0010999999999992},{"$f":"VLOOKUP($A18,Voorrondes!$AR$6:$BE$10,11,FALSE)","v":1},{"$f":"VLOOKUP($A18,Voorrondes!$AR$6:$BE$10,12,FALSE)","v":2},{"$f":"VLOOKUP($A18,Voorrondes!$AR$6:$BE$10,13,FALSE)","v":1},{"$f":"VLOOKUP($A18,Voorrondes!$AR$6:$BE$10,14,FALSE)","v":1}]
[4,{"$f":"VLOOKUP(A19,Voorrondes!$AR$6:$BE$10,2,FALSE)","v":"PD TEAM 1"},null,null,null,{"$f":"VLOOKUP($A19,Voorrondes!$AR$6:$BE$10,8,FALSE)","v":7},{"$f":"VLOOKUP($A19,Voorrondes!$AR$6:$BE$10,9,FALSE)","v":10},{"$f":"VLOOKUP($A19,Voorrondes!$AR$6:$BE$10,10,FALSE)","v":2.9970700000000003},{"$f":"VLOOKUP($A19,Voorrondes!$AR$6:$BE$10,11,FALSE)","v":0},{"$f":"VLOOKUP($A19,Voorrondes!$AR$6:$BE$10,12,FALSE)","v":3},{"$f":"VLOOKUP($A19,Voorrondes!$AR$6:$BE$10,13,FALSE)","v":1},{"$f":"VLOOKUP($A19,Voorrondes!$AR$6:$BE$10,14,FALSE)","v":-3}]
[5,{"$f":"VLOOKUP(A20,Voorrondes!$AR$6:$BE$10,2,FALSE)","v":"PD TEAM 2"},null,null,null,{"$f":"VLOOKUP($A20,Voorrondes!$AR$6:$BE$10,8,FALSE)","v":8},{"$f":"VLOOKUP($A20,Voorrondes!$AR$6:$BE$10,9,FALSE)","v":13},{"$f":"VLOOKUP($A20,Voorrondes!$AR$6:$BE$10,10,FALSE)","v":0.99507999999999996},{"$f":"VLOOKUP($A20,Voorrondes!$AR$6:$BE$10,11,FALSE)","v":0},{"$f":"VLOOKUP($A20,Voorrondes!$AR$6:$BE$10,12,FALSE)","v":1},{"$f":"VLOOKUP($A20,Voorrondes!$AR$6:$BE$10,13,FALSE)","v":3},{"$f":"VLOOKUP($A20,Voorrondes!$AR$6:$BE$10,14,FALSE)","v":-5}]

{"sheet":"VGROEP-5","index":6,"n_rows":20,"n_cols":13,"rows_kept":20,"cut":false,"hidden":false,"merged":[[15,1,15,4],[16,1,16,4],[17,1,17,4],[18,1,18,4],[19,1,19,4],[8,0,8,1],[9,0,9,1],[10,0,10,1],[11,0,11,1],[14,1,14,4],[7,0,7,1],[0,0,0,11],[0,12,0,13],[1,0,1,1],[1,2,1,4],[1,5,1,7],[1,9,1,11],[2,0,2,1],[3,0,3,1],[4,0,4,1],[5,0,5,1],[6,0,6,1]]}
["Groep 5\nVoorronde",null,null,null,null,null,null,null,null,null,null,null,"SCORES BY:\nOnlineExcelCursus.NL"]
[{"$f":"Voorrondes!AC24","v":"Tijd"},{"$f":"Voorrondes!AD24","v":0},{"$f":"Voorrondes!AF24","v":"VELD 4"},null,null,{"$f":"Voorrondes!AT24","v":"Uitslag"},{"$f":"Voorrondes!AU24","v":0},{"$f":"Voorrondes!AV24","v":0},null,{"$f":"Voorrondes!AX24","v":"Punten"},{"$f":"Voorrondes!AY24","v":0},{"$f":"Voorrondes!AZ24","v":0}]
[{"$f":"Voorrondes!D38","v":"09:00:00"},{"$f":"Voorrondes!AD25","v":"00:00:00"},{"$f":"Voorrondes!G38","v":"PE TEAM 1"},{"$f":"Voorrondes!AL25","v":"--"},{"$f":"Voorrondes!N38","v":"PE TEAM 2"},{"$f":"Voorrondes!U38","v":2},{"$f":"Voorrondes!AU25","v":"--"},{"$f":"Voorrondes!W38","v":3},null,{"$f":"Voorrondes!Y38","v":0},null,{"$f":"Voorrondes!AA38","v":3}]
[{"$f":"Voorrondes!D39","v":"09:20:00"},{"$f":"Voorrondes!AD26","v":"00:00:00"},{"$f":"Voorrondes!G39","v":"PE TEAM 3"},{"$f":"Voorrondes!AL26","v":"--"},{"$f":"Voorrondes!N39","v":"PE TEAM 4"},{"$f":"Voorrondes!U39","v":3},{"$f":"Voorrondes!AU26","v":"--"},{"$f":"Voorrondes!W39","v":5},null,{"$f":"Voorrondes!Y39","v":0},null,{"$f":"Voorrondes!AA39","v":3}]
[{"$f":"Voorrondes!D40","v":"09:40:00"},{"$f":"Voorrondes!AD27","v":"00:00:00"},{"$f":"Voorrondes!G40","v":"PE TEAM 5"},{"$f":"Voorrondes!AL27","v":"--"},{"$f":"Voorrondes!N40","v":"PE TEAM 1"},{"$f":"Voorrondes!U40","v":6},{"$f":"Voorrondes!AU27","v":"--"},{"$f":"Voorrondes!W40","v":5},null,{"$f":"Voorrondes!Y40","v":3},null,{"$f":"Voorrondes!AA40","v":0}]
[{"$f":"Voorrondes!D41","v":"10:00:00"},{"$f":"Voorrondes!AD28","v":"00:00:00"},{"$f":"Voorrondes!G41","v":"PE TEAM 2"},{"$f":"Voorrondes!AL28","v":"--"},{"$f":"Voorrondes!N41","v":"PE TEAM 3"},{"$f":"Voorrondes!U41","v":0},{"$f":"Voorrondes!AU28","v":"--"},{"$f":"Voorrondes!W41","v":2},null,{"$f":"Voorrondes!Y41","v":0},null,{"$f":"Voorrondes!AA41","v":3}]
[{"$f":"Voorrondes!D42","v":"10:20:00"},{"$f":"Voorrondes!AD29","v":"00:00:00"},{"$f":"Voorrondes!G42","v":"PE TEAM 5"},{"$f":"Voorrondes!AL29","v":"--"},{"$f":"Voorrondes!N42","v":"PE TEAM 4"},{"$f":"Voorrondes!U42","v":1},{"$f":"Voorrondes!AU29","v":"--"},{"$f":"Voorrondes!W42","v":1},null,{"$f":"Voorrondes!Y42","v":1},null,{"$f":"Voorrondes!AA42","v":1}]
[{"$f":"Voorrondes!D43","v":"10:40:00"},{"$f":"Voorrondes!AD30","v":"00:00:00"},{"$f":"Voorrondes!G43","v":"PE TEAM 1"},{"$f":"Voorrondes!AL30","v":"--"},{"$f":"Voorrondes!N43","v":"PE TEAM 3"},{"$f":"Voorrondes!U43","v":2},{"$f":"Voorrondes!AU30","v":"--"},{"$f":"Voorrondes!W43","v":1},null,{"$f":"Voorrondes!Y43","v":3},null,{"$f":"Voorrondes!AA43","v":0}]
[{"$f":"Voorrondes!D44","v":"11:00:00"},{"$f":"Voorrondes!AD31","v":"00:00:00"},{"$f":"Voorrondes!G44","v":"PE TEAM 2"},{"$f":"Voorrondes!AL31","v":"--"},{"$f":"Voorrondes!N44","v":"PE TEAM 5"},{"$f":"Voorrondes!U44","v":4},{"$f":"Voorrondes!AU31","v":"--"},{"$f":"Voorrondes!W44","v":4},null,{"$f":"Voorrondes!Y44","v":1},null,{"$f":"Voorrondes!AA44","v":1}]
[{"$f":"Voorrondes!D45","v":"11:20:00"},{"$f":"Voorrondes!AD32","v":"00:00:00"},{"$f":"Voorrondes!G45","v":"PE TEAM 4"},{"$f":"Voorrondes!AL32","v":"--"},{"$f":"Voorrondes!N45","v":"PE TEAM 1"},{"$f":"Voorrondes!U45","v":5},{"$f":"Voorrondes!AU32","v":"--"},{"$f":"Voorrondes!W45","v":3},null,{"$f":"Voorrondes!Y45","v":3},null,{"$f":"Voorrondes!AA45","v":0}]
[{"$f":"Voorrondes!D46","v":"11:40:00"},{"$f":"Voorrondes!AD33","v":"00:00:00"},{"$f":"Voorrondes!G46","v":"PE TEAM 3"},{"$f":"Voorrondes!AL33","v":"--"},{"$f":"Voorrondes!N46","v":"PE TEAM 5"},{"$f":"Voorrondes!U46","v":3},{"$f":"Voorrondes!AU33","v":"--"},{"$f":"Voorrondes!W46","v":2},null,{"$f":"Voorrondes!Y46","v":3},null,{"$f":"Voorrondes!AA46","v":0}]
[{"$f":"Voorrondes!D47","v":"12:00:00"},{"$f":"Voorrondes!AD34","v":"00:00:00"},{"$f":"Voorrondes!G47","v":"PE TEAM 4"},{"$f":"Voorrondes!AL34","v":"--"},{"$f":"Voorrondes!N47","v":"PE TEAM 2"},{"$f":"Voorrondes!U47","v":0},{"$f":"Voorrondes!AU34","v":"--"},{"$f":"Voorrondes!W47","v":0},null,{"$f":"Voorrondes!Y47","v":1},null,{"$f":"Voorrondes!AA47","v":1}]
[]
[]
[{"$f":"Voorrondes!AR3","v":"Stand"},{"$f":"Voorrondes!BG5","v":"Poule E"},null,null,null,"Voor","Tegen","Punten",{"$f":"Voorrondes!BB3","v":"Gewonnen"},{"$f":"Voorrondes!BC3","v":"Gelijk"},{"$f":"Voorrondes!BD3","v":"Verloren"},{"$f":"Voorrondes!BE3","v":"Saldo"}]
[1,{"$f":"VLOOKUP(A16,Voorrondes!$BF$6:$BS$10,2,FALSE)","v":"PE TEAM 4"},null,null,null,{"$f":"VLOOKUP($A16,Voorrondes!$BF$6:$BS$10,8,FALSE)","v":11},{"$f":"VLOOKUP($A16,Voorrondes!$BF$6:$BS$10,9,FALSE)","v":7},{"$f":"VLOOKUP($A16,Voorrondes!$BF$6:$BS$10,10,FALSE)","v":8.0041099999999989},{"$f":"VLOOKUP($A16,Voorrondes!$BF$6:$BS$10,11,FALSE)","v":2},{"$f":"VLOOKUP($A16,Voorrondes!$BF$6:$BS$10,12,FALSE)","v":2},{"$f":"VLOOKUP($A16,Voorrondes!$BF$6:$BS$10,13,FALSE)","v":0},{"$f":"VLOOKUP($A16,Voorrondes!$BF$6:$BS$10,14,FALSE)","v":4}]
[2,{"$f":"VLOOKUP(A17,Voorrondes!$BF$6:$BS$10,2,FALSE)","v":"PE TEAM 3"},null,null,null,{"$f":"VLOOKUP($A17,Voorrondes!$BF$6:$BS$10,8,FALSE)","v":9},{"$f":"VLOOKUP($A17,Voorrondes!$BF$6:$BS$10,9,FALSE)","v":9},{"$f":"VLOOKUP($A17,Voorrondes!$BF$6:$BS$10,10,FALSE)","v":6.0000900000000001},{"$f":"VLOOKUP($A17,Voorrondes!$BF$6:$BS$10,11,FALSE)","v":2},{"$f":"VLOOKUP($A17,Voorrondes!$BF$6:$BS$10,12,FALSE)","v":0},{"$f":"VLOOKUP($A17,Voorrondes!$BF$6:$BS$10,13,FALSE)","v":2},{"$f":"VLOOKUP($A17,Voorrondes!$BF$6:$BS$10,14,FALSE)","v":0}]
[3,{"$f":"VLOOKUP(A18,Voorrondes!$BF$6:$BS$10,2,FALSE)","v":"PE TEAM 5"},null,null,null,{"$f":"VLOOKUP($A18,Voorrondes!$BF$6:$BS$10,8,FALSE)","v":13},{"$f":"VLOOKUP($A18,Voorrondes!$BF$6:$BS$10,9,FALSE)","v":13},{"$f":"VLOOKUP($A18,Voorrondes!$BF$6:$BS$10,10,FALSE)","v":5.0001300000000004},{"$f":"VLOOKUP($A18,Voorrondes!$BF$6:$BS$10,11,FALSE)","v":1},{"$f":"VLOOKUP($A18,Voorrondes!$BF$6:$BS$10,12,FALSE)","v":2},{"$f":"VLOOKUP($A18,Voorrondes!$BF$6:$BS$10,13,FALSE)","v":1},{"$f":"VLOOKUP($A18,Voorrondes!$BF$6:$BS$10,14,FALSE)","v":0}]
[4,{"$f":"VLOOKUP(A19,Voorrondes!$BF$6:$BS$10,2,FALSE)","v":"PE TEAM 2"},null,null,null,{"$f":"VLOOKUP($A19,Voorrondes!$BF$6:$BS$10,8,FALSE)","v":7},{"$f":"VLOOKUP($A19,Voorrondes!$BF$6:$BS$10,9,FALSE)","v":8},{"$f":"VLOOKUP($A19,Voorrondes!$BF$6:$BS$10,10,FALSE)","v":4.9990699999999997},{"$f":"VLOOKUP($A19,Voorrondes!$BF$6:$BS$10,11,FALSE)","v":1},{"$f":"VLOOKUP($A19,Voorrondes!$BF$6:$BS$10,12,FALSE)","v":2},{"$f":"VLOOKUP($A19,Voorrondes!$BF$6:$BS$10,13,FALSE)","v":1},{"$f":"VLOOKUP($A19,Voorrondes!$BF$6:$BS$10,14,FALSE)","v":-1}]
[5,{"$f":"VLOOKUP(A20,Voorrondes!$BF$6:$BS$10,2,FALSE)","v":"PE TEAM 1"},null,null,null,{"$f":"VLOOKUP($A20,Voorrondes!$BF$6:$BS$10,8,FALSE)","v":12},{"$f":"VLOOKUP($A20,Voorrondes!$BF$6:$BS$10,9,FALSE)","v":15},{"$f":"VLOOKUP($A20,Voorrondes!$BF$6:$BS$10,10,FALSE)","v":2.9971199999999998},{"$f":"VLOOKUP($A20,Voorrondes!$BF$6:$BS$10,11,FALSE)","v":1},{"$f":"VLOOKUP($A20,Voorrondes!$BF$6:$BS$10,12,FALSE)","v":0},{"$f":"VLOOKUP($A20,Voorrondes!$BF$6:$BS$10,13,FALSE)","v":3},{"$f":"VLOOKUP($A20,Voorrondes!$BF$6:$BS$10,14,FALSE)","v":-3}]

{"sheet":"FGROEP-1","index":7,"n_rows":20,"n_cols":13,"rows_kept":20,"cut":false,"hidden":false,"merged":[[19,1,19,4],[19,14,19,19],[15,14,15,19],[16,1,16,4],[16,14,16,19],[17,1,17,4],[17,14,17,19],[18,1,18,4],[18,14,18,19],[15,1,15,4],[8,0,8,1],[9,0,9,1],[10,0,10,1],[11,0,11,1],[14,1,14,4],[7,0,7,1],[0,0,0,11],[0,12,0,13],[1,0,1,1],[1,2,1,4],[1,5,1,7],[1,9,1,11],[2,0,2,1],[3,0,3,1],[4,0,4,1],[5,0,5,1],[6,0,6,1]]}
["Finale ronde\nBeste nummers 1",null,null,null,null,null,null,null,null,null,null,null,"SCORES BY:\nOnlineExcelCursus.NL"]
[{"$f":"Finales!D12","v":"Tijd"},{"$f":"Voorrondes!E12","v":0},{"$f":"Finales!G12","v":"VELD 1"},null,null,null,null,null,null,{"$f":"Finales!Y12","v":"Punten"}]
[{"$f":"Finales!D13","v":"09:00:00"},{"$f":"Voorrondes!E13","v":"00:00:00"},{"$f":"Finales!G13","v":"PA TEAM 4"},{"$f":"Finales!M13","v":"--"},{"$f":"Finales!N13","v":"PB TEAM 2"},{"$f":"Finales!U13","v":0},{"$f":"Finales!V13","v":"--"},{"$f":"Finales!W13","v":0},null,{"$f":"Finales!Y13","v":""},null,{"$f":"Finales!AA13","v":""}]
[{"$f":"Finales!D14","v":"09:20:00"},{"$f":"Voorrondes!E14","v":"00:00:00"},{"$f":"Finales!G14","v":"PC TEAM 5"},{"$f":"Finales!M14","v":"--"},{"$f":"Finales!N14","v":"PD TEAM 3"},{"$f":"Finales!U14","v":0},{"$f":"Finales!V14","v":"--"},{"$f":"Finales!W14","v":0},null,{"$f":"Finales!Y14","v":""},null,{"$f":"Finales!AA14","v":""}]
[{"$f":"Finales!D15","v":"09:40:00"},{"$f":"Voorrondes!E15","v":"00:00:00"},{"$f":"Finales!G15","v":"PE TEAM 4"},{"$f":"Finales!M15","v":"--"},{"$f":"Finales!N15","v":"PA TEAM 4"},{"$f":"Finales!U15","v":0},{"$f":"Finales!V15","v":"--"},{"$f":"Finales!W15","v":0},null,{"$f":"Finales!Y15","v":""},null,{"$f":"Finales!AA15","v":""}]
[{"$f":"Finales!D16","v":"10:00:00"},{"$f":"Voorrondes!E16","v":"00:00:00"},{"$f":"Finales!G16","v":"PB TEAM 2"},{"$f":"Finales!M16","v":"--"},{"$f":"Finales!N16","v":"PC TEAM 5"},{"$f":"Finales!U16","v":0},{"$f":"Finales!V16","v":"--"},{"$f":"Finales!W16","v":0},null,{"$f":"Finales!Y16","v":""},null,{"$f":"Finales!AA16","v":""}]
[{"$f":"Finales!D17","v":"10:20:00"},{"$f":"Voorrondes!E17","v":"00:00:00"},{"$f":"Finales!G17","v":"PE TEAM 4"},{"$f":"Finales!M17","v":"--"},{"$f":"Finales!N17","v":"PD TEAM 3"},{"$f":"Finales!U17","v":0},{"$f":"Finales!V17","v":"--"},{"$f":"Finales!W17","v":0},null,{"$f":"Finales!Y17","v":""},null,{"$f":"Finales!AA17","v":""}]
[{"$f":"Finales!D18","v":"10:40:00"},{"$f":"Voorrondes!E18","v":"00:00:00"},{"$f":"Finales!G18","v":"PA TEAM 4"},{"$f":"Finales!M18","v":"--"},{"$f":"Finales!N18","v":"PC TEAM 5"},{"$f":"Finales!U18","v":0},{"$f":"Finales!V18","v":"--"},{"$f":"Finales!W18","v":0},null,{"$f":"Finales!Y18","v":""},null,{"$f":"Finales!AA18","v":""}]
[{"$f":"Finales!D19","v":"11:00:00"},{"$f":"Voorrondes!E19","v":"00:00:00"},{"$f":"Finales!G19","v":"PB TEAM 2"},{"$f":"Finales!M19","v":"--"},{"$f":"Finales!N19","v":"PE TEAM 4"},{"$f":"Finales!U19","v":0},{"$f":"Finales!V19","v":"--"},{"$f":"Finales!W19","v":0},null,{"$f":"Finales!Y19","v":""},null,{"$f":"Finales!AA19","v":""}]
[{"$f":"Finales!D20","v":"11:20:00"},{"$f":"Voorrondes!E20","v":"00:00:00"},{"$f":"Finales!G20","v":"PD TEAM 3"},{"$f":"Finales!M20","v":"--"},{"$f":"Finales!N20","v":"PA TEAM 4"},{"$f":"Finales!U20","v":0},{"$f":"Finales!V20","v":"--"},{"$f":"Finales!W20","v":0},null,{"$f":"Finales!Y20","v":""},null,{"$f":"Finales!AA20","v":""}]
[{"$f":"Finales!D21","v":"11:40:00"},{"$f":"Voorrondes!E21","v":"00:00:00"},{"$f":"Finales!G21","v":"PC TEAM 5"},{"$f":"Finales!M21","v":"--"},{"$f":"Finales!N21","v":"PE TEAM 4"},{"$f":"Finales!U21","v":0},{"$f":"Finales!V21","v":"--"},{"$f":"Finales!W21","v":0},null,{"$f":"Finales!Y21","v":""},null,{"$f":"Finales!AA21","v":""}]
[{"$f":"Finales!D22","v":"12:00:00"},{"$f":"Voorrondes!E22","v":"00:00:00"},{"$f":"Finales!G22","v":"PD TEAM 3"},{"$f":"Finales!M22","v":"--"},{"$f":"Finales!N22","v":"PB TEAM 2"},{"$f":"Finales!U22","v":0},{"$f":"Finales!V22","v":"--"},{"$f":"Finales!W22","v":0},null,{"$f":"Finales!Y22","v":""},null,{"$f":"Finales!AA22","v":""}]
[]
[]
[{"$f":"Finales!A3","v":"Stand"},{"$f":"Finales!B5","v":"Poule A"},null,null,null,"Voor","Tegen","Punten",{"$f":"Finales!K3","v":"Gewonnen"},{"$f":"Finales!L3","v":"Gelijk"},{"$f":"Finales!M3","v":"Verloren"},{"$f":"Finales!N3","v":"Saldo"}]
[1,{"$f":"VLOOKUP(A16,Finales!$A$6:$N$10,2,FALSE)","v":"PA TEAM 4"},null,null,null,{"$f":"VLOOKUP($A$16,Finales!$A$6:$N$10,8,FALSE)","v":0},{"$f":"VLOOKUP($A$16,Finales!$A$6:$N$10,9,FALSE)","v":0},{"$f":"VLOOKUP($A$16,Finales!$A$6:$N$10,10,FALSE)","v":0},{"$f":"VLOOKUP($A$16,Finales!$A$6:$N$10,11,FALSE)","v":0},{"$f":"VLOOKUP($A$16,Finales!$A$6:$N$10,12,FALSE)","v":0},{"$f":"VLOOKUP($A$16,Finales!$A$6:$N$10,13,FALSE)","v":0},{"$f":"VLOOKUP($A$16,Finales!$A$6:$N$10,14,FALSE)","v":0}]
[2,{"$f":"VLOOKUP(A17,Finales!$A$6:$N$10,2,FALSE)","v":{"$error":"#N/A"}},null,null,null,{"$f":"VLOOKUP($A$17,Finales!$A$6:$N$10,8,FALSE)","v":{"$error":"#N/A"}},{"$f":"VLOOKUP($A$17,Finales!$A$6:$N$10,9,FALSE)","v":{"$error":"#N/A"}},{"$f":"VLOOKUP($A$17,Finales!$A$6:$N$10,10,FALSE)","v":{"$error":"#N/A"}},{"$f":"VLOOKUP($A$17,Finales!$A$6:$N$10,11,FALSE)","v":{"$error":"#N/A"}},{"$f":"VLOOKUP($A$17,Finales!$A$6:$N$10,12,FALSE)","v":{"$error":"#N/A"}},{"$f":"VLOOKUP($A$17,Finales!$A$6:$N$10,13,FALSE)","v":{"$error":"#N/A"}},{"$f":"VLOOKUP($A$17,Finales!$A$6:$N$10,14,FALSE)","v":{"$error":"#N/A"}}]
[3,{"$f":"VLOOKUP(A18,Finales!$A$6:$N$10,2,FALSE)","v":{"$error":"#N/A"}},null,null,null,{"$f":"VLOOKUP($A$18,Finales!$A$6:$N$10,8,FALSE)","v":{"$error":"#N/A"}},{"$f":"VLOOKUP($A$18,Finales!$A$6:$N$10,9,FALSE)","v":{"$error":"#N/A"}},{"$f":"VLOOKUP($A$18,Finales!$A$6:$N$10,10,FALSE)","v":{"$error":"#N/A"}},{"$f":"VLOOKUP($A$18,Finales!$A$6:$N$10,11,FALSE)","v":{"$error":"#N/A"}},{"$f":"VLOOKUP($A$18,Finales!$A$6:$N$10,12,FALSE)","v":{"$error":"#N/A"}},{"$f":"VLOOKUP($A$18,Finales!$A$6:$N$10,13,FALSE)","v":{"$error":"#N/A"}},{"$f":"VLOOKUP($A$18,Finales!$A$6:$N$10,14,FALSE)","v":{"$error":"#N/A"}}]
[4,{"$f":"VLOOKUP(A19,Finales!$A$6:$N$10,2,FALSE)","v":{"$error":"#N/A"}},null,null,null,{"$f":"VLOOKUP($A$19,Finales!$A$6:$N$10,8,FALSE)","v":{"$error":"#N/A"}},{"$f":"VLOOKUP($A$19,Finales!$A$6:$N$10,9,FALSE)","v":{"$error":"#N/A"}},{"$f":"VLOOKUP($A$19,Finales!$A$6:$N$10,10,FALSE)","v":{"$error":"#N/A"}},{"$f":"VLOOKUP($A$19,Finales!$A$6:$N$10,11,FALSE)","v":{"$error":"#N/A"}},{"$f":"VLOOKUP($A$19,Finales!$A$6:$N$10,12,FALSE)","v":{"$error":"#N/A"}},{"$f":"VLOOKUP($A$19,Finales!$A$6:$N$10,13,FALSE)","v":{"$error":"#N/A"}},{"$f":"VLOOKUP($A$19,Finales!$A$6:$N$10,14,FALSE)","v":{"$error":"#N/A"}}]
[5,{"$f":"VLOOKUP(A20,Finales!$A$6:$N$10,2,FALSE)","v":{"$error":"#N/A"}},null,null,null,{"$f":"VLOOKUP($A$20,Finales!$A$6:$N$10,8,FALSE)","v":{"$error":"#N/A"}},{"$f":"VLOOKUP($A$20,Finales!$A$6:$N$10,9,FALSE)","v":{"$error":"#N/A"}},{"$f":"VLOOKUP($A$20,Finales!$A$6:$N$10,10,FALSE)","v":{"$error":"#N/A"}},{"$f":"VLOOKUP($A$20,Finales!$A$6:$N$10,11,FALSE)","v":{"$error":"#N/A"}},{"$f":"VLOOKUP($A$20,Finales!$A$6:$N$10,12,FALSE)","v":{"$error":"#N/A"}},{"$f":"VLOOKUP($A$20,Finales!$A$6:$N$10,13,FALSE)","v":{"$error":"#N/A"}},{"$f":"VLOOKUP($A$20,Finales!$A$6:$N$10,14,FALSE)","v":{"$error":"#N/A"}}]

{"sheet":"FGROEP-2","index":8,"n_rows":20,"n_cols":13,"rows_kept":20,"cut":false,"hidden":false,"merged":[[16,1,16,4],[17,1,17,4],[18,1,18,4],[19,1,19,4],[8,0,8,1],[9,0,9,1],[10,0,10,1],[11,0,11,1],[14,1,14,4],[15,1,15,4],[7,0,7,1],[0,0,0,11],[0,12,0,13],[1,0,1,1],[1,2,1,4],[1,5,1,7],[1,9,1,11],[2,0,2,1],[3,0,3,1],[4,0,4,1],[5,0,5,1],[6,0,6,1]]}
["Finale ronde\nBeste nummers 2",null,null,null,null,null,null,null,null,null,null,null,"SCORES BY:\nOnlineExcelCursus.NL"]
[{"$f":"Finales!AC12","v":"Tijd"},null,{"$f":"Finales!AF12","v":"VELD 2"},null,null,{"$f":"Finales!AT12","v":"Uitslag"},null,null,null,{"$f":"Finales!AX12","v":"Punten"}]
[{"$f":"Finales!AC13","v":"09:00:00"},{"$f":"Voorrondes!AD13","v":"00:00:00"},{"$f":"Finales!AF13","v":"PA TEAM 3"},{"$f":"Finales!AL13","v":"--"},{"$f":"Finales!AM13","v":"PB TEAM 4"},{"$f":"Finales!AT13","v":0},{"$f":"Finales!AU13","v":"--"},{"$f":"Finales!AV13","v":0},null,{"$f":"Finales!AX13","v":""},null,{"$f":"Finales!AZ13","v":""}]
[{"$f":"Finales!AC14","v":"09:20:00"},{"$f":"Voorrondes!AD14","v":"00:00:00"},{"$f":"Finales!AF14","v":"PC TEAM 1"},{"$f":"Finales!AL14","v":"--"},{"$f":"Finales!AM14","v":"PD TEAM 5"},{"$f":"Finales!AT14","v":0},{"$f":"Finales!AU14","v":"--"},{"$f":"Finales!AV14","v":0},null,{"$f":"Finales!AX14","v":""},null,{"$f":"Finales!AZ14","v":""}]
[{"$f":"Finales!AC15","v":"09:40:00"},{"$f":"Voorrondes!AD15","v":"00:00:00"},{"$f":"Finales!AF15","v":"PE TEAM 3"},{"$f":"Finales!AL15","v":"--"},{"$f":"Finales!AM15","v":"PA TEAM 3"},{"$f":"Finales!AT15","v":0},{"$f":"Finales!AU15","v":"--"},{"$f":"Finales!AV15","v":0},null,{"$f":"Finales!AX15","v":""},null,{"$f":"Finales!AZ15","v":""}]
[{"$f":"Finales!AC16","v":"10:00:00"},{"$f":"Voorrondes!AD16","v":"00:00:00"},{"$f":"Finales!AF16","v":"PB TEAM 4"},{"$f":"Finales!AL16","v":"--"},{"$f":"Finales!AM16","v":"PC TEAM 1"},{"$f":"Finales!AT16","v":0},{"$f":"Finales!AU16","v":"--"},{"$f":"Finales!AV16","v":0},null,{"$f":"Finales!AX16","v":""},null,{"$f":"Finales!AZ16","v":""}]
[{"$f":"Finales!AC17","v":"10:20:00"},{"$f":"Voorrondes!AD17","v":"00:00:00"},{"$f":"Finales!AF17","v":"PE TEAM 3"},{"$f":"Finales!AL17","v":"--"},{"$f":"Finales!AM17","v":"PD TEAM 5"},{"$f":"Finales!AT17","v":0},{"$f":"Finales!AU17","v":"--"},{"$f":"Finales!AV17","v":0},null,{"$f":"Finales!AX17","v":""},null,{"$f":"Finales!AZ17","v":""}]
[{"$f":"Finales!AC18","v":"10:40:00"},{"$f":"Voorrondes!AD18","v":"00:00:00"},{"$f":"Finales!AF18","v":"PA TEAM 3"},{"$f":"Finales!AL18","v":"--"},{"$f":"Finales!AM18","v":"PC TEAM 1"},{"$f":"Finales!AT18","v":0},{"$f":"Finales!AU18","v":"--"},{"$f":"Finales!AV18","v":0},null,{"$f":"Finales!AX18","v":""},null,{"$f":"Finales!AZ18","v":""}]
[{"$f":"Finales!AC19","v":"11:00:00"},{"$f":"Voorrondes!AD19","v":"00:00:00"},{"$f":"Finales!AF19","v":"PB TEAM 4"},{"$f":"Finales!AL19","v":"--"},{"$f":"Finales!AM19","v":"PE TEAM 3"},{"$f":"Finales!AT19","v":0},{"$f":"Finales!AU19","v":"--"},{"$f":"Finales!AV19","v":0},null,{"$f":"Finales!AX19","v":""},null,{"$f":"Finales!AZ19","v":""}]
[{"$f":"Finales!AC20","v":"11:20:00"},{"$f":"Voorrondes!AD20","v":"00:00:00"},{"$f":"Finales!AF20","v":"PD TEAM 5"},{"$f":"Finales!AL20","v":"--"},{"$f":"Finales!AM20","v":"PA TEAM 3"},{"$f":"Finales!AT20","v":0},{"$f":"Finales!AU20","v":"--"},{"$f":"Finales!AV20","v":0},null,{"$f":"Finales!AX20","v":""},null,{"$f":"Finales!AZ20","v":""}]
[{"$f":"Finales!AC21","v":"11:40:00"},{"$f":"Voorrondes!AD21","v":"00:00:00"},{"$f":"Finales!AF21","v":"PC TEAM 1"},{"$f":"Finales!AL21","v":"--"},{"$f":"Finales!AM21","v":"PE TEAM 3"},{"$f":"Finales!AT21","v":0},{"$f":"Finales!AU21","v":"--"},{"$f":"Finales!AV21","v":0},null,{"$f":"Finales!AX21","v":""},null,{"$f":"Finales!AZ21","v":""}]
[{"$f":"Finales!AC22","v":"12:00:00"},{"$f":"Voorrondes!AD22","v":"00:00:00"},{"$f":"Finales!AF22","v":"PD TEAM 5"},{"$f":"Finales!AL22","v":"--"},{"$f":"Finales!AM22","v":"PB TEAM 4"},{"$f":"Finales!AT22","v":0},{"$f":"Finales!AU22","v":"--"},{"$f":"Finales!AV22","v":0},null,{"$f":"Finales!AX22","v":""},null,{"$f":"Finales!AZ22","v":""}]
[]
[]
["Stand",{"$f":"Finales!P5","v":"Poule B"},null,null,null,"Voor","Tegen","Punten",{"$f":"Finales!Z3","v":"Gewonnen"},{"$f":"Finales!AA3","v":"Gelijk"},{"$f":"Finales!AB3","v":"Verloren"},{"$f":"Finales!AC3","v":"Saldo"}]
[1,{"$f":"VLOOKUP(A16,Finales!$O$6:$AC$10,2,FALSE)","v":"PA TEAM 3"},null,null,null,{"$f":"VLOOKUP($A16,Finales!$O$6:$AC$10,9,FALSE)","v":0},{"$f":"VLOOKUP($A16,Finales!$O$6:$AC$10,10,FALSE)","v":0},{"$f":"VLOOKUP($A16,Finales!$O$6:$AC$10,11,FALSE)","v":0},{"$f":"VLOOKUP($A16,Finales!$O$6:$AC$10,12,FALSE)","v":0},{"$f":"VLOOKUP($A16,Finales!$O$6:$AC$10,13,FALSE)","v":0},{"$f":"VLOOKUP($A16,Finales!$O$6:$AC$10,14,FALSE)","v":0},{"$f":"VLOOKUP($A16,Finales!$O$6:$AC$10,15,FALSE)","v":0}]
[2,{"$f":"VLOOKUP(A17,Finales!$O$6:$AC$10,2,FALSE)","v":{"$error":"#N/A"}},null,null,null,{"$f":"VLOOKUP($A17,Finales!$O$6:$AC$10,9,FALSE)","v":{"$error":"#N/A"}},{"$f":"VLOOKUP($A17,Finales!$O$6:$AC$10,10,FALSE)","v":{"$error":"#N/A"}},{"$f":"VLOOKUP($A17,Finales!$O$6:$AC$10,11,FALSE)","v":{"$error":"#N/A"}},{"$f":"VLOOKUP($A17,Finales!$O$6:$AC$10,12,FALSE)","v":{"$error":"#N/A"}},{"$f":"VLOOKUP($A17,Finales!$O$6:$AC$10,13,FALSE)","v":{"$error":"#N/A"}},{"$f":"VLOOKUP($A17,Finales!$O$6:$AC$10,14,FALSE)","v":{"$error":"#N/A"}},{"$f":"VLOOKUP($A17,Finales!$O$6:$AC$10,15,FALSE)","v":{"$error":"#N/A"}}]
[3,{"$f":"VLOOKUP(A18,Finales!$O$6:$AC$10,2,FALSE)","v":{"$error":"#N/A"}},null,null,null,{"$f":"VLOOKUP($A18,Finales!$O$6:$AC$10,9,FALSE)","v":{"$error":"#N/A"}},{"$f":"VLOOKUP($A18,Finales!$O$6:$AC$10,10,FALSE)","v":{"$error":"#N/A"}},{"$f":"VLOOKUP($A18,Finales!$O$6:$AC$10,11,FALSE)","v":{"$error":"#N/A"}},{"$f":"VLOOKUP($A18,Finales!$O$6:$AC$10,12,FALSE)","v":{"$error":"#N/A"}},{"$f":"VLOOKUP($A18,Finales!$O$6:$AC$10,13,FALSE)","v":{"$error":"#N/A"}},{"$f":"VLOOKUP($A18,Finales!$O$6:$AC$10,14,FALSE)","v":{"$error":"#N/A"}},{"$f":"VLOOKUP($A18,Finales!$O$6:$AC$10,15,FALSE)","v":{"$error":"#N/A"}}]
[4,{"$f":"VLOOKUP(A19,Finales!$O$6:$AC$10,2,FALSE)","v":{"$error":"#N/A"}},null,null,null,{"$f":"VLOOKUP($A19,Finales!$O$6:$AC$10,9,FALSE)","v":{"$error":"#N/A"}},{"$f":"VLOOKUP($A19,Finales!$O$6:$AC$10,10,FALSE)","v":{"$error":"#N/A"}},{"$f":"VLOOKUP($A19,Finales!$O$6:$AC$10,11,FALSE)","v":{"$error":"#N/A"}},{"$f":"VLOOKUP($A19,Finales!$O$6:$AC$10,12,FALSE)","v":{"$error":"#N/A"}},{"$f":"VLOOKUP($A19,Finales!$O$6:$AC$10,13,FALSE)","v":{"$error":"#N/A"}},{"$f":"VLOOKUP($A19,Finales!$O$6:$AC$10,14,FALSE)","v":{"$error":"#N/A"}},{"$f":"VLOOKUP($A19,Finales!$O$6:$AC$10,15,FALSE)","v":{"$error":"#N/A"}}]
[5,{"$f":"VLOOKUP(A20,Finales!$O$6:$AC$10,2,FALSE)","v":{"$error":"#N/A"}},null,null,null,{"$f":"VLOOKUP($A20,Finales!$O$6:$AC$10,9,FALSE)","v":{"$error":"#N/A"}},{"$f":"VLOOKUP($A20,Finales!$O$6:$AC$10,10,FALSE)","v":{"$error":"#N/A"}},{"$f":"VLOOKUP($A20,Finales!$O$6:$AC$10,11,FALSE)","v":{"$error":"#N/A"}},{"$f":"VLOOKUP($A20,Finales!$O$6:$AC$10,12,FALSE)","v":{"$error":"#N/A"}},{"$f":"VLOOKUP($A20,Finales!$O$6:$AC$10,13,FALSE)","v":{"$error":"#N/A"}},{"$f":"VLOOKUP($A20,Finales!$O$6:$AC$10,14,FALSE)","v":{"$error":"#N/A"}},{"$f":"VLOOKUP($A20,Finales!$O$6:$AC$10,15,FALSE)","v":{"$error":"#N/A"}}]

{"sheet":"FGROEP-3","index":9,"n_rows":20,"n_cols":13,"rows_kept":20,"cut":false,"hidden":false,"merged":[[16,1,16,4],[17,1,17,4],[18,1,18,4],[19,1,19,4],[8,0,8,1],[9,0,9,1],[10,0,10,1],[11,0,11,1],[14,1,14,4],[15,1,15,4],[7,0,7,1],[0,0,0,11],[0,12,0,13],[1,0,1,1],[1,2,1,4],[1,5,1,7],[1,9,1,11],[2,0,2,1],[3,0,3,1],[4,0,4,1],[5,0,5,1],[6,0,6,1]]}
["Finale ronde\nBeste nummers 3",null,null,null,null,null,null,null,null,null,null,null,"SCORES BY:\nOnlineExcelCursus.NL"]
[{"$f":"Finales!D24","v":"Tijd"},{"$f":"Voorrondes!E24","v":0},{"$f":"Finales!G24","v":"VELD 3"},null,null,{"$f":"Finales!U24","v":"Uitslag"},{"$f":"Voorrondes!V24","v":0},{"$f":"Voorrondes!W24","v":0},null,{"$f":"Finales!Y24","v":"Punten"}]
[{"$f":"Finales!D25","v":"09:00:00"},{"$f":"Voorrondes!E25","v":"00:00:00"},{"$f":"Finales!G25","v":"PA TEAM 1"},{"$f":"Finales!M25","v":"--"},{"$f":"Finales!N25","v":"PB TEAM 1"},{"$f":"Finales!U25","v":0},{"$f":"Finales!V25","v":"--"},{"$f":"Finales!W25","v":0},null,{"$f":"Finales!Y25","v":""},null,{"$f":"Finales!AA25","v":""}]
[{"$f":"Finales!D26","v":"09:20:00"},{"$f":"Voorrondes!E26","v":"00:00:00"},{"$f":"Finales!G26","v":"PC TEAM 3"},{"$f":"Finales!M26","v":"--"},{"$f":"Finales!N26","v":"PD TEAM 4"},{"$f":"Finales!U26","v":0},{"$f":"Finales!V26","v":"--"},{"$f":"Finales!W26","v":0},null,{"$f":"Finales!Y26","v":""},null,{"$f":"Finales!AA26","v":""}]
[{"$f":"Finales!D27","v":"09:40:00"},{"$f":"Voorrondes!E27","v":"00:00:00"},{"$f":"Finales!G27","v":"PE TEAM 5"},{"$f":"Finales!M27","v":"--"},{"$f":"Finales!N27","v":"PA TEAM 1"},{"$f":"Finales!U27","v":0},{"$f":"Finales!V27","v":"--"},{"$f":"Finales!W27","v":0},null,{"$f":"Finales!Y27","v":""},null,{"$f":"Finales!AA27","v":""}]
[{"$f":"Finales!D28","v":"10:00:00"},{"$f":"Voorrondes!E28","v":"00:00:00"},{"$f":"Finales!G28","v":"PB TEAM 1"},{"$f":"Finales!M28","v":"--"},{"$f":"Finales!N28","v":"PC TEAM 3"},{"$f":"Finales!U28","v":0},{"$f":"Finales!V28","v":"--"},{"$f":"Finales!W28","v":0},null,{"$f":"Finales!Y28","v":""},null,{"$f":"Finales!AA28","v":""}]
[{"$f":"Finales!D29","v":"10:20:00"},{"$f":"Voorrondes!E29","v":"00:00:00"},{"$f":"Finales!G29","v":"PE TEAM 5"},{"$f":"Finales!M29","v":"--"},{"$f":"Finales!N29","v":"PD TEAM 4"},{"$f":"Finales!U29","v":0},{"$f":"Finales!V29","v":"--"},{"$f":"Finales!W29","v":0},null,{"$f":"Finales!Y29","v":""},null,{"$f":"Finales!AA29","v":""}]
[{"$f":"Finales!D30","v":"10:40:00"},{"$f":"Voorrondes!E30","v":"00:00:00"},{"$f":"Finales!G30","v":"PA TEAM 1"},{"$f":"Finales!M30","v":"--"},{"$f":"Finales!N30","v":"PC TEAM 3"},{"$f":"Finales!U30","v":0},{"$f":"Finales!V30","v":"--"},{"$f":"Finales!W30","v":0},null,{"$f":"Finales!Y30","v":""},null,{"$f":"Finales!AA30","v":""}]
[{"$f":"Finales!D31","v":"11:00:00"},{"$f":"Voorrondes!E31","v":"00:00:00"},{"$f":"Finales!G31","v":"PB TEAM 1"},{"$f":"Finales!M31","v":"--"},{"$f":"Finales!N31","v":"PE TEAM 5"},{"$f":"Finales!U31","v":0},{"$f":"Finales!V31","v":"--"},{"$f":"Finales!W31","v":0},null,{"$f":"Finales!Y31","v":""},null,{"$f":"Finales!AA31","v":""}]
[{"$f":"Finales!D32","v":"11:20:00"},{"$f":"Voorrondes!E32","v":"00:00:00"},{"$f":"Finales!G32","v":"PD TEAM 4"},{"$f":"Finales!M32","v":"--"},{"$f":"Finales!N32","v":"PA TEAM 1"},{"$f":"Finales!U32","v":0},{"$f":"Finales!V32","v":"--"},{"$f":"Finales!W32","v":0},null,{"$f":"Finales!Y32","v":""},null,{"$f":"Finales!AA32","v":""}]
[{"$f":"Finales!D33","v":"11:40:00"},{"$f":"Voorrondes!E33","v":"00:00:00"},{"$f":"Finales!G33","v":"PC TEAM 3"},{"$f":"Finales!M33","v":"--"},{"$f":"Finales!N33","v":"PE TEAM 5"},{"$f":"Finales!U33","v":0},{"$f":"Finales!V33","v":"--"},{"$f":"Finales!W33","v":0},null,{"$f":"Finales!Y33","v":""},null,{"$f":"Finales!AA33","v":""}]
[{"$f":"Finales!D34","v":"12:00:00"},{"$f":"Voorrondes!E34","v":"00:00:00"},{"$f":"Finales!G34","v":"PD TEAM 4"},{"$f":"Finales!M34","v":"--"},{"$f":"Finales!N34","v":"PB TEAM 1"},{"$f":"Finales!U34","v":0},{"$f":"Finales!V34","v":"--"},{"$f":"Finales!W34","v":0},null,{"$f":"Finales!Y34","v":""},null,{"$f":"Finales!AA34","v":""}]
[]
[]
[{"$f":"Finales!AD3","v":"Stand"},{"$f":"Finales!AE5","v":"Poule C"},null,null,null,"Voor","Tegen","Punten",{"$f":"Finales!AN3","v":"Gewonnen"},{"$f":"Finales!AO3","v":"Gelijk"},{"$f":"Finales!AP3","v":"Verloren"},{"$f":"Finales!AQ3","v":"Saldo"}]
[1,{"$f":"VLOOKUP(A16,Finales!$AD$6:$AQ$10,2,FALSE)","v":"PA TEAM 1"},null,null,null,{"$f":"VLOOKUP($A16,Finales!$AD$6:$AQ$10,8,FALSE)","v":0},{"$f":"VLOOKUP($A16,Finales!$AD$6:$AQ$10,9,FALSE)","v":0},{"$f":"VLOOKUP($A16,Finales!$AD$6:$AQ$10,10,FALSE)","v":0},{"$f":"VLOOKUP($A16,Finales!$AD$6:$AQ$10,11,FALSE)","v":0},{"$f":"VLOOKUP($A16,Finales!$AD$6:$AQ$10,12,FALSE)","v":0},{"$f":"VLOOKUP($A16,Finales!$AD$6:$AQ$10,13,FALSE)","v":0},{"$f":"VLOOKUP($A16,Finales!$AD$6:$AQ$10,14,FALSE)","v":0}]
[2,{"$f":"VLOOKUP(A17,Finales!$AD$6:$AQ$10,2,FALSE)","v":{"$error":"#N/A"}},null,null,null,{"$f":"VLOOKUP($A17,Finales!$AD$6:$AQ$10,8,FALSE)","v":{"$error":"#N/A"}},{"$f":"VLOOKUP($A17,Finales!$AD$6:$AQ$10,9,FALSE)","v":{"$error":"#N/A"}},{"$f":"VLOOKUP($A17,Finales!$AD$6:$AQ$10,10,FALSE)","v":{"$error":"#N/A"}},{"$f":"VLOOKUP($A17,Finales!$AD$6:$AQ$10,11,FALSE)","v":{"$error":"#N/A"}},{"$f":"VLOOKUP($A17,Finales!$AD$6:$AQ$10,12,FALSE)","v":{"$error":"#N/A"}},{"$f":"VLOOKUP($A17,Finales!$AD$6:$AQ$10,13,FALSE)","v":{"$error":"#N/A"}},{"$f":"VLOOKUP($A17,Finales!$AD$6:$AQ$10,14,FALSE)","v":{"$error":"#N/A"}}]
[3,{"$f":"VLOOKUP(A18,Finales!$AD$6:$AQ$10,2,FALSE)","v":{"$error":"#N/A"}},null,null,null,{"$f":"VLOOKUP($A18,Finales!$AD$6:$AQ$10,8,FALSE)","v":{"$error":"#N/A"}},{"$f":"VLOOKUP($A18,Finales!$AD$6:$AQ$10,9,FALSE)","v":{"$error":"#N/A"}},{"$f":"VLOOKUP($A18,Finales!$AD$6:$AQ$10,10,FALSE)","v":{"$error":"#N/A"}},{"$f":"VLOOKUP($A18,Finales!$AD$6:$AQ$10,11,FALSE)","v":{"$error":"#N/A"}},{"$f":"VLOOKUP($A18,Finales!$AD$6:$AQ$10,12,FALSE)","v":{"$error":"#N/A"}},{"$f":"VLOOKUP($A18,Finales!$AD$6:$AQ$10,13,FALSE)","v":{"$error":"#N/A"}},{"$f":"VLOOKUP($A18,Finales!$AD$6:$AQ$10,14,FALSE)","v":{"$error":"#N/A"}}]
[4,{"$f":"VLOOKUP(A19,Finales!$AD$6:$AQ$10,2,FALSE)","v":{"$error":"#N/A"}},null,null,null,{"$f":"VLOOKUP($A19,Finales!$AD$6:$AQ$10,8,FALSE)","v":{"$error":"#N/A"}},{"$f":"VLOOKUP($A19,Finales!$AD$6:$AQ$10,9,FALSE)","v":{"$error":"#N/A"}},{"$f":"VLOOKUP($A19,Finales!$AD$6:$AQ$10,10,FALSE)","v":{"$error":"#N/A"}},{"$f":"VLOOKUP($A19,Finales!$AD$6:$AQ$10,11,FALSE)","v":{"$error":"#N/A"}},{"$f":"VLOOKUP($A19,Finales!$AD$6:$AQ$10,12,FALSE)","v":{"$error":"#N/A"}},{"$f":"VLOOKUP($A19,Finales!$AD$6:$AQ$10,13,FALSE)","v":{"$error":"#N/A"}},{"$f":"VLOOKUP($A19,Finales!$AD$6:$AQ$10,14,FALSE)","v":{"$error":"#N/A"}}]
[5,{"$f":"VLOOKUP(A20,Finales!$AD$6:$AQ$10,2,FALSE)","v":{"$error":"#N/A"}},null,null,null,{"$f":"VLOOKUP($A20,Finales!$AD$6:$AQ$10,8,FALSE)","v":{"$error":"#N/A"}},{"$f":"VLOOKUP($A20,Finales!$AD$6:$AQ$10,9,FALSE)","v":{"$error":"#N/A"}},{"$f":"VLOOKUP($A20,Finales!$AD$6:$AQ$10,10,FALSE)","v":{"$error":"#N/A"}},{"$f":"VLOOKUP($A20,Finales!$AD$6:$AQ$10,11,FALSE)","v":{"$error":"#N/A"}},{"$f":"VLOOKUP($A20,Finales!$AD$6:$AQ$10,12,FALSE)","v":{"$error":"#N/A"}},{"$f":"VLOOKUP($A20,Finales!$AD$6:$AQ$10,13,FALSE)","v":{"$error":"#N/A"}},{"$f":"VLOOKUP($A20,Finales!$AD$6:$AQ$10,14,FALSE)","v":{"$error":"#N/A"}}]

{"sheet":"FGROEP-4","index":10,"n_rows":20,"n_cols":13,"rows_kept":20,"cut":false,"hidden":false,"merged":[[17,1,17,4],[18,1,18,4],[14,1,14,4],[1,2,1,4],[19,1,19,4],[11,0,11,1],[9,0,9,1],[10,0,10,1],[7,0,7,1],[8,0,8,1],[2,0,2,1],[5,0,5,1],[6,0,6,1],[3,0,3,1],[4,0,4,1],[0,12,0,13],[15,1,15,4],[16,1,16,4],[0,0,0,11],[1,5,1,7],[1,9,1,11],[1,0,1,1]]}
["Finale ronde\nBeste nummers 4",null,null,null,null,null,null,null,null,null,null,null,"SCORES BY:\nOnlineExcelCursus.NL"]
[{"$f":"Finales!AC24","v":"Tijd"},{"$f":"Voorrondes!AD24","v":0},{"$f":"Finales!AF24","v":"VELD 4"},null,null,{"$f":"Finales!AT24","v":"Uitslag"},{"$f":"Voorrondes!AU24","v":0},{"$f":"Voorrondes!AV24","v":0},null,{"$f":"Finales!AX24","v":"Punten"},{"$f":"Voorrondes!AY24","v":0},{"$f":"Voorrondes!AZ24","v":0}]
[{"$f":"Finales!AC25","v":"09:00:00"},{"$f":"Voorrondes!AD25","v":"00:00:00"},{"$f":"Finales!AF25","v":"PA TEAM 5"},{"$f":"Finales!AL25","v":"--"},{"$f":"Finales!AM25","v":"PB TEAM 3"},{"$f":"Finales!AT25","v":0},{"$f":"Finales!AU25","v":"--"},{"$f":"Finales!AV25","v":0},null,{"$f":"Finales!AX25","v":""},null,{"$f":"Finales!AZ25","v":""}]
[{"$f":"Finales!AC26","v":"09:20:00"},{"$f":"Voorrondes!AD26","v":"00:00:00"},{"$f":"Finales!AF26","v":"PC TEAM 2"},{"$f":"Finales!AL26","v":"--"},{"$f":"Finales!AM26","v":"PD TEAM 1"},{"$f":"Finales!AT26","v":0},{"$f":"Finales!AU26","v":"--"},{"$f":"Finales!AV26","v":0},null,{"$f":"Finales!AX26","v":""},null,{"$f":"Finales!AZ26","v":""}]
[{"$f":"Finales!AC27","v":"09:40:00"},{"$f":"Voorrondes!AD27","v":"00:00:00"},{"$f":"Finales!AF27","v":"PE TEAM 2"},{"$f":"Finales!AL27","v":"--"},{"$f":"Finales!AM27","v":"PA TEAM 5"},{"$f":"Finales!AT27","v":0},{"$f":"Finales!AU27","v":"--"},{"$f":"Finales!AV27","v":0},null,{"$f":"Finales!AX27","v":""},null,{"$f":"Finales!AZ27","v":""}]
[{"$f":"Finales!AC28","v":"10:00:00"},{"$f":"Voorrondes!AD28","v":"00:00:00"},{"$f":"Finales!AF28","v":"PB TEAM 3"},{"$f":"Finales!AL28","v":"--"},{"$f":"Finales!AM28","v":"PC TEAM 2"},{"$f":"Finales!AT28","v":0},{"$f":"Finales!AU28","v":"--"},{"$f":"Finales!AV28","v":0},null,{"$f":"Finales!AX28","v":""},null,{"$f":"Finales!AZ28","v":""}]
[{"$f":"Finales!AC29","v":"10:20:00"},{"$f":"Voorrondes!AD29","v":"00:00:00"},{"$f":"Finales!AF29","v":"PE TEAM 2"},{"$f":"Finales!AL29","v":"--"},{"$f":"Finales!AM29","v":"PD TEAM 1"},{"$f":"Finales!AT29","v":0},{"$f":"Finales!AU29","v":"--"},{"$f":"Finales!AV29","v":0},null,{"$f":"Finales!AX29","v":""},null,{"$f":"Finales!AZ29","v":""}]
[{"$f":"Finales!AC30","v":"10:40:00"},{"$f":"Voorrondes!AD30","v":"00:00:00"},{"$f":"Finales!AF30","v":"PA TEAM 5"},{"$f":"Finales!AL30","v":"--"},{"$f":"Finales!AM30","v":"PC TEAM 2"},{"$f":"Finales!AT30","v":0},{"$f":"Finales!AU30","v":"--"},{"$f":"Finales!AV30","v":0},null,{"$f":"Finales!AX30","v":""},null,{"$f":"Finales!AZ30","v":""}]
[{"$f":"Finales!AC31","v":"11:00:00"},{"$f":"Voorrondes!AD31","v":"00:00:00"},{"$f":"Finales!AF31","v":"PB TEAM 3"},{"$f":"Finales!AL31","v":"--"},{"$f":"Finales!AM31","v":"PE TEAM 2"},{"$f":"Finales!AT31","v":0},{"$f":"Finales!AU31","v":"--"},{"$f":"Finales!AV31","v":0},null,{"$f":"Finales!AX31","v":""},null,{"$f":"Finales!AZ31","v":""}]
[{"$f":"Finales!AC32","v":"11:20:00"},{"$f":"Voorrondes!AD32","v":"00:00:00"},{"$f":"Finales!AF32","v":"PD TEAM 1"},{"$f":"Finales!AL32","v":"--"},{"$f":"Finales!AM32","v":"PA TEAM 5"},{"$f":"Finales!AT32","v":0},{"$f":"Finales!AU32","v":"--"},{"$f":"Finales!AV32","v":0},null,{"$f":"Finales!AX32","v":""},null,{"$f":"Finales!AZ32","v":""}]
[{"$f":"Finales!AC33","v":"11:40:00"},{"$f":"Voorrondes!AD33","v":"00:00:00"},{"$f":"Finales!AF33","v":"PC TEAM 2"},{"$f":"Finales!AL33","v":"--"},{"$f":"Finales!AM33","v":"PE TEAM 2"},{"$f":"Finales!AT33","v":0},{"$f":"Finales!AU33","v":"--"},{"$f":"Finales!AV33","v":0},null,{"$f":"Finales!AX33","v":""},null,{"$f":"Finales!AZ33","v":""}]
[{"$f":"Finales!AC34","v":"12:00:00"},{"$f":"Voorrondes!AD34","v":"00:00:00"},{"$f":"Finales!AF34","v":"PD TEAM 1"},{"$f":"Finales!AL34","v":"--"},{"$f":"Finales!AM34","v":"PB TEAM 3"},{"$f":"Finales!AT34","v":0},{"$f":"Finales!AU34","v":"--"},{"$f":"Finales!AV34","v":0},null,{"$f":"Finales!AX34","v":""},null,{"$f":"Finales!AZ34","v":""}]
[]
[]
[{"$f":"Finales!AR3","v":"Stand"},{"$f":"Finales!AS5","v":"Poule D"},null,null,null,"Voor","Tegen","Punten",{"$f":"Finales!BB3","v":"Gewonnen"},{"$f":"Finales!BC3","v":"Gelijk"},{"$f":"Finales!BD3","v":"Verloren"},{"$f":"Finales!BE3","v":"Saldo"}]
[1,{"$f":"VLOOKUP(A16,Finales!$AR$6:$BE$10,2,FALSE)","v":"PA TEAM 5"},null,null,null,{"$f":"VLOOKUP($A16,Finales!$AR$6:$BE$10,8,FALSE)","v":0},{"$f":"VLOOKUP($A16,Finales!$AR$6:$BE$10,9,FALSE)","v":0},{"$f":"VLOOKUP($A16,Finales!$AR$6:$BE$10,10,FALSE)","v":0},{"$f":"VLOOKUP($A16,Finales!$AR$6:$BE$10,11,FALSE)","v":0},{"$f":"VLOOKUP($A16,Finales!$AR$6:$BE$10,12,FALSE)","v":0},{"$f":"VLOOKUP($A16,Finales!$AR$6:$BE$10,13,FALSE)","v":0},{"$f":"VLOOKUP($A16,Finales!$AR$6:$BE$10,14,FALSE)","v":0}]
[2,{"$f":"VLOOKUP(A17,Finales!$AR$6:$BE$10,2,FALSE)","v":{"$error":"#N/A"}},null,null,null,{"$f":"VLOOKUP($A17,Finales!$AR$6:$BE$10,8,FALSE)","v":{"$error":"#N/A"}},{"$f":"VLOOKUP($A17,Finales!$AR$6:$BE$10,9,FALSE)","v":{"$error":"#N/A"}},{"$f":"VLOOKUP($A17,Finales!$AR$6:$BE$10,10,FALSE)","v":{"$error":"#N/A"}},{"$f":"VLOOKUP($A17,Finales!$AR$6:$BE$10,11,FALSE)","v":{"$error":"#N/A"}},{"$f":"VLOOKUP($A17,Finales!$AR$6:$BE$10,12,FALSE)","v":{"$error":"#N/A"}},{"$f":"VLOOKUP($A17,Finales!$AR$6:$BE$10,13,FALSE)","v":{"$error":"#N/A"}},{"$f":"VLOOKUP($A17,Finales!$AR$6:$BE$10,14,FALSE)","v":{"$error":"#N/A"}}]
[3,{"$f":"VLOOKUP(A18,Finales!$AR$6:$BE$10,2,FALSE)","v":{"$error":"#N/A"}},null,null,null,{"$f":"VLOOKUP($A18,Finales!$AR$6:$BE$10,8,FALSE)","v":{"$error":"#N/A"}},{"$f":"VLOOKUP($A18,Finales!$AR$6:$BE$10,9,FALSE)","v":{"$error":"#N/A"}},{"$f":"VLOOKUP($A18,Finales!$AR$6:$BE$10,10,FALSE)","v":{"$error":"#N/A"}},{"$f":"VLOOKUP($A18,Finales!$AR$6:$BE$10,11,FALSE)","v":{"$error":"#N/A"}},{"$f":"VLOOKUP($A18,Finales!$AR$6:$BE$10,12,FALSE)","v":{"$error":"#N/A"}},{"$f":"VLOOKUP($A18,Finales!$AR$6:$BE$10,13,FALSE)","v":{"$error":"#N/A"}},{"$f":"VLOOKUP($A18,Finales!$AR$6:$BE$10,14,FALSE)","v":{"$error":"#N/A"}}]
[4,{"$f":"VLOOKUP(A19,Finales!$AR$6:$BE$10,2,FALSE)","v":{"$error":"#N/A"}},null,null,null,{"$f":"VLOOKUP($A19,Finales!$AR$6:$BE$10,8,FALSE)","v":{"$error":"#N/A"}},{"$f":"VLOOKUP($A19,Finales!$AR$6:$BE$10,9,FALSE)","v":{"$error":"#N/A"}},{"$f":"VLOOKUP($A19,Finales!$AR$6:$BE$10,10,FALSE)","v":{"$error":"#N/A"}},{"$f":"VLOOKUP($A19,Finales!$AR$6:$BE$10,11,FALSE)","v":{"$error":"#N/A"}},{"$f":"VLOOKUP($A19,Finales!$AR$6:$BE$10,12,FALSE)","v":{"$error":"#N/A"}},{"$f":"VLOOKUP($A19,Finales!$AR$6:$BE$10,13,FALSE)","v":{"$error":"#N/A"}},{"$f":"VLOOKUP($A19,Finales!$AR$6:$BE$10,14,FALSE)","v":{"$error":"#N/A"}}]
[5,{"$f":"VLOOKUP(A20,Finales!$AR$6:$BE$10,2,FALSE)","v":{"$error":"#N/A"}},null,null,null,{"$f":"VLOOKUP($A20,Finales!$AR$6:$BE$10,8,FALSE)","v":{"$error":"#N/A"}},{"$f":"VLOOKUP($A20,Finales!$AR$6:$BE$10,9,FALSE)","v":{"$error":"#N/A"}},{"$f":"VLOOKUP($A20,Finales!$AR$6:$BE$10,10,FALSE)","v":{"$error":"#N/A"}},{"$f":"VLOOKUP($A20,Finales!$AR$6:$BE$10,11,FALSE)","v":{"$error":"#N/A"}},{"$f":"VLOOKUP($A20,Finales!$AR$6:$BE$10,12,FALSE)","v":{"$error":"#N/A"}},{"$f":"VLOOKUP($A20,Finales!$AR$6:$BE$10,13,FALSE)","v":{"$error":"#N/A"}},{"$f":"VLOOKUP($A20,Finales!$AR$6:$BE$10,14,FALSE)","v":{"$error":"#N/A"}}]

{"sheet":"FGROEP-5","index":11,"n_rows":20,"n_cols":13,"rows_kept":20,"cut":false,"hidden":false,"merged":[[16,1,16,4],[17,1,17,4],[18,1,18,4],[19,1,19,4],[8,0,8,1],[9,0,9,1],[10,0,10,1],[11,0,11,1],[14,1,14,4],[15,1,15,4],[7,0,7,1],[0,0,0,11],[0,12,0,13],[1,0,1,1],[1,2,1,4],[1,5,1,7],[1,9,1,11],[2,0,2,1],[3,0,3,1],[4,0,4,1],[5,0,5,1],[6,0,6,1]]}
["Finale ronde\nBeste nummers 5",null,null,null,null,null,null,null,null,null,null,null,"SCORES BY:\nOnlineExcelCursus.NL"]
[{"$f":"Finales!AC24","v":"Tijd"},{"$f":"Voorrondes!AD24","v":0},{"$f":"Finales!AF24","v":"VELD 4"},null,null,{"$f":"Finales!AT24","v":"Uitslag"},{"$f":"Voorrondes!AU24","v":0},{"$f":"Voorrondes!AV24","v":0},null,{"$f":"Finales!AX24","v":"Punten"},{"$f":"Voorrondes!AY24","v":0},{"$f":"Voorrondes!AZ24","v":0}]
[{"$f":"Finales!D38","v":"09:00:00"},{"$f":"Voorrondes!AD25","v":"00:00:00"},{"$f":"Finales!G38","v":"PA TEAM 2"},{"$f":"Finales!AL25","v":"--"},{"$f":"Finales!N38","v":"PB TEAM 5"},{"$f":"Finales!U38","v":0},{"$f":"Finales!AU25","v":"--"},{"$f":"Finales!W38","v":0},null,{"$f":"Finales!Y38","v":""},null,{"$f":"Finales!AA38","v":""}]
[{"$f":"Finales!D39","v":"09:20:00"},{"$f":"Voorrondes!AD26","v":"00:00:00"},{"$f":"Finales!G39","v":"PC TEAM 4"},{"$f":"Finales!AL26","v":"--"},{"$f":"Finales!N39","v":"PD TEAM 2"},{"$f":"Finales!U39","v":0},{"$f":"Finales!AU26","v":"--"},{"$f":"Finales!W39","v":0},null,{"$f":"Finales!Y39","v":""},null,{"$f":"Finales!AA39","v":""}]
[{"$f":"Finales!D40","v":"09:40:00"},{"$f":"Voorrondes!AD27","v":"00:00:00"},{"$f":"Finales!G40","v":"PE TEAM 1"},{"$f":"Finales!AL27","v":"--"},{"$f":"Finales!N40","v":"PA TEAM 2"},{"$f":"Finales!U40","v":0},{"$f":"Finales!AU27","v":"--"},{"$f":"Finales!W40","v":0},null,{"$f":"Finales!Y40","v":""},null,{"$f":"Finales!AA40","v":""}]
[{"$f":"Finales!D41","v":"10:00:00"},{"$f":"Voorrondes!AD28","v":"00:00:00"},{"$f":"Finales!G41","v":"PB TEAM 5"},{"$f":"Finales!AL28","v":"--"},{"$f":"Finales!N41","v":"PC TEAM 4"},{"$f":"Finales!U41","v":0},{"$f":"Finales!AU28","v":"--"},{"$f":"Finales!W41","v":0},null,{"$f":"Finales!Y41","v":""},null,{"$f":"Finales!AA41","v":""}]
[{"$f":"Finales!D42","v":"10:20:00"},{"$f":"Voorrondes!AD29","v":"00:00:00"},{"$f":"Finales!G42","v":"PE TEAM 1"},{"$f":"Finales!AL29","v":"--"},{"$f":"Finales!N42","v":"PD TEAM 2"},{"$f":"Finales!U42","v":0},{"$f":"Finales!AU29","v":"--"},{"$f":"Finales!W42","v":0},null,{"$f":"Finales!Y42","v":""},null,{"$f":"Finales!AA42","v":""}]
[{"$f":"Finales!D43","v":"10:40:00"},{"$f":"Voorrondes!AD30","v":"00:00:00"},{"$f":"Finales!G43","v":"PA TEAM 2"},{"$f":"Finales!AL30","v":"--"},{"$f":"Finales!N43","v":"PC TEAM 4"},{"$f":"Finales!U43","v":0},{"$f":"Finales!AU30","v":"--"},{"$f":"Finales!W43","v":0},null,{"$f":"Finales!Y43","v":""},null,{"$f":"Finales!AA43","v":""}]
[{"$f":"Finales!D44","v":"11:00:00"},{"$f":"Voorrondes!AD31","v":"00:00:00"},{"$f":"Finales!G44","v":"PB TEAM 5"},{"$f":"Finales!AL31","v":"--"},{"$f":"Finales!N44","v":"PE TEAM 1"},{"$f":"Finales!U44","v":0},{"$f":"Finales!AU31","v":"--"},{"$f":"Finales!W44","v":0},null,{"$f":"Finales!Y44","v":""},null,{"$f":"Finales!AA44","v":""}]
[{"$f":"Finales!D45","v":"11:20:00"},{"$f":"Voorrondes!AD32","v":"00:00:00"},{"$f":"Finales!G45","v":"PD TEAM 2"},{"$f":"Finales!AL32","v":"--"},{"$f":"Finales!N45","v":"PA TEAM 2"},{"$f":"Finales!U45","v":0},{"$f":"Finales!AU32","v":"--"},{"$f":"Finales!W45","v":0},null,{"$f":"Finales!Y45","v":""},null,{"$f":"Finales!AA45","v":""}]
[{"$f":"Finales!D46","v":"11:40:00"},{"$f":"Voorrondes!AD33","v":"00:00:00"},{"$f":"Finales!G46","v":"PC TEAM 4"},{"$f":"Finales!AL33","v":"--"},{"$f":"Finales!N46","v":"PE TEAM 1"},{"$f":"Finales!U46","v":0},{"$f":"Finales!AU33","v":"--"},{"$f":"Finales!W46","v":0},null,{"$f":"Finales!Y46","v":""},null,{"$f":"Finales!AA46","v":""}]
[{"$f":"Finales!D47","v":"12:00:00"},{"$f":"Voorrondes!AD34","v":"00:00:00"},{"$f":"Finales!G47","v":"PD TEAM 2"},{"$f":"Finales!AL34","v":"--"},{"$f":"Finales!N47","v":"PB TEAM 5"},{"$f":"Finales!U47","v":0},{"$f":"Finales!AU34","v":"--"},{"$f":"Finales!W47","v":0},null,{"$f":"Finales!Y47","v":""},null,{"$f":"Finales!AA47","v":""}]
[]
[]
[{"$f":"Finales!AR3","v":"Stand"},{"$f":"Finales!BG5","v":"Poule E"},null,null,null,"Voor","Tegen","Punten",{"$f":"Finales!BB3","v":"Gewonnen"},{"$f":"Finales!BC3","v":"Gelijk"},{"$f":"Finales!BD3","v":"Verloren"},{"$f":"Finales!BE3","v":"Saldo"}]
[1,{"$f":"VLOOKUP(A16,Finales!$BF$6:$BS$10,2,FALSE)","v":"PA TEAM 2"},null,null,null,{"$f":"VLOOKUP($A16,Finales!$BF$6:$BS$10,8,FALSE)","v":0},{"$f":"VLOOKUP($A16,Finales!$BF$6:$BS$10,9,FALSE)","v":0},{"$f":"VLOOKUP($A16,Finales!$BF$6:$BS$10,10,FALSE)","v":0},{"$f":"VLOOKUP($A16,Finales!$BF$6:$BS$10,11,FALSE)","v":0},{"$f":"VLOOKUP($A16,Finales!$BF$6:$BS$10,12,FALSE)","v":0},{"$f":"VLOOKUP($A16,Finales!$BF$6:$BS$10,13,FALSE)","v":0},{"$f":"VLOOKUP($A16,Finales!$BF$6:$BS$10,14,FALSE)","v":0}]
[2,{"$f":"VLOOKUP(A17,Finales!$BF$6:$BS$10,2,FALSE)","v":{"$error":"#N/A"}},null,null,null,{"$f":"VLOOKUP($A17,Finales!$BF$6:$BS$10,8,FALSE)","v":{"$error":"#N/A"}},{"$f":"VLOOKUP($A17,Finales!$BF$6:$BS$10,9,FALSE)","v":{"$error":"#N/A"}},{"$f":"VLOOKUP($A17,Finales!$BF$6:$BS$10,10,FALSE)","v":{"$error":"#N/A"}},{"$f":"VLOOKUP($A17,Finales!$BF$6:$BS$10,11,FALSE)","v":{"$error":"#N/A"}},{"$f":"VLOOKUP($A17,Finales!$BF$6:$BS$10,12,FALSE)","v":{"$error":"#N/A"}},{"$f":"VLOOKUP($A17,Finales!$BF$6:$BS$10,13,FALSE)","v":{"$error":"#N/A"}},{"$f":"VLOOKUP($A17,Finales!$BF$6:$BS$10,14,FALSE)","v":{"$error":"#N/A"}}]
[3,{"$f":"VLOOKUP(A18,Finales!$BF$6:$BS$10,2,FALSE)","v":{"$error":"#N/A"}},null,null,null,{"$f":"VLOOKUP($A18,Finales!$BF$6:$BS$10,8,FALSE)","v":{"$error":"#N/A"}},{"$f":"VLOOKUP($A18,Finales!$BF$6:$BS$10,9,FALSE)","v":{"$error":"#N/A"}},{"$f":"VLOOKUP($A18,Finales!$BF$6:$BS$10,10,FALSE)","v":{"$error":"#N/A"}},{"$f":"VLOOKUP($A18,Finales!$BF$6:$BS$10,11,FALSE)","v":{"$error":"#N/A"}},{"$f":"VLOOKUP($A18,Finales!$BF$6:$BS$10,12,FALSE)","v":{"$error":"#N/A"}},{"$f":"VLOOKUP($A18,Finales!$BF$6:$BS$10,13,FALSE)","v":{"$error":"#N/A"}},{"$f":"VLOOKUP($A18,Finales!$BF$6:$BS$10,14,FALSE)","v":{"$error":"#N/A"}}]
[4,{"$f":"VLOOKUP(A19,Finales!$BF$6:$BS$10,2,FALSE)","v":{"$error":"#N/A"}},null,null,null,{"$f":"VLOOKUP($A19,Finales!$BF$6:$BS$10,8,FALSE)","v":{"$error":"#N/A"}},{"$f":"VLOOKUP($A19,Finales!$BF$6:$BS$10,9,FALSE)","v":{"$error":"#N/A"}},{"$f":"VLOOKUP($A19,Finales!$BF$6:$BS$10,10,FALSE)","v":{"$error":"#N/A"}},{"$f":"VLOOKUP($A19,Finales!$BF$6:$BS$10,11,FALSE)","v":{"$error":"#N/A"}},{"$f":"VLOOKUP($A19,Finales!$BF$6:$BS$10,12,FALSE)","v":{"$error":"#N/A"}},{"$f":"VLOOKUP($A19,Finales!$BF$6:$BS$10,13,FALSE)","v":{"$error":"#N/A"}},{"$f":"VLOOKUP($A19,Finales!$BF$6:$BS$10,14,FALSE)","v":{"$error":"#N/A"}}]
[5,{"$f":"VLOOKUP(A20,Finales!$BF$6:$BS$10,2,FALSE)","v":{"$error":"#N/A"}},null,null,null,{"$f":"VLOOKUP($A20,Finales!$BF$6:$BS$10,8,FALSE)","v":{"$error":"#N/A"}},{"$f":"VLOOKUP($A20,Finales!$BF$6:$BS$10,9,FALSE)","v":{"$error":"#N/A"}},{"$f":"VLOOKUP($A20,Finales!$BF$6:$BS$10,10,FALSE)","v":{"$error":"#N/A"}},{"$f":"VLOOKUP($A20,Finales!$BF$6:$BS$10,11,FALSE)","v":{"$error":"#N/A"}},{"$f":"VLOOKUP($A20,Finales!$BF$6:$BS$10,12,FALSE)","v":{"$error":"#N/A"}},{"$f":"VLOOKUP($A20,Finales!$BF$6:$BS$10,13,FALSE)","v":{"$error":"#N/A"}},{"$f":"VLOOKUP($A20,Finales!$BF$6:$BS$10,14,FALSE)","v":{"$error":"#N/A"}}]